beam-builds mailing list archives

Site index · List index
Message view « Date » · « Thread »
Top « Date » · « Thread »
From Apache Jenkins Server <jenk...@builds.apache.org>
Subject Build failed in Jenkins: beam_PostCommit_XVR_Direct #798
Date Tue, 26 Jan 2021 06:19:40 GMT
See <https://ci-beam.apache.org/job/beam_PostCommit_XVR_Direct/798/display/redirect?page=changes>

Changes:

[zyichi] [BEAM-10112] Add more state and timer python examples to website

[ajamato] Add capabilities for the HarnessMonitoringInfosRequest/Response and set

[zyichi] Address comments

[zyichi] Render py

[noreply] Merge pull request #12647 from [BEAM-10378] Deserializing Azure

[Pablo Estrada] Revert "Merge pull request #12647 from [BEAM-10378] Deserializing Azure

[noreply] Changing random to seconds since epoch to prevent BQ job name colliss…

[noreply] Merge pull request #13792 from Metric updates for FhirIO: Fix metrics +


------------------------------------------
[...truncated 74.69 KB...]
github.com/golang/protobuf,https://github.com/golang/protobuf/blob/master/LICENSE,BSD-3-Clause
google.golang.org/protobuf,https://go.googlesource.com/protobuf/+/refs/heads/master/LICENSE,BSD-3-Clause
google.golang.org/genproto/googleapis/rpc/status,https://github.com/googleapis/go-genproto/blob/master/LICENSE,Apache-2.0
github.com/nightlyone/lockfile,https://github.com/nightlyone/lockfile/blob/master/LICENSE,MIT
+ chmod -R a+w /output/licenses

> Task :sdks:python:sdist
RefactoringTool: Refactored <https://ci-beam.apache.org/job/beam_PostCommit_XVR_Direct/ws/src/sdks/python/apache_beam/portability/api/beam_job_api_pb2_grpc.py>
RefactoringTool: Refactored <https://ci-beam.apache.org/job/beam_PostCommit_XVR_Direct/ws/src/sdks/python/apache_beam/portability/api/beam_provision_api_pb2.py>
RefactoringTool: Refactored <https://ci-beam.apache.org/job/beam_PostCommit_XVR_Direct/ws/src/sdks/python/apache_beam/portability/api/beam_provision_api_pb2_grpc.py>
RefactoringTool: Refactored <https://ci-beam.apache.org/job/beam_PostCommit_XVR_Direct/ws/src/sdks/python/apache_beam/portability/api/beam_runner_api_pb2.py>
RefactoringTool: Refactored <https://ci-beam.apache.org/job/beam_PostCommit_XVR_Direct/ws/src/sdks/python/apache_beam/portability/api/beam_runner_api_pb2_grpc.py>
RefactoringTool: No changes to <https://ci-beam.apache.org/job/beam_PostCommit_XVR_Direct/ws/src/sdks/python/apache_beam/portability/api/endpoints_pb2.py>
RefactoringTool: Refactored <https://ci-beam.apache.org/job/beam_PostCommit_XVR_Direct/ws/src/sdks/python/apache_beam/portability/api/external_transforms_pb2.py>
RefactoringTool: Refactored <https://ci-beam.apache.org/job/beam_PostCommit_XVR_Direct/ws/src/sdks/python/apache_beam/portability/api/metrics_pb2.py>
RefactoringTool: No changes to <https://ci-beam.apache.org/job/beam_PostCommit_XVR_Direct/ws/src/sdks/python/apache_beam/portability/api/schema_pb2.py>
RefactoringTool: Refactored <https://ci-beam.apache.org/job/beam_PostCommit_XVR_Direct/ws/src/sdks/python/apache_beam/portability/api/standard_window_fns_pb2.py>
RefactoringTool: Files that were modified:
RefactoringTool: <https://ci-beam.apache.org/job/beam_PostCommit_XVR_Direct/ws/src/sdks/python/apache_beam/portability/api/beam_artifact_api_pb2.py>
RefactoringTool: <https://ci-beam.apache.org/job/beam_PostCommit_XVR_Direct/ws/src/sdks/python/apache_beam/portability/api/beam_artifact_api_pb2_grpc.py>
RefactoringTool: <https://ci-beam.apache.org/job/beam_PostCommit_XVR_Direct/ws/src/sdks/python/apache_beam/portability/api/beam_expansion_api_pb2.py>
RefactoringTool: <https://ci-beam.apache.org/job/beam_PostCommit_XVR_Direct/ws/src/sdks/python/apache_beam/portability/api/beam_expansion_api_pb2_grpc.py>
RefactoringTool: <https://ci-beam.apache.org/job/beam_PostCommit_XVR_Direct/ws/src/sdks/python/apache_beam/portability/api/beam_fn_api_pb2.py>
RefactoringTool: <https://ci-beam.apache.org/job/beam_PostCommit_XVR_Direct/ws/src/sdks/python/apache_beam/portability/api/beam_fn_api_pb2_grpc.py>
RefactoringTool: <https://ci-beam.apache.org/job/beam_PostCommit_XVR_Direct/ws/src/sdks/python/apache_beam/portability/api/beam_interactive_api_pb2.py>
RefactoringTool: <https://ci-beam.apache.org/job/beam_PostCommit_XVR_Direct/ws/src/sdks/python/apache_beam/portability/api/beam_job_api_pb2.py>
RefactoringTool: <https://ci-beam.apache.org/job/beam_PostCommit_XVR_Direct/ws/src/sdks/python/apache_beam/portability/api/beam_job_api_pb2_grpc.py>
RefactoringTool: <https://ci-beam.apache.org/job/beam_PostCommit_XVR_Direct/ws/src/sdks/python/apache_beam/portability/api/beam_provision_api_pb2.py>
RefactoringTool: <https://ci-beam.apache.org/job/beam_PostCommit_XVR_Direct/ws/src/sdks/python/apache_beam/portability/api/beam_provision_api_pb2_grpc.py>
RefactoringTool: <https://ci-beam.apache.org/job/beam_PostCommit_XVR_Direct/ws/src/sdks/python/apache_beam/portability/api/beam_runner_api_pb2.py>
RefactoringTool: <https://ci-beam.apache.org/job/beam_PostCommit_XVR_Direct/ws/src/sdks/python/apache_beam/portability/api/beam_runner_api_pb2_grpc.py>
RefactoringTool: <https://ci-beam.apache.org/job/beam_PostCommit_XVR_Direct/ws/src/sdks/python/apache_beam/portability/api/endpoints_pb2.py>
RefactoringTool: <https://ci-beam.apache.org/job/beam_PostCommit_XVR_Direct/ws/src/sdks/python/apache_beam/portability/api/external_transforms_pb2.py>
RefactoringTool: <https://ci-beam.apache.org/job/beam_PostCommit_XVR_Direct/ws/src/sdks/python/apache_beam/portability/api/metrics_pb2.py>
RefactoringTool: <https://ci-beam.apache.org/job/beam_PostCommit_XVR_Direct/ws/src/sdks/python/apache_beam/portability/api/schema_pb2.py>
RefactoringTool: <https://ci-beam.apache.org/job/beam_PostCommit_XVR_Direct/ws/src/sdks/python/apache_beam/portability/api/standard_window_fns_pb2.py>
INFO:gen_protos:Writing urn stubs: <https://ci-beam.apache.org/job/beam_PostCommit_XVR_Direct/ws/src/sdks/python/apache_beam/portability/api/metrics_pb2_urns.py>
INFO:gen_protos:Writing urn stubs: <https://ci-beam.apache.org/job/beam_PostCommit_XVR_Direct/ws/src/sdks/python/apache_beam/portability/api/beam_artifact_api_pb2_urns.py>
INFO:gen_protos:Writing urn stubs: <https://ci-beam.apache.org/job/beam_PostCommit_XVR_Direct/ws/src/sdks/python/apache_beam/portability/api/standard_window_fns_pb2_urns.py>
INFO:gen_protos:Writing urn stubs: <https://ci-beam.apache.org/job/beam_PostCommit_XVR_Direct/ws/src/sdks/python/apache_beam/portability/api/beam_runner_api_pb2_urns.py>
warning: no files found matching 'README.md'
warning: no files found matching 'NOTICE'
warning: no files found matching 'LICENSE'
warning: sdist: standard file not found: should have one of README, README.rst, README.txt,
README.md


> Task :sdks:python:container:py36:copyDockerfileDependencies
> Task :release:go-licenses:py:createLicenses
> Task :sdks:python:container:py36:copyGolangLicenses

> Task :sdks:python:installGcpTest
Processing ./build/apache-beam.tar.gz

> Task :sdks:java:io:parquet:classes
> Task :sdks:java:io:parquet:jar

> Task :sdks:java:core:compileTestJava
Note: Some input files use or override a deprecated API.
Note: Recompile with -Xlint:deprecation for details.
Note: Some input files use unchecked or unsafe operations.
Note: Recompile with -Xlint:unchecked for details.

> Task :sdks:java:core:testClasses
> Task :sdks:java:core:shadowTestJar FROM-CACHE

> Task :sdks:go:resolveBuildDependencies
Resolving golang.org/x/text: commit='23ae387dee1f90d29a23c0e87ee0b46038fbed0e', urls=[https://go.googlesource.com/text]
Resolving cached github.com/etcd-io/etcd: commit='11214aa33bf5a47d3d9d8dafe0f6b97237dfe921',
urls=[https://github.com/etcd-io/etcd.git, git@github.com:etcd-io/etcd.git]

> Task :runners:core-construction-java:compileTestJava

> Task :sdks:java:harness:compileJava
Note: Some input files use or override a deprecated API.
Note: Recompile with -Xlint:deprecation for details.
Note: Some input files use unchecked or unsafe operations.
Note: Recompile with -Xlint:unchecked for details.

> Task :sdks:java:harness:classes
> Task :sdks:java:harness:jar

> Task :sdks:python:test-suites:direct:xlang:fnApiJobServerSetup FAILED
sh: 1: .: Can't open <https://ci-beam.apache.org/job/beam_PostCommit_XVR_Direct/ws/src/build/gradleenv/-1278429404/bin/activate>

> Task :sdks:java:harness:shadowJar
> Task :runners:java-fn-execution:compileJava FROM-CACHE
> Task :runners:java-fn-execution:classes UP-TO-DATE
> Task :runners:java-fn-execution:jar
> Task :sdks:java:expansion-service:compileJava FROM-CACHE
> Task :sdks:java:expansion-service:classes UP-TO-DATE
> Task :sdks:java:expansion-service:jar
> Task :runners:direct-java:compileJava FROM-CACHE
> Task :runners:direct-java:classes UP-TO-DATE
> Task :sdks:java:io:kafka:compileJava FROM-CACHE
> Task :sdks:java:io:kafka:classes UP-TO-DATE
> Task :runners:direct-java:shadowJar FROM-CACHE
> Task :sdks:java:io:kafka:jar
> Task :sdks:java:container:java8:copyDockerfileDependencies

> Task :sdks:java:testing:expansion-service:compileTestJava
Note: <https://ci-beam.apache.org/job/beam_PostCommit_XVR_Direct/ws/src/sdks/java/testing/expansion-service/src/test/java/org/apache/beam/sdk/testing/expansion/TestExpansionService.java>
uses or overrides a deprecated API.
Note: Recompile with -Xlint:deprecation for details.
Note: <https://ci-beam.apache.org/job/beam_PostCommit_XVR_Direct/ws/src/sdks/java/testing/expansion-service/src/test/java/org/apache/beam/sdk/testing/expansion/TestExpansionService.java>
uses unchecked or unsafe operations.
Note: Recompile with -Xlint:unchecked for details.

> Task :sdks:java:testing:expansion-service:testClasses
> Task :runners:java-job-service:compileJava
> Task :sdks:java:io:google-cloud-platform:compileJava

> Task :runners:java-job-service:compileJava
Note: <https://ci-beam.apache.org/job/beam_PostCommit_XVR_Direct/ws/src/runners/java-job-service/src/main/java/org/apache/beam/runners/jobsubmission/PortablePipelineJarCreator.java>
uses unchecked or unsafe operations.
Note: Recompile with -Xlint:unchecked for details.

> Task :runners:java-job-service:classes
> Task :runners:java-job-service:jar

> Task :runners:core-construction-java:compileTestJava
Note: Some input files use or override a deprecated API.
Note: Recompile with -Xlint:deprecation for details.
Note: Some input files use unchecked or unsafe operations.
Note: Recompile with -Xlint:unchecked for details.

> Task :sdks:java:testing:expansion-service:buildTestExpansionServiceJar
> Task :runners:core-construction-java:testClasses
> Task :runners:core-construction-java:testJar
> Task :runners:portability:java:compileJava
> Task :runners:portability:java:classes

> Task :runners:portability:java:compileTestJava
Note: <https://ci-beam.apache.org/job/beam_PostCommit_XVR_Direct/ws/src/runners/portability/java/src/test/java/org/apache/beam/runners/portability/CloseableResourceTest.java>
uses or overrides a deprecated API.
Note: Recompile with -Xlint:deprecation for details.

> Task :runners:portability:java:testClasses

> Task :sdks:go:resolveBuildDependencies
Resolving google.golang.org/api: commit='0324d5e90dc7753607860272666845fad9ceb97e', urls=[https://code.googlesource.com/google-api-go-client]

> Task :sdks:java:io:google-cloud-platform:compileJava
Note: Some input files use or override a deprecated API.
Note: Recompile with -Xlint:deprecation for details.
Note: Some input files use unchecked or unsafe operations.
Note: Recompile with -Xlint:unchecked for details.

> Task :sdks:java:io:google-cloud-platform:classes
> Task :sdks:java:io:google-cloud-platform:jar
> Task :sdks:java:extensions:sql:extractIncludeProto
> Task :sdks:java:extensions:sql:generateProto NO-SOURCE

> Task :sdks:go:resolveBuildDependencies
Resolving google.golang.org/genproto: commit='4d944d34d83c502a5f761500a14d8842648415c3', urls=[https://github.com/google/go-genproto]

> Task :sdks:java:extensions:sql:compileJava

> Task :sdks:go:resolveBuildDependencies
Resolving google.golang.org/grpc: commit='5e8f83304c0563d1ba74db05fee83d9c18ab9a58', urls=[https://github.com/grpc/grpc-go]
Resolving google.golang.org/protobuf: commit='d165be301fb1e13390ad453281ded24385fd8ebc', urls=[https://go.googlesource.com/protobuf]
Resolving cached github.com/etcd-io/etcd: commit='11214aa33bf5a47d3d9d8dafe0f6b97237dfe921',
urls=[https://github.com/etcd-io/etcd.git, git@github.com:etcd-io/etcd.git]
Resolving cached github.com/etcd-io/etcd: commit='11214aa33bf5a47d3d9d8dafe0f6b97237dfe921',
urls=[https://github.com/etcd-io/etcd.git, git@github.com:etcd-io/etcd.git]

> Task :sdks:go:installDependencies

> Task :sdks:java:extensions:sql:compileJava
Note: Some input files use or override a deprecated API.
Note: Recompile with -Xlint:deprecation for details.
Note: Some input files use unchecked or unsafe operations.
Note: Recompile with -Xlint:unchecked for details.
Unable to watch the file system for changes. The inotify watches limit is too low.

> Task :sdks:java:extensions:sql:classes
> Task :sdks:java:extensions:sql:jar
> Task :sdks:java:extensions:sql:zetasql:compileJava
Note: Some input files use or override a deprecated API.
Note: Recompile with -Xlint:deprecation for details.
Note: Some input files use unchecked or unsafe operations.
Note: Recompile with -Xlint:unchecked for details.

> Task :sdks:java:extensions:sql:zetasql:classes
> Task :sdks:java:extensions:sql:zetasql:jar

> Task :sdks:java:extensions:sql:expansion-service:compileJava
Note: <https://ci-beam.apache.org/job/beam_PostCommit_XVR_Direct/ws/src/sdks/java/extensions/sql/expansion-service/src/main/java/org/apache/beam/sdk/extensions/sql/expansion/ExternalSqlTransformRegistrar.java>
uses or overrides a deprecated API.
Note: Recompile with -Xlint:deprecation for details.

> Task :sdks:java:extensions:sql:expansion-service:classes
> Task :sdks:java:extensions:sql:expansion-service:shadowJar
> Task :sdks:go:buildLinuxAmd64
> Task :sdks:go:goBuild

> Task :sdks:java:container:resolveBuildDependencies
Resolving ./github.com/apache/beam/sdks/go@<https://ci-beam.apache.org/job/beam_PostCommit_XVR_Direct/ws/src/sdks/go>

> Task :sdks:python:container:resolveBuildDependencies
Resolving ./github.com/apache/beam/sdks/go@<https://ci-beam.apache.org/job/beam_PostCommit_XVR_Direct/ws/src/sdks/go>

> Task :sdks:java:container:installDependencies
> Task :sdks:python:container:installDependencies
> Task :sdks:java:container:buildLinuxAmd64
> Task :sdks:java:container:goBuild
> Task :sdks:python:container:buildDarwinAmd64
> Task :sdks:java:container:java8:copySdkHarnessLauncher
> Task :sdks:java:container:java8:dockerPrepare
> Task :sdks:python:container:buildLinuxAmd64
> Task :sdks:python:container:goBuild
> Task :sdks:python:container:py36:copyLauncherDependencies
> Task :sdks:python:container:py36:dockerPrepare
> Task :sdks:java:container:java8:docker
> Task :sdks:python:container:py36:docker
> Task :sdks:python:test-suites:direct:xlang:validatesCrossLanguageRunnerSetup
> Task :sdks:python:test-suites:direct:xlang:validatesCrossLanguageRunnerCleanup

> Task :sdks:python:test-suites:direct:xlang:fnApiJobServerCleanup FAILED
sh: 1: .: Can't open <https://ci-beam.apache.org/job/beam_PostCommit_XVR_Direct/ws/src/build/gradleenv/-1278429404/bin/activate>

FAILURE: Build completed with 2 failures.

1: Task failed with an exception.
-----------
* What went wrong:
Execution failed for task ':sdks:python:test-suites:direct:xlang:fnApiJobServerSetup'.
> Process 'command 'sh'' finished with non-zero exit value 2

* Try:
Run with --stacktrace option to get the stack trace. Run with --info or --debug option to
get more log output. Run with --scan to get full insights.
==============================================================================

2: Task failed with an exception.
-----------
* What went wrong:
Execution failed for task ':sdks:python:test-suites:direct:xlang:fnApiJobServerCleanup'.
> Process 'command 'sh'' finished with non-zero exit value 2

* Try:
Run with --stacktrace option to get the stack trace. Run with --info or --debug option to
get more log output. Run with --scan to get full insights.
==============================================================================

* Get more help at https://help.gradle.org

Deprecated Gradle features were used in this build, making it incompatible with Gradle 7.0.
Use '--warning-mode all' to show the individual deprecation warnings.
See https://docs.gradle.org/6.8/userguide/command_line_interface.html#sec:command_line_warnings

BUILD FAILED in 19m 14s
169 actionable tasks: 138 executed, 27 from cache, 4 up-to-date
Gradle was unable to watch the file system for changes. The inotify watches limit is too low.

Publishing build scan...
https://gradle.com/s/i4t2fkjvezawc

Build step 'Invoke Gradle script' changed build result to FAILURE
Build step 'Invoke Gradle script' marked build as failure

---------------------------------------------------------------------
To unsubscribe, e-mail: builds-unsubscribe@beam.apache.org
For additional commands, e-mail: builds-help@beam.apache.org


Mime
View raw message