beam-builds mailing list archives

Site index · List index
Message view « Date » · « Thread »
Top « Date » · « Thread »
From Apache Jenkins Server <jenk...@builds.apache.org>
Subject Build failed in Jenkins: beam_PostCommit_Py_VR_Dataflow #7415
Date Thu, 07 Jan 2021 07:10:35 GMT
See <https://ci-beam.apache.org/job/beam_PostCommit_Py_VR_Dataflow/7415/display/redirect?page=changes>

Changes:

[Pablo Estrada] [BEAM-11569] Fixing cancel workflows

[noreply] [BEAM-11415] Add Dataflow Runner to new Go ValidatesRunner framework.


------------------------------------------
[...truncated 17.55 MB...]
Worker logs: https://console.cloud.google.com/dataflow/jobs/us-central1/2021-01-06_22_48_19-14009538173280894545?project=apache-beam-testing
Worker logs: https://console.cloud.google.com/dataflow/jobs/us-central1/2021-01-06_22_39_20-841162344629533279?project=apache-beam-testing
Worker logs: https://console.cloud.google.com/dataflow/jobs/us-central1/2021-01-06_22_46_26-3214773633023080557?project=apache-beam-testing
Worker logs: https://console.cloud.google.com/dataflow/jobs/us-central1/2021-01-06_22_53_26-1832559795141903403?project=apache-beam-testing

======================================================================
ERROR: test_par_do_with_multiple_outputs_and_using_yield (apache_beam.transforms.ptransform_test.PTransformTest)
----------------------------------------------------------------------
Traceback (most recent call last):
  File "<https://ci-beam.apache.org/job/beam_PostCommit_Py_VR_Dataflow/ws/src/sdks/python/apache_beam/transforms/ptransform_test.py",>
line 243, in test_par_do_with_multiple_outputs_and_using_yield
    assert_that(results.even, equal_to([2, 4]), label='assert:even')
  File "<https://ci-beam.apache.org/job/beam_PostCommit_Py_VR_Dataflow/ws/src/sdks/python/apache_beam/pipeline.py",>
line 582, in __exit__
    self.result = self.run()
  File "<https://ci-beam.apache.org/job/beam_PostCommit_Py_VR_Dataflow/ws/src/sdks/python/apache_beam/testing/test_pipeline.py",>
line 112, in run
    False if self.not_use_test_runner_api else test_runner_api))
  File "<https://ci-beam.apache.org/job/beam_PostCommit_Py_VR_Dataflow/ws/src/sdks/python/apache_beam/pipeline.py",>
line 532, in run
    self._options).run(False)
  File "<https://ci-beam.apache.org/job/beam_PostCommit_Py_VR_Dataflow/ws/src/sdks/python/apache_beam/pipeline.py",>
line 561, in run
    return self.runner.run_pipeline(self, self._options)
  File "<https://ci-beam.apache.org/job/beam_PostCommit_Py_VR_Dataflow/ws/src/sdks/python/apache_beam/runners/dataflow/test_dataflow_runner.py",>
line 57, in run_pipeline
    self).run_pipeline(pipeline, options)
  File "<https://ci-beam.apache.org/job/beam_PostCommit_Py_VR_Dataflow/ws/src/sdks/python/apache_beam/runners/dataflow/dataflow_runner.py",>
line 504, in run_pipeline
    artifacts=environments.python_sdk_dependencies(options)))
  File "<https://ci-beam.apache.org/job/beam_PostCommit_Py_VR_Dataflow/ws/src/sdks/python/apache_beam/transforms/environments.py",>
line 741, in python_sdk_dependencies
    skip_prestaged_dependencies=skip_prestaged_dependencies))
  File "<https://ci-beam.apache.org/job/beam_PostCommit_Py_VR_Dataflow/ws/src/sdks/python/apache_beam/runners/portability/stager.py",>
line 179, in create_job_resources
    setup_options.requirements_file, requirements_cache_path)
  File "<https://ci-beam.apache.org/job/beam_PostCommit_Py_VR_Dataflow/ws/src/sdks/python/apache_beam/utils/retry.py",>
line 260, in wrapper
    return fun(*args, **kwargs)
  File "<https://ci-beam.apache.org/job/beam_PostCommit_Py_VR_Dataflow/ws/src/sdks/python/apache_beam/runners/portability/stager.py",>
line 569, in _populate_requirements_cache
    processes.check_output(cmd_args, stderr=processes.STDOUT)
  File "<https://ci-beam.apache.org/job/beam_PostCommit_Py_VR_Dataflow/ws/src/sdks/python/apache_beam/utils/processes.py",>
line 99, in check_output
    .format(traceback.format_exc(), args[0][6], error.output))
RuntimeError: Full traceback: Traceback (most recent call last):
  File "<https://ci-beam.apache.org/job/beam_PostCommit_Py_VR_Dataflow/ws/src/sdks/python/apache_beam/utils/processes.py",>
line 91, in check_output
    out = subprocess.check_output(*args, **kwargs)
  File "/usr/lib/python3.7/subprocess.py", line 395, in check_output
    **kwargs).stdout
  File "/usr/lib/python3.7/subprocess.py", line 487, in run
    output=stdout, stderr=stderr)
subprocess.CalledProcessError: Command '['<https://ci-beam.apache.org/job/beam_PostCommit_Py_VR_Dataflow/ws/src/build/gradleenv/-1734967052/bin/python',>
'-m', 'pip', 'download', '--dest', '/tmp/dataflow-requirements-cache', '-r', 'postcommit_requirements.txt',
'--exists-action', 'i', '--no-binary', ':all:']' returned non-zero exit status 1.
 
 Pip install failed for package: -r           
 Output from execution of subprocess: b'Collecting mock<3.0.0\n  File was already downloaded
/tmp/dataflow-requirements-cache/mock-2.0.0.tar.gz\nCollecting parameterized<0.8.0,>=0.7.1\n
 File was already downloaded /tmp/dataflow-requirements-cache/parameterized-0.7.5.tar.gz\nCollecting
pyhamcrest!=1.10.0,<2.0.0\n  File was already downloaded /tmp/dataflow-requirements-cache/PyHamcrest-1.10.1.tar.gz\nCollecting
pbr>=0.11\n  File was already downloaded /tmp/dataflow-requirements-cache/pbr-5.5.1.tar.gz\n
   ERROR: Command errored out with exit status 1:\n     command: <https://ci-beam.apache.org/job/beam_PostCommit_Py_VR_Dataflow/ws/src/build/gradleenv/-1734967052/bin/python>
-c \'import sys, setuptools, tokenize; sys.argv[0] = \'"\'"\'/tmp/pip-download-u04d93m0/pbr_ead347970aec476c81da948bc5d59a45/setup.py\'"\'"\';
__file__=\'"\'"\'/tmp/pip-download-u04d93m0/pbr_ead347970aec476c81da948bc5d59a45/setup.py\'"\'"\';f=getattr(tokenize,
\'"\'"\'open\'"\'"\', open)(__file__);code=f.read().replace(\'"\'"\'\\r\\n\'"\'"\', \'"\'"\'\\n\'"\'"\');f.close();exec(compile(code,
__file__, \'"\'"\'exec\'"\'"\'))\' egg_info --egg-base /tmp/pip-pip-egg-info-gni880uv\n  
      cwd: /tmp/pip-download-u04d93m0/pbr_ead347970aec476c81da948bc5d59a45/\n    Complete
output (5 lines):\n    Traceback (most recent call last):\n      File "<string>", line
1, in <module>\n      File "<https://ci-beam.apache.org/job/beam_PostCommit_Py_VR_Dataflow/ws/src/build/gradleenv/-1734967052/lib/python3.7/tokenize.py",>
line 447, in open\n        buffer = _builtin_open(filename, \'rb\')\n    FileNotFoundError:
[Errno 2] No such file or directory: \'/tmp/pip-download-u04d93m0/pbr_ead347970aec476c81da948bc5d59a45/setup.py\'\n
   ----------------------------------------\nERROR: Command errored out with exit status 1:
python setup.py egg_info Check the logs for full command output.\n'
-------------------- >> begin captured logging << --------------------
root: DEBUG: Unhandled type_constraint: Union[]
root: DEBUG: Unhandled type_constraint: Union[]
root: DEBUG: Unhandled type_constraint: Union[]
root: DEBUG: Unhandled type_constraint: Union[]
root: DEBUG: Unhandled type_constraint: Union[]
root: DEBUG: Unhandled type_constraint: Union[]
root: DEBUG: Unhandled type_constraint: Union[]
root: DEBUG: Unhandled type_constraint: Union[]
root: DEBUG: Unhandled type_constraint: Union[]
root: DEBUG: Unhandled type_constraint: Union[]
root: DEBUG: Unhandled type_constraint: Union[]
root: DEBUG: Unhandled type_constraint: Union[]
apache_beam.runners.portability.stager: INFO: Executing command: ['<https://ci-beam.apache.org/job/beam_PostCommit_Py_VR_Dataflow/ws/src/build/gradleenv/-1734967052/bin/python',>
'-m', 'pip', 'download', '--dest', '/tmp/dataflow-requirements-cache', '-r', 'postcommit_requirements.txt',
'--exists-action', 'i', '--no-binary', ':all:']
--------------------- >> end captured logging << ---------------------

----------------------------------------------------------------------
XML: nosetests-validatesRunnerStreamingTests-df-py37.xml
----------------------------------------------------------------------
XML: <https://ci-beam.apache.org/job/beam_PostCommit_Py_VR_Dataflow/ws/src/sdks/python/nosetests.xml>
----------------------------------------------------------------------
Ran 30 tests in 1712.203s

FAILED (SKIP=3, errors=2)

> Task :sdks:python:test-suites:dataflow:py37:validatesRunnerStreamingTests FAILED

> Task :sdks:python:test-suites:dataflow:py36:validatesRunnerStreamingTests
INFO:apache_beam.runners.dataflow.dataflow_runner:2021-01-07T07:08:02.120Z: JOB_MESSAGE_BASIC:
Finished operation Create/MaybeReshuffle/Reshuffle/ReshufflePerKey/GroupByKey/ReadStream+Create/MaybeReshuffle/Reshuffle/ReshufflePerKey/GroupByKey/MergeBuckets+Create/MaybeReshuffle/Reshuffle/ReshufflePerKey/FlatMap(restore_timestamps)+Create/MaybeReshuffle/Reshuffle/RemoveRandomKeys+Create/Map(decode)+Key
param+assert_that/WindowInto(WindowIntoFn)+assert_that/ToVoidKey+assert_that/Group/pair_with_1+assert_that/Group/GroupByKey/WriteStream
INFO:apache_beam.runners.dataflow.dataflow_runner:2021-01-07T07:08:02.120Z: JOB_MESSAGE_BASIC:
Finished operation Create/Impulse+Create/FlatMap(<lambda at core.py:2957>)+Create/MaybeReshuffle/Reshuffle/AddRandomKeys+Create/MaybeReshuffle/Reshuffle/ReshufflePerKey/Map(reify_timestamps)+Create/MaybeReshuffle/Reshuffle/ReshufflePerKey/GroupByKey/WriteStream
INFO:apache_beam.runners.dataflow.dataflow_runner:2021-01-07T07:08:02.120Z: JOB_MESSAGE_BASIC:
Finished operation assert_that/Group/GroupByKey/ReadStream+assert_that/Group/GroupByKey/MergeBuckets+assert_that/Group/Map(_merge_tagged_vals_under_key)+assert_that/Unkey+assert_that/Match
INFO:apache_beam.runners.dataflow.dataflow_runner:2021-01-07T07:08:02.120Z: JOB_MESSAGE_BASIC:
Finished operation assert_that/Create/Impulse+assert_that/Create/FlatMap(<lambda at core.py:2957>)+assert_that/Create/Map(decode)+assert_that/Group/pair_with_0+assert_that/Group/GroupByKey/WriteStream
INFO:apache_beam.runners.dataflow.dataflow_runner:2021-01-07T07:08:02.220Z: JOB_MESSAGE_DETAILED:
Cleaning up.
INFO:apache_beam.runners.dataflow.dataflow_runner:2021-01-07T07:08:02.250Z: JOB_MESSAGE_BASIC:
Worker pool stopped.
INFO:apache_beam.runners.dataflow.dataflow_runner:2021-01-07T07:08:02.256Z: JOB_MESSAGE_DEBUG:
Tearing down pending resources...
INFO:apache_beam.runners.dataflow.dataflow_runner:2021-01-07T07:08:02.258Z: JOB_MESSAGE_DEBUG:
Starting worker pool teardown.
INFO:apache_beam.runners.dataflow.dataflow_runner:2021-01-07T07:08:02.265Z: JOB_MESSAGE_BASIC:
Stopping worker pool...
INFO:apache_beam.runners.dataflow.dataflow_runner:2021-01-07T07:08:51.393Z: JOB_MESSAGE_BASIC:
Worker pool stopped.
INFO:apache_beam.runners.dataflow.dataflow_runner:Job 2021-01-06_23_01_49-42174595888389978
is in state JOB_STATE_DONE
Worker logs: https://console.cloud.google.com/dataflow/jobs/us-central1/2021-01-06_22_39_54-9795785990063378760?project=apache-beam-testing
Worker logs: https://console.cloud.google.com/dataflow/jobs/us-central1/2021-01-06_22_47_15-3251259170641139848?project=apache-beam-testing
Worker logs: https://console.cloud.google.com/dataflow/jobs/us-central1/2021-01-06_22_54_41-16047920814037476286?project=apache-beam-testing
Worker logs: https://console.cloud.google.com/dataflow/jobs/us-central1/2021-01-06_22_39_55-5706012093778560915?project=apache-beam-testing
Worker logs: https://console.cloud.google.com/dataflow/jobs/us-central1/2021-01-06_22_48_12-2673034580797064936?project=apache-beam-testing
Worker logs: https://console.cloud.google.com/dataflow/jobs/us-central1/2021-01-06_22_39_54-1832364686675035586?project=apache-beam-testing
Worker logs: https://console.cloud.google.com/dataflow/jobs/us-central1/2021-01-06_22_47_15-6898637199251291707?project=apache-beam-testing
Worker logs: https://console.cloud.google.com/dataflow/jobs/us-central1/2021-01-06_22_54_37-9539421008223016197?project=apache-beam-testing
Worker logs: https://console.cloud.google.com/dataflow/jobs/us-central1/2021-01-06_22_39_55-12793596801682493896?project=apache-beam-testing
Worker logs: https://console.cloud.google.com/dataflow/jobs/us-central1/2021-01-06_22_47_11-14718658346356671557?project=apache-beam-testing
Worker logs: https://console.cloud.google.com/dataflow/jobs/us-central1/2021-01-06_22_54_22-10600932750354794399?project=apache-beam-testing
Worker logs: https://console.cloud.google.com/dataflow/jobs/us-central1/2021-01-06_22_39_55-251364366210629239?project=apache-beam-testing
Worker logs: https://console.cloud.google.com/dataflow/jobs/us-central1/2021-01-06_22_46_56-2850792404984956430?project=apache-beam-testing
Worker logs: https://console.cloud.google.com/dataflow/jobs/us-central1/2021-01-06_22_54_37-10026841111855243936?project=apache-beam-testing
Worker logs: https://console.cloud.google.com/dataflow/jobs/us-central1/2021-01-06_22_39_55-14855127924411003613?project=apache-beam-testing
Worker logs: https://console.cloud.google.com/dataflow/jobs/us-central1/2021-01-06_22_47_02-3573198368766978530?project=apache-beam-testing
Worker logs: https://console.cloud.google.com/dataflow/jobs/us-central1/2021-01-06_22_53_57-18440767596050874220?project=apache-beam-testing
Worker logs: https://console.cloud.google.com/dataflow/jobs/us-central1/2021-01-06_22_39_53-6024350950840012211?project=apache-beam-testing
Worker logs: https://console.cloud.google.com/dataflow/jobs/us-central1/2021-01-06_22_47_18-10515036382817883939?project=apache-beam-testing
Worker logs: https://console.cloud.google.com/dataflow/jobs/us-central1/2021-01-06_22_54_43-3138357186750555519?project=apache-beam-testing
Worker logs: https://console.cloud.google.com/dataflow/jobs/us-central1/2021-01-06_23_01_49-42174595888389978?project=apache-beam-testing
Worker logs: https://console.cloud.google.com/dataflow/jobs/us-central1/2021-01-06_22_39_54-11258654248600809425?project=apache-beam-testing
Worker logs: https://console.cloud.google.com/dataflow/jobs/us-central1/2021-01-06_22_47_10-14532647528653259341?project=apache-beam-testing
Worker logs: https://console.cloud.google.com/dataflow/jobs/us-central1/2021-01-06_22_54_16-15507317802848734668?project=apache-beam-testing
test_combine (apache_beam.transforms.combinefn_lifecycle_test.CombineFnLifecycleTest) ...
SKIP: CombineFn.setup and CombineFn.teardown are not supported. Please use Dataflow Runner
V2.
test_combining_value_state (apache_beam.transforms.combinefn_lifecycle_test.CombineFnLifecycleTest)
... SKIP: CombineFn.setup and CombineFn.teardown are not supported. Please use Dataflow Runner
V2.
test_non_liftable_combine (apache_beam.transforms.combinefn_lifecycle_test.CombineFnLifecycleTest)
... SKIP: CombineFn.setup and CombineFn.teardown are not supported. Please use Dataflow Runner
V2.
test_gbk_many_values (apache_beam.runners.portability.fn_api_runner.fn_runner_test.FnApiBasedStateBackedCoderTest)
... ok
Test TimestampCombiner with EARLIEST. ... ok
Test TimestampCombiner with LATEST. ... ok
test_impulse (apache_beam.transforms.ptransform_test.PTransformTest) ... ok
test_flatten_a_flattened_pcollection (apache_beam.transforms.ptransform_test.PTransformTest)
... ok
test_flatten_one_single_pcollection (apache_beam.transforms.ptransform_test.PTransformTest)
... ok
test_flatten_multiple_pcollections_having_multiple_consumers (apache_beam.transforms.ptransform_test.PTransformTest)
... ok
test_user_counter_using_pardo (apache_beam.metrics.metric_test.MetricsTest) ... ok
test_flatten_pcollections (apache_beam.transforms.ptransform_test.PTransformTest) ... ok
test_dofn_lifecycle (apache_beam.transforms.dofn_lifecycle_test.DoFnLifecycleTest) ... ok
Runs streaming Dataflow job and verifies that user metrics are reported ... ok
test_par_do_with_multiple_outputs_and_using_return (apache_beam.transforms.ptransform_test.PTransformTest)
... ok
test_par_do_with_multiple_outputs_and_using_yield (apache_beam.transforms.ptransform_test.PTransformTest)
... ok
test_undeclared_outputs (apache_beam.transforms.ptransform_test.PTransformTest) ... ok
test_as_list_and_as_dict_side_inputs (apache_beam.transforms.sideinputs_test.SideInputsTest)
... ok
test_multiple_empty_outputs (apache_beam.transforms.ptransform_test.PTransformTest) ... ok
test_as_dict_twice (apache_beam.transforms.sideinputs_test.SideInputsTest) ... ok
test_as_list_twice (apache_beam.transforms.sideinputs_test.SideInputsTest) ... ok
test_as_singleton_with_different_defaults (apache_beam.transforms.sideinputs_test.SideInputsTest)
... ok
test_as_singleton_without_unique_labels (apache_beam.transforms.sideinputs_test.SideInputsTest)
... ok
test_default_value_singleton_side_input (apache_beam.transforms.sideinputs_test.SideInputsTest)
... ok
test_empty_singleton_side_input (apache_beam.transforms.sideinputs_test.SideInputsTest) ...
ok
test_iterable_side_input (apache_beam.transforms.sideinputs_test.SideInputsTest) ... ok
test_reshuffle_preserves_timestamps (apache_beam.transforms.util_test.ReshuffleTest) ... ok
test_flattened_side_input (apache_beam.transforms.sideinputs_test.SideInputsTest) ... ok
test_element_param (apache_beam.pipeline_test.DoFnTest) ... ok
test_key_param (apache_beam.pipeline_test.DoFnTest) ... ok

----------------------------------------------------------------------
XML: nosetests-validatesRunnerStreamingTests-df-py36.xml
----------------------------------------------------------------------
XML: <https://ci-beam.apache.org/job/beam_PostCommit_Py_VR_Dataflow/ws/src/sdks/python/nosetests.xml>
----------------------------------------------------------------------
Ran 30 tests in 1765.499s

OK (SKIP=3)

> Task :sdks:python:test-suites:dataflow:py38:validatesRunnerStreamingTests
INFO:apache_beam.runners.dataflow.dataflow_runner:2021-01-07T07:09:30.015Z: JOB_MESSAGE_BASIC:
Finished operation Create/MaybeReshuffle/Reshuffle/ReshufflePerKey/GroupByKey/ReadStream+Create/MaybeReshuffle/Reshuffle/ReshufflePerKey/GroupByKey/MergeBuckets+Create/MaybeReshuffle/Reshuffle/ReshufflePerKey/FlatMap(restore_timestamps)+Create/MaybeReshuffle/Reshuffle/RemoveRandomKeys+Create/Map(decode)+Key
param+assert_that/WindowInto(WindowIntoFn)+assert_that/ToVoidKey+assert_that/Group/pair_with_1+assert_that/Group/GroupByKey/WriteStream
INFO:apache_beam.runners.dataflow.dataflow_runner:2021-01-07T07:09:30.015Z: JOB_MESSAGE_BASIC:
Finished operation Create/Impulse+Create/FlatMap(<lambda at core.py:2957>)+Create/MaybeReshuffle/Reshuffle/AddRandomKeys+Create/MaybeReshuffle/Reshuffle/ReshufflePerKey/Map(reify_timestamps)+Create/MaybeReshuffle/Reshuffle/ReshufflePerKey/GroupByKey/WriteStream
INFO:apache_beam.runners.dataflow.dataflow_runner:2021-01-07T07:09:30.015Z: JOB_MESSAGE_BASIC:
Finished operation assert_that/Group/GroupByKey/ReadStream+assert_that/Group/GroupByKey/MergeBuckets+assert_that/Group/Map(_merge_tagged_vals_under_key)+assert_that/Unkey+assert_that/Match
INFO:apache_beam.runners.dataflow.dataflow_runner:2021-01-07T07:09:30.015Z: JOB_MESSAGE_BASIC:
Finished operation assert_that/Create/Impulse+assert_that/Create/FlatMap(<lambda at core.py:2957>)+assert_that/Create/Map(decode)+assert_that/Group/pair_with_0+assert_that/Group/GroupByKey/WriteStream
INFO:apache_beam.runners.dataflow.dataflow_runner:2021-01-07T07:09:30.143Z: JOB_MESSAGE_DETAILED:
Cleaning up.
INFO:apache_beam.runners.dataflow.dataflow_runner:2021-01-07T07:09:30.166Z: JOB_MESSAGE_BASIC:
Worker pool stopped.
INFO:apache_beam.runners.dataflow.dataflow_runner:2021-01-07T07:09:30.170Z: JOB_MESSAGE_DEBUG:
Tearing down pending resources...
INFO:apache_beam.runners.dataflow.dataflow_runner:2021-01-07T07:09:30.172Z: JOB_MESSAGE_DEBUG:
Starting worker pool teardown.
INFO:apache_beam.runners.dataflow.dataflow_runner:2021-01-07T07:09:30.176Z: JOB_MESSAGE_BASIC:
Stopping worker pool...
INFO:apache_beam.runners.dataflow.dataflow_runner:2021-01-07T07:10:18.847Z: JOB_MESSAGE_BASIC:
Worker pool stopped.
INFO:apache_beam.runners.dataflow.dataflow_runner:Job 2021-01-06_23_03_24-10939777744796068797
is in state JOB_STATE_DONE
Worker logs: https://console.cloud.google.com/dataflow/jobs/us-central1/2021-01-06_22_40_47-12089562964603462996?project=apache-beam-testing
Worker logs: https://console.cloud.google.com/dataflow/jobs/us-central1/2021-01-06_22_47_59-8315355647613443046?project=apache-beam-testing
Worker logs: https://console.cloud.google.com/dataflow/jobs/us-central1/2021-01-06_22_55_24-347042619872739348?project=apache-beam-testing
Worker logs: https://console.cloud.google.com/dataflow/jobs/us-central1/2021-01-06_22_40_49-4816652429421554118?project=apache-beam-testing
Worker logs: https://console.cloud.google.com/dataflow/jobs/us-central1/2021-01-06_22_47_28-2337085584755265630?project=apache-beam-testing
Worker logs: https://console.cloud.google.com/dataflow/jobs/us-central1/2021-01-06_22_54_44-8461732673753684496?project=apache-beam-testing
Worker logs: https://console.cloud.google.com/dataflow/jobs/us-central1/2021-01-06_22_40_49-213743597011088406?project=apache-beam-testing
Worker logs: https://console.cloud.google.com/dataflow/jobs/us-central1/2021-01-06_22_48_16-14982967068624076172?project=apache-beam-testing
Worker logs: https://console.cloud.google.com/dataflow/jobs/us-central1/2021-01-06_22_55_26-9161046879232819106?project=apache-beam-testing
Worker logs: https://console.cloud.google.com/dataflow/jobs/us-central1/2021-01-06_22_40_48-15829422001722115134?project=apache-beam-testing
Worker logs: https://console.cloud.google.com/dataflow/jobs/us-central1/2021-01-06_22_47_59-5462748941330846856?project=apache-beam-testing
Worker logs: https://console.cloud.google.com/dataflow/jobs/us-central1/2021-01-06_22_55_06-8213179748826789974?project=apache-beam-testing
Worker logs: https://console.cloud.google.com/dataflow/jobs/us-central1/2021-01-06_22_40_48-11374176187936922134?project=apache-beam-testing
Worker logs: https://console.cloud.google.com/dataflow/jobs/us-central1/2021-01-06_22_48_06-3621757711996491715?project=apache-beam-testing
Worker logs: https://console.cloud.google.com/dataflow/jobs/us-central1/2021-01-06_22_56_03-11780799336445369376?project=apache-beam-testing
Worker logs: https://console.cloud.google.com/dataflow/jobs/us-central1/2021-01-06_22_40_48-7279449481099761893?project=apache-beam-testing
Worker logs: https://console.cloud.google.com/dataflow/jobs/us-central1/2021-01-06_22_48_52-1103703178165104371?project=apache-beam-testing
Worker logs: https://console.cloud.google.com/dataflow/jobs/us-central1/2021-01-06_22_40_49-9125716186672641442?project=apache-beam-testing
Worker logs: https://console.cloud.google.com/dataflow/jobs/us-central1/2021-01-06_22_48_20-1703969926023958657?project=apache-beam-testing
Worker logs: https://console.cloud.google.com/dataflow/jobs/us-central1/2021-01-06_22_55_55-14908211033721848171?project=apache-beam-testing
Worker logs: https://console.cloud.google.com/dataflow/jobs/us-central1/2021-01-06_22_40_47-15333329099455428981?project=apache-beam-testing
Worker logs: https://console.cloud.google.com/dataflow/jobs/us-central1/2021-01-06_22_48_24-16413223075323493863?project=apache-beam-testing
Worker logs: https://console.cloud.google.com/dataflow/jobs/us-central1/2021-01-06_22_56_04-6510336419255852204?project=apache-beam-testing
Worker logs: https://console.cloud.google.com/dataflow/jobs/us-central1/2021-01-06_23_03_24-10939777744796068797?project=apache-beam-testing
test_combine (apache_beam.transforms.combinefn_lifecycle_test.CombineFnLifecycleTest) ...
SKIP: CombineFn.setup and CombineFn.teardown are not supported. Please use Dataflow Runner
V2.
test_combining_value_state (apache_beam.transforms.combinefn_lifecycle_test.CombineFnLifecycleTest)
... SKIP: CombineFn.setup and CombineFn.teardown are not supported. Please use Dataflow Runner
V2.
test_non_liftable_combine (apache_beam.transforms.combinefn_lifecycle_test.CombineFnLifecycleTest)
... SKIP: CombineFn.setup and CombineFn.teardown are not supported. Please use Dataflow Runner
V2.
test_gbk_many_values (apache_beam.runners.portability.fn_api_runner.fn_runner_test.FnApiBasedStateBackedCoderTest)
... ok
Test TimestampCombiner with EARLIEST. ... ok
Test TimestampCombiner with LATEST. ... ok
Runs streaming Dataflow job and verifies that user metrics are reported ... ok
test_user_counter_using_pardo (apache_beam.metrics.metric_test.MetricsTest) ... ok
test_flatten_a_flattened_pcollection (apache_beam.transforms.ptransform_test.PTransformTest)
... ok
test_impulse (apache_beam.transforms.ptransform_test.PTransformTest) ... ok
test_flatten_pcollections (apache_beam.transforms.ptransform_test.PTransformTest) ... ok
test_flatten_multiple_pcollections_having_multiple_consumers (apache_beam.transforms.ptransform_test.PTransformTest)
... ok
test_flatten_one_single_pcollection (apache_beam.transforms.ptransform_test.PTransformTest)
... ok
test_dofn_lifecycle (apache_beam.transforms.dofn_lifecycle_test.DoFnLifecycleTest) ... ok
test_multiple_empty_outputs (apache_beam.transforms.ptransform_test.PTransformTest) ... ok
test_par_do_with_multiple_outputs_and_using_yield (apache_beam.transforms.ptransform_test.PTransformTest)
... ok
test_par_do_with_multiple_outputs_and_using_return (apache_beam.transforms.ptransform_test.PTransformTest)
... ok
test_as_dict_twice (apache_beam.transforms.sideinputs_test.SideInputsTest) ... ok
test_as_list_and_as_dict_side_inputs (apache_beam.transforms.sideinputs_test.SideInputsTest)
... ok
test_undeclared_outputs (apache_beam.transforms.ptransform_test.PTransformTest) ... ok
test_as_list_twice (apache_beam.transforms.sideinputs_test.SideInputsTest) ... ok
test_as_singleton_with_different_defaults (apache_beam.transforms.sideinputs_test.SideInputsTest)
... ok
test_as_singleton_without_unique_labels (apache_beam.transforms.sideinputs_test.SideInputsTest)
... ok
test_default_value_singleton_side_input (apache_beam.transforms.sideinputs_test.SideInputsTest)
... ok
test_empty_singleton_side_input (apache_beam.transforms.sideinputs_test.SideInputsTest) ...
ok
test_flattened_side_input (apache_beam.transforms.sideinputs_test.SideInputsTest) ... ok
test_iterable_side_input (apache_beam.transforms.sideinputs_test.SideInputsTest) ... ok
test_reshuffle_preserves_timestamps (apache_beam.transforms.util_test.ReshuffleTest) ... ok
test_element_param (apache_beam.pipeline_test.DoFnTest) ... ok
test_key_param (apache_beam.pipeline_test.DoFnTest) ... ok

----------------------------------------------------------------------
XML: nosetests-validatesRunnerStreamingTests-df-py38.xml
----------------------------------------------------------------------
XML: <https://ci-beam.apache.org/job/beam_PostCommit_Py_VR_Dataflow/ws/src/sdks/python/nosetests.xml>
----------------------------------------------------------------------
Ran 30 tests in 1800.250s

OK (SKIP=3)

FAILURE: Build failed with an exception.

* Where:
Script '<https://ci-beam.apache.org/job/beam_PostCommit_Py_VR_Dataflow/ws/src/sdks/python/test-suites/dataflow/common.gradle'>
line: 175

* What went wrong:
Execution failed for task ':sdks:python:test-suites:dataflow:py37:validatesRunnerStreamingTests'.
> Process 'command 'sh'' finished with non-zero exit value 1

* Try:
Run with --stacktrace option to get the stack trace. Run with --info or --debug option to
get more log output. Run with --scan to get full insights.

* Get more help at https://help.gradle.org

Deprecated Gradle features were used in this build, making it incompatible with Gradle 7.0.
Use '--warning-mode all' to show the individual deprecation warnings.
See https://docs.gradle.org/6.7.1/userguide/command_line_interface.html#sec:command_line_warnings

BUILD FAILED in 1h 10m 12s
89 actionable tasks: 59 executed, 30 from cache

Publishing build scan...
https://gradle.com/s/j747j4o4zyeqe

Build step 'Invoke Gradle script' changed build result to FAILURE
Build step 'Invoke Gradle script' marked build as failure

---------------------------------------------------------------------
To unsubscribe, e-mail: builds-unsubscribe@beam.apache.org
For additional commands, e-mail: builds-help@beam.apache.org


Mime
View raw message