beam-builds mailing list archives

Site index · List index
Message view « Date » · « Thread »
Top « Date » · « Thread »
From Apache Jenkins Server <jenk...@builds.apache.org>
Subject Build failed in Jenkins: beam_PostCommit_Java_ValidatesRunner_SparkStructuredStreaming #2554
Date Fri, 15 Jan 2021 00:29:11 GMT
See <https://ci-beam.apache.org/job/beam_PostCommit_Java_ValidatesRunner_SparkStructuredStreaming/2554/display/redirect?page=changes>

Changes:

[sonam.ramchand] Enabled strict dependency

[sonam.ramchand] removed * depdendency

[sonam.ramchand] enabled strict dependency check to false

[sonam.ramchand] Fixed checker-qual issue

[sonam.ramchand] removed * dep

[sonam.ramchand] Fixed requested changes

[sonam.ramchand] autovalue_version variable added

[Kyle Weaver] Alphabetize dependency lists.

[tobiasz.kedzierski] Add gradle-command-action as submodule

[noreply] Make DataCatalogTableProvider.createDataCatalogClient public (#13752)

[noreply] [BEAM-11637] Use accumulators properly in BitAnd. (#13745)


------------------------------------------
[...truncated 31.92 KB...]
> Task :sdks:java:io:hadoop-common:compileJava
> Task :sdks:java:io:common:compileTestJava
> Task :sdks:java:io:jdbc:compileJava
> Task :sdks:java:extensions:protobuf:compileJava

> Task :sdks:java:io:common:compileTestJava
Note: Some input files use or override a deprecated API.
Note: Recompile with -Xlint:deprecation for details.

> Task :sdks:java:io:common:testClasses
> Task :sdks:java:io:common:testJar
> Task :sdks:java:io:hadoop-common:classes
> Task :sdks:java:io:hadoop-common:jar
> Task :sdks:java:io:hadoop-format:compileJava

> Task :sdks:java:fn-execution:compileJava
Note: <https://ci-beam.apache.org/job/beam_PostCommit_Java_ValidatesRunner_SparkStructuredStreaming/ws/src/sdks/java/fn-execution/src/main/java/org/apache/beam/sdk/fn/data/BeamFnDataSizeBasedBufferingOutboundObserver.java>
uses or overrides a deprecated API.
Note: Recompile with -Xlint:deprecation for details.
Note: Some input files use unchecked or unsafe operations.
Note: Recompile with -Xlint:unchecked for details.

> Task :sdks:java:fn-execution:classes
> Task :sdks:java:fn-execution:jar

> Task :sdks:java:extensions:google-cloud-platform-core:compileJava
Note: Some input files use or override a deprecated API.
Note: Recompile with -Xlint:deprecation for details.

> Task :sdks:java:extensions:google-cloud-platform-core:classes
> Task :sdks:java:extensions:google-cloud-platform-core:jar

> Task :sdks:java:io:jdbc:compileJava
Note: <https://ci-beam.apache.org/job/beam_PostCommit_Java_ValidatesRunner_SparkStructuredStreaming/ws/src/sdks/java/io/jdbc/src/main/java/org/apache/beam/sdk/io/jdbc/JdbcIO.java>
uses or overrides a deprecated API.
Note: Recompile with -Xlint:deprecation for details.
Note: Some input files use unchecked or unsafe operations.
Note: Recompile with -Xlint:unchecked for details.

> Task :sdks:java:io:jdbc:classes
> Task :sdks:java:io:jdbc:jar
> Task :runners:core-construction-java:compileJava
> Task :sdks:java:io:hadoop-format:classes
> Task :sdks:java:io:hadoop-format:jar

> Task :sdks:java:extensions:protobuf:compileJava
Note: Some input files use or override a deprecated API.
Note: Recompile with -Xlint:deprecation for details.
Note: Some input files use unchecked or unsafe operations.
Note: Recompile with -Xlint:unchecked for details.

> Task :sdks:java:extensions:protobuf:classes
> Task :sdks:java:extensions:protobuf:jar

> Task :vendor:sdks-java-extensions-protobuf:compileJava
Note: Some input files use or override a deprecated API.
Note: Recompile with -Xlint:deprecation for details.
Note: Some input files use unchecked or unsafe operations.
Note: Recompile with -Xlint:unchecked for details.

> Task :vendor:sdks-java-extensions-protobuf:classes
> Task :vendor:sdks-java-extensions-protobuf:shadowJar FROM-CACHE
> Task :sdks:java:testing:test-utils:compileJava
> Task :sdks:java:testing:test-utils:classes
> Task :sdks:java:testing:test-utils:jar
> Task :sdks:java:testing:test-utils:compileTestJava
> Task :sdks:java:testing:test-utils:testClasses
> Task :sdks:java:testing:test-utils:testJar

> Task :sdks:java:core:compileTestJava
Note: Some input files use or override a deprecated API.
Note: Recompile with -Xlint:deprecation for details.
Note: Some input files use unchecked or unsafe operations.
Note: Recompile with -Xlint:unchecked for details.

> Task :sdks:java:core:testClasses
> Task :sdks:java:core:shadowTestJar FROM-CACHE

> Task :runners:core-construction-java:compileJava
Note: Some input files use or override a deprecated API.
Note: Recompile with -Xlint:deprecation for details.
Note: Some input files use unchecked or unsafe operations.
Note: Recompile with -Xlint:unchecked for details.

> Task :runners:core-construction-java:classes
> Task :runners:core-construction-java:jar
> Task :runners:core-java:compileJava
Note: Some input files use or override a deprecated API.
Note: Recompile with -Xlint:deprecation for details.
Note: Some input files use unchecked or unsafe operations.
Note: Recompile with -Xlint:unchecked for details.

> Task :runners:core-java:classes
> Task :runners:core-java:jar
> Task :sdks:java:harness:compileJava
> Task :runners:core-java:compileTestJava

> Task :sdks:java:harness:compileJava
Note: Some input files use or override a deprecated API.
Note: Recompile with -Xlint:deprecation for details.
Note: Some input files use unchecked or unsafe operations.
Note: Recompile with -Xlint:unchecked for details.

> Task :sdks:java:harness:classes
> Task :sdks:java:harness:jar

> Task :runners:core-java:compileTestJava
Note: Some input files use or override a deprecated API.
Note: Recompile with -Xlint:deprecation for details.
Note: Some input files use unchecked or unsafe operations.
Note: Recompile with -Xlint:unchecked for details.

> Task :runners:core-java:testClasses
> Task :runners:core-java:testJar
> Task :sdks:java:harness:shadowJar
> Task :runners:java-fn-execution:compileJava
Note: Some input files use or override a deprecated API.
Note: Recompile with -Xlint:deprecation for details.
Note: Some input files use unchecked or unsafe operations.
Note: Recompile with -Xlint:unchecked for details.

> Task :runners:java-fn-execution:classes
> Task :runners:java-fn-execution:jar

> Task :sdks:java:expansion-service:compileJava
Note: <https://ci-beam.apache.org/job/beam_PostCommit_Java_ValidatesRunner_SparkStructuredStreaming/ws/src/sdks/java/expansion-service/src/main/java/org/apache/beam/sdk/expansion/service/ExpansionService.java>
uses unchecked or unsafe operations.
Note: Recompile with -Xlint:unchecked for details.

> Task :sdks:java:expansion-service:classes
> Task :sdks:java:expansion-service:jar
> Task :runners:direct-java:compileJava
> Task :sdks:java:io:google-cloud-platform:compileJava
> Task :sdks:java:io:kafka:compileJava
> Task :runners:java-job-service:compileJava
> Task :sdks:java:extensions:ml:compileJava
> Task :sdks:java:extensions:ml:classes
> Task :sdks:java:extensions:ml:jar

> Task :runners:java-job-service:compileJava
Note: <https://ci-beam.apache.org/job/beam_PostCommit_Java_ValidatesRunner_SparkStructuredStreaming/ws/src/runners/java-job-service/src/main/java/org/apache/beam/runners/jobsubmission/PortablePipelineJarCreator.java>
uses unchecked or unsafe operations.
Note: Recompile with -Xlint:unchecked for details.

> Task :runners:java-job-service:classes
> Task :runners:java-job-service:jar
> Task :runners:spark:compileJava

> Task :sdks:java:io:kafka:compileJava
Note: Some input files use or override a deprecated API.
Note: Recompile with -Xlint:deprecation for details.
Note: Some input files use unchecked or unsafe operations.
Note: Recompile with -Xlint:unchecked for details.

> Task :sdks:java:io:kafka:classes
> Task :sdks:java:io:kafka:jar

> Task :runners:direct-java:compileJava
Note: Some input files use or override a deprecated API.
Note: Recompile with -Xlint:deprecation for details.
Note: Some input files use unchecked or unsafe operations.
Note: Recompile with -Xlint:unchecked for details.

> Task :runners:direct-java:classes
> Task :runners:direct-java:shadowJar FROM-CACHE

> Task :runners:spark:compileJava
Note: Some input files use or override a deprecated API.
Note: Recompile with -Xlint:deprecation for details.
Note: Some input files use unchecked or unsafe operations.
Note: Recompile with -Xlint:unchecked for details.

> Task :runners:spark:classes
> Task :runners:spark:jar
> Task :runners:spark:compileTestJava
Note: Some input files use or override a deprecated API.
Note: Recompile with -Xlint:deprecation for details.
Note: Some input files use unchecked or unsafe operations.
Note: Recompile with -Xlint:unchecked for details.

> Task :runners:spark:testClasses
> Task :runners:spark:testJar

> Task :sdks:java:io:google-cloud-platform:compileJava
Note: Some input files use or override a deprecated API.
Note: Recompile with -Xlint:deprecation for details.
Note: Some input files use unchecked or unsafe operations.
Note: Recompile with -Xlint:unchecked for details.

> Task :sdks:java:io:google-cloud-platform:classes
> Task :sdks:java:io:google-cloud-platform:jar
> Task :examples:java:compileJava
Note: Some input files use or override a deprecated API.
Note: Recompile with -Xlint:deprecation for details.
Note: Some input files use unchecked or unsafe operations.
Note: Recompile with -Xlint:unchecked for details.

> Task :examples:java:classes
> Task :examples:java:jar

> Task :examples:java:compileTestJava
Note: Some input files use or override a deprecated API.
Note: Recompile with -Xlint:deprecation for details.
Note: Some input files use unchecked or unsafe operations.
Note: Recompile with -Xlint:unchecked for details.

> Task :examples:java:testClasses
> Task :examples:java:testJar

> Task :sdks:java:io:hadoop-format:compileTestJava
Note: Some input files use or override a deprecated API.
Note: Recompile with -Xlint:deprecation for details.

> Task :sdks:java:io:hadoop-format:testClasses
> Task :runners:spark:validatesStructuredStreamingRunnerBatch

org.apache.beam.sdk.transforms.GroupByKeyTest > org.apache.beam.sdk.transforms.GroupByKeyTest$BasicTests.testGroupByKeyWithBadEqualsHashCode
FAILED
    org.apache.beam.sdk.Pipeline$PipelineExecutionException at GroupByKeyTest.java:452
        Caused by: java.lang.IllegalAccessError at null:-1

org.apache.beam.sdk.transforms.GroupByKeyTest > org.apache.beam.sdk.transforms.GroupByKeyTest$BasicTests.testLargeKeys100MB
FAILED
    org.apache.beam.sdk.Pipeline$PipelineExecutionException at GroupByKeyTest.java:482
        Caused by: java.lang.OutOfMemoryError at StringUtf8Coder.java:59

199 tests completed, 2 failed, 1 skipped

> Task :runners:spark:validatesStructuredStreamingRunnerBatch FAILED

FAILURE: Build failed with an exception.

* What went wrong:
Execution failed for task ':runners:spark:validatesStructuredStreamingRunnerBatch'.
> Process 'Gradle Test Executor 296' finished with non-zero exit value 52
  This problem might be caused by incorrect test process configuration.
  Please refer to the test execution section in the User Manual at https://docs.gradle.org/6.7.1/userguide/java_testing.html#sec:test_execution

* Try:
Run with --stacktrace option to get the stack trace. Run with --info or --debug option to
get more log output. Run with --scan to get full insights.

* Get more help at https://help.gradle.org

Deprecated Gradle features were used in this build, making it incompatible with Gradle 7.0.
Use '--warning-mode all' to show the individual deprecation warnings.
See https://docs.gradle.org/6.7.1/userguide/command_line_interface.html#sec:command_line_warnings

BUILD FAILED in 28m 39s
115 actionable tasks: 100 executed, 15 from cache

Publishing build scan...
https://gradle.com/s/x2mzlvfvuzlxk

Build step 'Invoke Gradle script' changed build result to FAILURE
Build step 'Invoke Gradle script' marked build as failure

---------------------------------------------------------------------
To unsubscribe, e-mail: builds-unsubscribe@beam.apache.org
For additional commands, e-mail: builds-help@beam.apache.org


Mime
View raw message