beam-builds mailing list archives

Site index · List index
Message view « Date » · « Thread »
Top « Date » · « Thread »
From Apache Jenkins Server <jenk...@builds.apache.org>
Subject Build failed in Jenkins: beam_PostCommit_Py_VR_Dataflow_V2 #1580
Date Tue, 26 Jan 2021 13:24:01 GMT
See <https://ci-beam.apache.org/job/beam_PostCommit_Py_VR_Dataflow_V2/1580/display/redirect>

Changes:


------------------------------------------
[...truncated 7.11 MB...]
            },
            "output_name": "None",
            "user_name": "assert_that/Unkey.out"
          }
        ],
        "parallel_input": {
          "@type": "OutputReference",
          "output_name": "None",
          "step_name": "s19"
        },
        "serialized_fn": "ref_AppliedPTransform_assert_that/Unkey_29",
        "user_name": "assert_that/Unkey"
      }
    },
    {
      "kind": "ParallelDo",
      "name": "s21",
      "properties": {
        "display_data": [
          {
            "key": "fn",
            "label": "Transform Function",
            "namespace": "apache_beam.transforms.core.ParDo",
            "shortValue": "CallableWrapperDoFn",
            "type": "STRING",
            "value": "apache_beam.transforms.core.CallableWrapperDoFn"
          },
          {
            "key": "fn",
            "label": "Transform Function",
            "namespace": "apache_beam.transforms.core.CallableWrapperDoFn",
            "type": "STRING",
            "value": "_equal"
          }
        ],
        "non_parallel_inputs": {},
        "output_info": [
          {
            "encoding": {
              "@type": "kind:windowed_value",
              "component_encodings": [
                {
                  "@type": "FastPrimitivesCoder$eNprYJmaxgABPZKJBYnJGanxSamJuXrJ+SmpRcVQakqPsFticUlAUWZuZklmWWqxM0h4yuQpmo1Taqf08MenJebkJCUmZ8eD1U/JYOjhDshMzs5JRVGYVJykBwDOUCqY",
                  "component_encodings": [
                    {
                      "@type": "FastPrimitivesCoder$eNprYJmaxgABPZKJBYnJGanxSamJuXrJ+SmpRcVQakqPsFticUlAUWZuZklmWWqxM0h4yuQpmo1Taqf08MenJebkJCUmZ8eD1U/JYOjhDshMzs5JRVGYVJykBwDOUCqY",
                      "component_encodings": [],
                      "pipeline_proto_coder_id": "ref_Coder_FastPrimitivesCoder_6"
                    },
                    {
                      "@type": "FastPrimitivesCoder$eNprYJmaxgABPZKJBYnJGanxSamJuXrJ+SmpRcVQakqPsFticUlAUWZuZklmWWqxM0h4yuQpmo1Taqf08MenJebkJCUmZ8eD1U/JYOjhDshMzs5JRVGYVJykBwDOUCqY",
                      "component_encodings": [],
                      "pipeline_proto_coder_id": "ref_Coder_FastPrimitivesCoder_6"
                    }
                  ],
                  "is_pair_like": true,
                  "pipeline_proto_coder_id": "ref_Coder_FastPrimitivesCoder_6"
                },
                {
                  "@type": "kind:global_window"
                }
              ],
              "is_wrapper": true
            },
            "output_name": "None",
            "user_name": "assert_that/Match.out"
          }
        ],
        "parallel_input": {
          "@type": "OutputReference",
          "output_name": "None",
          "step_name": "s20"
        },
        "serialized_fn": "ref_AppliedPTransform_assert_that/Match_30",
        "user_name": "assert_that/Match"
      }
    }
  ],
  "type": "JOB_TYPE_STREAMING"
}
INFO:apache_beam.runners.dataflow.internal.apiclient:Create job: <Job
 createTime: '2021-01-26T13:15:52.636949Z'
 currentStateTime: '1970-01-01T00:00:00Z'
 id: '2021-01-26_05_15_51-2664440265446528483'
 location: 'us-central1'
 name: 'beamapp-jenkins-0126131543-851182'
 projectId: 'apache-beam-testing'
 stageStates: []
 startTime: '2021-01-26T13:15:52.636949Z'
 steps: []
 tempFiles: []
 type: TypeValueValuesEnum(JOB_TYPE_STREAMING, 2)>
INFO:apache_beam.runners.dataflow.internal.apiclient:Created job with id: [2021-01-26_05_15_51-2664440265446528483]
INFO:apache_beam.runners.dataflow.internal.apiclient:Submitted job: 2021-01-26_05_15_51-2664440265446528483
INFO:apache_beam.runners.dataflow.internal.apiclient:To access the Dataflow monitoring console,
please navigate to https://console.cloud.google.com/dataflow/jobs/us-central1/2021-01-26_05_15_51-2664440265446528483?project=apache-beam-testing
WARNING:apache_beam.runners.dataflow.test_dataflow_runner:Waiting indefinitely for streaming
job.
INFO:apache_beam.runners.dataflow.dataflow_runner:Job 2021-01-26_05_15_51-2664440265446528483
is in state JOB_STATE_RUNNING
INFO:apache_beam.runners.dataflow.dataflow_runner:2021-01-26T13:15:51.185Z: JOB_MESSAGE_DETAILED:
Autoscaling is enabled for job 2021-01-26_05_15_51-2664440265446528483. The number of workers
will be between 1 and 100.
INFO:apache_beam.runners.dataflow.dataflow_runner:2021-01-26T13:15:51.185Z: JOB_MESSAGE_WARNING:
Autoscaling is enabled for Dataflow Streaming Engine. Workers will scale between 1 and 100
unless maxNumWorkers is specified.
INFO:apache_beam.runners.dataflow.dataflow_runner:2021-01-26T13:15:51.185Z: JOB_MESSAGE_DETAILED:
Autoscaling was automatically enabled for job 2021-01-26_05_15_51-2664440265446528483.
INFO:apache_beam.runners.dataflow.dataflow_runner:2021-01-26T13:15:55.730Z: JOB_MESSAGE_BASIC:
Worker configuration: n1-standard-2 in us-central1-f.
INFO:apache_beam.runners.dataflow.dataflow_runner:2021-01-26T13:15:56.260Z: JOB_MESSAGE_DETAILED:
Expanding SplittableParDo operations into optimizable parts.
INFO:apache_beam.runners.dataflow.dataflow_runner:2021-01-26T13:15:56.284Z: JOB_MESSAGE_DETAILED:
Expanding CollectionToSingleton operations into optimizable parts.
INFO:apache_beam.runners.dataflow.dataflow_runner:2021-01-26T13:15:56.346Z: JOB_MESSAGE_DETAILED:
Expanding CoGroupByKey operations into optimizable parts.
INFO:apache_beam.runners.dataflow.dataflow_runner:2021-01-26T13:15:56.383Z: JOB_MESSAGE_DEBUG:
Combiner lifting skipped for step assert_that/Group/GroupByKey: GroupByKey not followed by
a combiner.
INFO:apache_beam.runners.dataflow.dataflow_runner:2021-01-26T13:15:56.404Z: JOB_MESSAGE_DEBUG:
Combiner lifting skipped for step Create/MaybeReshuffle/Reshuffle/ReshufflePerKey/GroupByKey:
GroupByKey not followed by a combiner.
INFO:apache_beam.runners.dataflow.dataflow_runner:2021-01-26T13:15:56.442Z: JOB_MESSAGE_DETAILED:
Expanding SplittableProcessKeyed operations into optimizable parts.
INFO:apache_beam.runners.dataflow.dataflow_runner:2021-01-26T13:15:56.473Z: JOB_MESSAGE_DETAILED:
Expanding GroupByKey operations into streaming Read/Write steps
INFO:apache_beam.runners.dataflow.dataflow_runner:2021-01-26T13:15:56.576Z: JOB_MESSAGE_DETAILED:
Lifting ValueCombiningMappingFns into MergeBucketsMappingFns
INFO:apache_beam.runners.dataflow.dataflow_runner:2021-01-26T13:15:56.683Z: JOB_MESSAGE_DEBUG:
Annotating graph with Autotuner information.
INFO:apache_beam.runners.dataflow.dataflow_runner:2021-01-26T13:15:56.717Z: JOB_MESSAGE_DETAILED:
Fusing adjacent ParDo, Read, Write, and Flatten operations
INFO:apache_beam.runners.dataflow.dataflow_runner:2021-01-26T13:15:56.741Z: JOB_MESSAGE_DETAILED:
Unzipping flatten s17 for input s15.None
INFO:apache_beam.runners.dataflow.dataflow_runner:2021-01-26T13:15:56.778Z: JOB_MESSAGE_DETAILED:
Fusing unzipped copy of assert_that/Group/GroupByKey/WriteStream, through flatten assert_that/Group/Flatten,
into producer assert_that/Group/pair_with_0
INFO:apache_beam.runners.dataflow.dataflow_runner:2021-01-26T13:15:56.803Z: JOB_MESSAGE_DETAILED:
Fusing consumer assert_that/Group/GroupByKey/WriteStream into assert_that/Group/pair_with_1
INFO:apache_beam.runners.dataflow.dataflow_runner:2021-01-26T13:15:56.835Z: JOB_MESSAGE_DETAILED:
Fusing consumer Create/FlatMap(<lambda at core.py:2957>) into Create/Impulse
INFO:apache_beam.runners.dataflow.dataflow_runner:2021-01-26T13:15:56.870Z: JOB_MESSAGE_DETAILED:
Fusing consumer assert_that/Create/FlatMap(<lambda at core.py:2957>) into assert_that/Create/Impulse
INFO:apache_beam.runners.dataflow.dataflow_runner:2021-01-26T13:15:56.892Z: JOB_MESSAGE_DETAILED:
Fusing consumer assert_that/Create/Map(decode) into assert_that/Create/FlatMap(<lambda
at core.py:2957>)
INFO:apache_beam.runners.dataflow.dataflow_runner:2021-01-26T13:15:56.925Z: JOB_MESSAGE_DETAILED:
Fusing consumer assert_that/Group/pair_with_0 into assert_that/Create/Map(decode)
INFO:apache_beam.runners.dataflow.dataflow_runner:2021-01-26T13:15:56.961Z: JOB_MESSAGE_DETAILED:
Fusing consumer Create/MaybeReshuffle/Reshuffle/AddRandomKeys into Create/FlatMap(<lambda
at core.py:2957>)
INFO:apache_beam.runners.dataflow.dataflow_runner:2021-01-26T13:15:57.013Z: JOB_MESSAGE_DETAILED:
Fusing consumer Create/MaybeReshuffle/Reshuffle/ReshufflePerKey/Map(reify_timestamps) into
Create/MaybeReshuffle/Reshuffle/AddRandomKeys
INFO:apache_beam.runners.dataflow.dataflow_runner:2021-01-26T13:15:57.053Z: JOB_MESSAGE_DETAILED:
Fusing consumer Create/MaybeReshuffle/Reshuffle/ReshufflePerKey/GroupByKey/WriteStream into
Create/MaybeReshuffle/Reshuffle/ReshufflePerKey/Map(reify_timestamps)
INFO:apache_beam.runners.dataflow.dataflow_runner:2021-01-26T13:15:57.095Z: JOB_MESSAGE_DETAILED:
Fusing consumer Create/MaybeReshuffle/Reshuffle/ReshufflePerKey/GroupByKey/MergeBuckets into
Create/MaybeReshuffle/Reshuffle/ReshufflePerKey/GroupByKey/ReadStream
INFO:apache_beam.runners.dataflow.dataflow_runner:2021-01-26T13:15:57.158Z: JOB_MESSAGE_DETAILED:
Fusing consumer Create/MaybeReshuffle/Reshuffle/ReshufflePerKey/FlatMap(restore_timestamps)
into Create/MaybeReshuffle/Reshuffle/ReshufflePerKey/GroupByKey/MergeBuckets
INFO:apache_beam.runners.dataflow.dataflow_runner:2021-01-26T13:15:57.187Z: JOB_MESSAGE_DETAILED:
Fusing consumer Create/MaybeReshuffle/Reshuffle/RemoveRandomKeys into Create/MaybeReshuffle/Reshuffle/ReshufflePerKey/FlatMap(restore_timestamps)
INFO:apache_beam.runners.dataflow.dataflow_runner:2021-01-26T13:15:57.224Z: JOB_MESSAGE_DETAILED:
Fusing consumer Create/Map(decode) into Create/MaybeReshuffle/Reshuffle/RemoveRandomKeys
INFO:apache_beam.runners.dataflow.dataflow_runner:2021-01-26T13:15:57.249Z: JOB_MESSAGE_DETAILED:
Fusing consumer Key param into Create/Map(decode)
INFO:apache_beam.runners.dataflow.dataflow_runner:2021-01-26T13:15:57.274Z: JOB_MESSAGE_DETAILED:
Fusing consumer assert_that/WindowInto(WindowIntoFn) into Key param
INFO:apache_beam.runners.dataflow.dataflow_runner:2021-01-26T13:15:57.301Z: JOB_MESSAGE_DETAILED:
Fusing consumer assert_that/ToVoidKey into assert_that/WindowInto(WindowIntoFn)
INFO:apache_beam.runners.dataflow.dataflow_runner:2021-01-26T13:15:57.337Z: JOB_MESSAGE_DETAILED:
Fusing consumer assert_that/Group/pair_with_1 into assert_that/ToVoidKey
INFO:apache_beam.runners.dataflow.dataflow_runner:2021-01-26T13:15:57.368Z: JOB_MESSAGE_DETAILED:
Fusing consumer assert_that/Group/GroupByKey/MergeBuckets into assert_that/Group/GroupByKey/ReadStream
INFO:apache_beam.runners.dataflow.dataflow_runner:2021-01-26T13:15:57.396Z: JOB_MESSAGE_DETAILED:
Fusing consumer assert_that/Group/Map(_merge_tagged_vals_under_key) into assert_that/Group/GroupByKey/MergeBuckets
INFO:apache_beam.runners.dataflow.dataflow_runner:2021-01-26T13:15:57.431Z: JOB_MESSAGE_DETAILED:
Fusing consumer assert_that/Unkey into assert_that/Group/Map(_merge_tagged_vals_under_key)
INFO:apache_beam.runners.dataflow.dataflow_runner:2021-01-26T13:15:57.462Z: JOB_MESSAGE_DETAILED:
Fusing consumer assert_that/Match into assert_that/Unkey
INFO:apache_beam.runners.dataflow.dataflow_runner:2021-01-26T13:15:57.509Z: JOB_MESSAGE_DEBUG:
Workflow config is missing a default resource spec.
INFO:apache_beam.runners.dataflow.dataflow_runner:2021-01-26T13:15:57.541Z: JOB_MESSAGE_DEBUG:
Adding StepResource setup and teardown to workflow graph.
INFO:apache_beam.runners.dataflow.dataflow_runner:2021-01-26T13:15:57.573Z: JOB_MESSAGE_DEBUG:
Adding workflow start and stop steps.
INFO:apache_beam.runners.dataflow.dataflow_runner:2021-01-26T13:15:57.606Z: JOB_MESSAGE_DEBUG:
Assigning stage ids.
INFO:apache_beam.runners.dataflow.dataflow_runner:2021-01-26T13:15:58.886Z: JOB_MESSAGE_DEBUG:
Starting worker pool setup.
INFO:apache_beam.runners.dataflow.dataflow_runner:2021-01-26T13:15:58.908Z: JOB_MESSAGE_BASIC:
Starting 1 workers in us-central1-f...
INFO:apache_beam.runners.dataflow.dataflow_runner:2021-01-26T13:15:58.941Z: JOB_MESSAGE_DEBUG:
Starting worker pool setup.
INFO:apache_beam.runners.dataflow.dataflow_runner:2021-01-26T13:16:25.066Z: JOB_MESSAGE_BASIC:
Your project already contains 100 Dataflow-created metric descriptors, so new user metrics
of the form custom.googleapis.com/* will not be created. However, all user metrics are also
available in the metric dataflow.googleapis.com/job/user_counter. If you rely on the custom
metrics, you can delete old / unused metric descriptors. See https://developers.google.com/apis-explorer/#p/monitoring/v3/monitoring.projects.metricDescriptors.list
and https://developers.google.com/apis-explorer/#p/monitoring/v3/monitoring.projects.metricDescriptors.delete
INFO:apache_beam.runners.dataflow.dataflow_runner:2021-01-26T13:16:34.410Z: JOB_MESSAGE_DETAILED:
Autoscaling: Raised the number of workers to 1 so that the pipeline can catch up with its
backlog and keep up with its input rate.
INFO:apache_beam.runners.dataflow.dataflow_runner:2021-01-26T13:17:10.894Z: JOB_MESSAGE_DETAILED:
Workers have started successfully.
INFO:apache_beam.runners.dataflow.dataflow_runner:2021-01-26T13:17:10.919Z: JOB_MESSAGE_DETAILED:
Workers have started successfully.
INFO:oauth2client.transport:Refreshing due to a 401 (attempt 1/2)
INFO:apache_beam.runners.dataflow.dataflow_runner:2021-01-26T13:23:02.087Z: JOB_MESSAGE_DETAILED:
Cleaning up.
INFO:apache_beam.runners.dataflow.dataflow_runner:2021-01-26T13:23:02.126Z: JOB_MESSAGE_DEBUG:
Starting worker pool teardown.
INFO:apache_beam.runners.dataflow.dataflow_runner:2021-01-26T13:23:02.159Z: JOB_MESSAGE_BASIC:
Stopping worker pool...
INFO:apache_beam.runners.dataflow.dataflow_runner:2021-01-26T13:23:02.191Z: JOB_MESSAGE_DEBUG:
Starting worker pool teardown.
INFO:apache_beam.runners.dataflow.dataflow_runner:2021-01-26T13:23:02.223Z: JOB_MESSAGE_BASIC:
Stopping worker pool...
INFO:apache_beam.runners.dataflow.dataflow_runner:2021-01-26T13:23:49.644Z: JOB_MESSAGE_DETAILED:
Autoscaling: Reduced the number of workers to 0 based on low average worker CPU utilization,
and the pipeline having sufficiently low backlog and keeping up with input rate.
INFO:apache_beam.runners.dataflow.dataflow_runner:2021-01-26T13:23:49.691Z: JOB_MESSAGE_BASIC:
Worker pool stopped.
INFO:apache_beam.runners.dataflow.dataflow_runner:2021-01-26T13:23:49.718Z: JOB_MESSAGE_DEBUG:
Tearing down pending resources...
INFO:apache_beam.runners.dataflow.dataflow_runner:Job 2021-01-26_05_15_51-2664440265446528483
is in state JOB_STATE_DONE
Worker logs: https://console.cloud.google.com/dataflow/jobs/us-central1/2021-01-26_04_42_35-16134403301731669586?project=apache-beam-testing
Worker logs: https://console.cloud.google.com/dataflow/jobs/us-central1/2021-01-26_04_50_57-15694375423353503655?project=apache-beam-testing
Worker logs: https://console.cloud.google.com/dataflow/jobs/us-central1/2021-01-26_04_59_21-9247942797858119744?project=apache-beam-testing
Worker logs: https://console.cloud.google.com/dataflow/jobs/us-central1/2021-01-26_04_42_37-10711176029592859586?project=apache-beam-testing
Worker logs: https://console.cloud.google.com/dataflow/jobs/us-central1/2021-01-26_04_50_21-2638121508531322090?project=apache-beam-testing
Worker logs: https://console.cloud.google.com/dataflow/jobs/us-central1/2021-01-26_04_58_36-6885558922549268441?project=apache-beam-testing
Worker logs: https://console.cloud.google.com/dataflow/jobs/us-central1/2021-01-26_04_42_35-2178339468097741538?project=apache-beam-testing
Worker logs: https://console.cloud.google.com/dataflow/jobs/us-central1/2021-01-26_04_50_56-2908775357213531641?project=apache-beam-testing
Worker logs: https://console.cloud.google.com/dataflow/jobs/us-central1/2021-01-26_04_59_15-6648705454540508670?project=apache-beam-testing
Worker logs: https://console.cloud.google.com/dataflow/jobs/us-central1/2021-01-26_05_07_30-10270883543511355613?project=apache-beam-testing
Worker logs: https://console.cloud.google.com/dataflow/jobs/us-central1/2021-01-26_04_42_35-17365193731909698089?project=apache-beam-testing
Worker logs: https://console.cloud.google.com/dataflow/jobs/us-central1/2021-01-26_04_52_05-12812941932142316284?project=apache-beam-testing
Worker logs: https://console.cloud.google.com/dataflow/jobs/us-central1/2021-01-26_05_00_19-15735622888463251833?project=apache-beam-testing
Worker logs: https://console.cloud.google.com/dataflow/jobs/us-central1/2021-01-26_04_42_37-17384153955487353644?project=apache-beam-testing
Worker logs: https://console.cloud.google.com/dataflow/jobs/us-central1/2021-01-26_04_51_11-11323062174050155557?project=apache-beam-testing
Worker logs: https://console.cloud.google.com/dataflow/jobs/us-central1/2021-01-26_04_59_30-12027309448076531349?project=apache-beam-testing
Worker logs: https://console.cloud.google.com/dataflow/jobs/us-central1/2021-01-26_04_42_35-17223135861762882563?project=apache-beam-testing
Worker logs: https://console.cloud.google.com/dataflow/jobs/us-central1/2021-01-26_04_50_58-6023561288684666850?project=apache-beam-testing
Worker logs: https://console.cloud.google.com/dataflow/jobs/us-central1/2021-01-26_04_59_22-3337133973109285349?project=apache-beam-testing
Worker logs: https://console.cloud.google.com/dataflow/jobs/us-central1/2021-01-26_04_42_36-18369963229964778635?project=apache-beam-testing
Worker logs: https://console.cloud.google.com/dataflow/jobs/us-central1/2021-01-26_04_50_57-1076732259916324949?project=apache-beam-testing
Worker logs: https://console.cloud.google.com/dataflow/jobs/us-central1/2021-01-26_04_59_15-11691157933009373470?project=apache-beam-testing
Worker logs: https://console.cloud.google.com/dataflow/jobs/us-central1/2021-01-26_05_07_36-6433126173992306379?project=apache-beam-testing
Worker logs: https://console.cloud.google.com/dataflow/jobs/us-central1/2021-01-26_05_15_51-2664440265446528483?project=apache-beam-testing
Worker logs: https://console.cloud.google.com/dataflow/jobs/us-central1/2021-01-26_04_42_36-2909170072491325196?project=apache-beam-testing
Worker logs: https://console.cloud.google.com/dataflow/jobs/us-central1/2021-01-26_04_50_52-8357830875396421404?project=apache-beam-testing
Worker logs: https://console.cloud.google.com/dataflow/jobs/us-central1/2021-01-26_04_59_10-11131735577630914420?project=apache-beam-testing
test_gbk_many_values (apache_beam.runners.portability.fn_api_runner.fn_runner_test.FnApiBasedStateBackedCoderTest)
... ok
Test TimestampCombiner with EARLIEST. ... ok
Test TimestampCombiner with LATEST. ... ok
Runs streaming Dataflow job and verifies that user metrics are reported ... ok
test_flatten_multiple_pcollections_having_multiple_consumers (apache_beam.transforms.ptransform_test.PTransformTest)
... ok
test_flatten_one_single_pcollection (apache_beam.transforms.ptransform_test.PTransformTest)
... ok
test_user_counter_using_pardo (apache_beam.metrics.metric_test.MetricsTest) ... ok
test_flatten_a_flattened_pcollection (apache_beam.transforms.ptransform_test.PTransformTest)
... ok
test_dofn_lifecycle (apache_beam.transforms.dofn_lifecycle_test.DoFnLifecycleTest) ... ok
test_flatten_pcollections (apache_beam.transforms.ptransform_test.PTransformTest) ... ok
test_impulse (apache_beam.transforms.ptransform_test.PTransformTest) ... ok
test_multiple_empty_outputs (apache_beam.transforms.ptransform_test.PTransformTest) ... ok
test_par_do_with_multiple_outputs_and_using_return (apache_beam.transforms.ptransform_test.PTransformTest)
... ok
test_undeclared_outputs (apache_beam.transforms.ptransform_test.PTransformTest) ... ok
test_par_do_with_multiple_outputs_and_using_yield (apache_beam.transforms.ptransform_test.PTransformTest)
... ok
test_as_dict_twice (apache_beam.transforms.sideinputs_test.SideInputsTest) ... ok
test_as_list_and_as_dict_side_inputs (apache_beam.transforms.sideinputs_test.SideInputsTest)
... ok
test_as_singleton_without_unique_labels (apache_beam.transforms.sideinputs_test.SideInputsTest)
... ok
test_default_value_singleton_side_input (apache_beam.transforms.sideinputs_test.SideInputsTest)
... ok
test_flattened_side_input (apache_beam.transforms.sideinputs_test.SideInputsTest) ... ok
test_as_list_twice (apache_beam.transforms.sideinputs_test.SideInputsTest) ... ok
test_as_singleton_with_different_defaults (apache_beam.transforms.sideinputs_test.SideInputsTest)
... ok
test_empty_singleton_side_input (apache_beam.transforms.sideinputs_test.SideInputsTest) ...
ok
test_iterable_side_input (apache_beam.transforms.sideinputs_test.SideInputsTest) ... ok
test_combine (apache_beam.transforms.combinefn_lifecycle_test.CombineFnLifecycleTest) ...
ok
test_combining_value_state (apache_beam.transforms.combinefn_lifecycle_test.CombineFnLifecycleTest)
... ok
test_non_liftable_combine (apache_beam.transforms.combinefn_lifecycle_test.CombineFnLifecycleTest)
... ok
test_reshuffle_preserves_timestamps (apache_beam.transforms.util_test.ReshuffleTest) ... ok
test_element_param (apache_beam.pipeline_test.DoFnTest) ... ok
test_key_param (apache_beam.pipeline_test.DoFnTest) ... ok

----------------------------------------------------------------------
XML: nosetests-validatesRunnerStreamingTests-df-py38.xml
----------------------------------------------------------------------
XML: <https://ci-beam.apache.org/job/beam_PostCommit_Py_VR_Dataflow_V2/ws/src/sdks/python/nosetests.xml>
----------------------------------------------------------------------
Ran 30 tests in 2499.352s

OK

> Task :sdks:python:test-suites:dataflow:validatesRunnerStreamingTestsV2

FAILURE: Build failed with an exception.

* Where:
Script '<https://ci-beam.apache.org/job/beam_PostCommit_Py_VR_Dataflow_V2/ws/src/sdks/python/test-suites/dataflow/common.gradle'>
line: 146

* What went wrong:
Execution failed for task ':sdks:python:test-suites:dataflow:py38:validatesRunnerBatchTests'.
> Process 'command 'sh'' finished with non-zero exit value 1

* Try:
Run with --stacktrace option to get the stack trace. Run with --info or --debug option to
get more log output. Run with --scan to get full insights.

* Get more help at https://help.gradle.org

Deprecated Gradle features were used in this build, making it incompatible with Gradle 7.0.
Use '--warning-mode all' to show the individual deprecation warnings.
See https://docs.gradle.org/6.8/userguide/command_line_interface.html#sec:command_line_warnings

BUILD FAILED in 1h 23m 29s
81 actionable tasks: 51 executed, 30 from cache

Publishing build scan...
https://gradle.com/s/cu4x4ilaouspa

Build step 'Invoke Gradle script' changed build result to FAILURE
Build step 'Invoke Gradle script' marked build as failure

---------------------------------------------------------------------
To unsubscribe, e-mail: builds-unsubscribe@beam.apache.org
For additional commands, e-mail: builds-help@beam.apache.org


Mime
View raw message