beam-builds mailing list archives

Site index · List index
Message view « Date » · « Thread »
Top « Date » · « Thread »
From Apache Jenkins Server <jenk...@builds.apache.org>
Subject Build failed in Jenkins: beam_PreCommit_Python_Cron #3709
Date Sat, 09 Jan 2021 00:43:34 GMT
See <https://ci-beam.apache.org/job/beam_PreCommit_Python_Cron/3709/display/redirect?page=changes>

Changes:

[Pablo Estrada] Adding website update for release 2.27.0

[Pablo Estrada] Add 2.27.0 blog post, and update CHANGES.md

[heejong] [BEAM-11508] Set sdkHarnessContainerImages in workerpool configuration

[heejong] add utility function to check runner v2, set single-core flag for python

[noreply] [BEAM-11327] Update JulHandler with Charset.defaultCharset() (#13701)

[Pablo Estrada] Fixing script for Java8/Java11 docker container push

[noreply] Update the blog date for 2.27


------------------------------------------
[...truncated 1.21 MB...]
          "step_name": "s8"
        },
        "serialized_fn": "ref_AppliedPTransform_encode_11",
        "user_name": "encode"
      }
    },
    {
      "kind": "ParallelDo",
      "name": "s10",
      "properties": {
        "display_data": [
          {
            "key": "fn",
            "label": "Transform Function",
            "namespace": "apache_beam.transforms.core.ParDo",
            "shortValue": "CallableWrapperDoFn",
            "type": "STRING",
            "value": "apache_beam.transforms.core.CallableWrapperDoFn"
          },
          {
            "key": "fn",
            "label": "Transform Function",
            "namespace": "apache_beam.transforms.core.CallableWrapperDoFn",
            "type": "STRING",
            "value": "bytes_to_proto_str"
          }
        ],
        "non_parallel_inputs": {},
        "output_info": [
          {
            "encoding": {
              "@type": "kind:windowed_value",
              "component_encodings": [
                {
                  "@type": "kind:bytes"
                },
                {
                  "@type": "kind:interval_window"
                }
              ],
              "is_wrapper": true
            },
            "output_name": "None",
            "user_name": "WriteToPubSub/ToProtobuf.out"
          }
        ],
        "parallel_input": {
          "@type": "OutputReference",
          "output_name": "None",
          "step_name": "s9"
        },
        "serialized_fn": "ref_AppliedPTransform_WriteToPubSub/ToProtobuf_13",
        "user_name": "WriteToPubSub/ToProtobuf"
      }
    },
    {
      "kind": "ParallelWrite",
      "name": "s11",
      "properties": {
        "display_data": [],
        "encoding": {
          "@type": "kind:windowed_value",
          "component_encodings": [
            {
              "@type": "kind:bytes"
            },
            {
              "@type": "kind:global_window"
            }
          ],
          "is_wrapper": true
        },
        "format": "pubsub",
        "parallel_input": {
          "@type": "OutputReference",
          "output_name": "None",
          "step_name": "s10"
        },
        "pubsub_serialized_attributes_fn": "",
        "pubsub_topic": "projects/apache-beam-testing/topics/wc_topic_output60b29f3a-b147-47cb-916c-b645d741109a",
        "user_name": "WriteToPubSub/Write/NativeWrite"
      }
    }
  ],
  "type": "JOB_TYPE_STREAMING"
}
INFO:apache_beam.runners.dataflow.internal.apiclient:Create job: <Job
 createTime: '2021-01-09T00:34:21.386651Z'
 currentStateTime: '1970-01-01T00:00:00Z'
 id: '2021-01-08_16_34_19-2969077505530597073'
 location: 'us-central1'
 name: 'beamapp-jenkins-0109003412-819990'
 projectId: 'apache-beam-testing'
 stageStates: []
 startTime: '2021-01-09T00:34:21.386651Z'
 steps: []
 tempFiles: []
 type: TypeValueValuesEnum(JOB_TYPE_STREAMING, 2)>
INFO:apache_beam.runners.dataflow.internal.apiclient:Created job with id: [2021-01-08_16_34_19-2969077505530597073]
INFO:apache_beam.runners.dataflow.internal.apiclient:Submitted job: 2021-01-08_16_34_19-2969077505530597073
INFO:apache_beam.runners.dataflow.internal.apiclient:To access the Dataflow monitoring console,
please navigate to https://console.cloud.google.com/dataflow/jobs/us-central1/2021-01-08_16_34_19-2969077505530597073?project=apache-beam-testing
INFO:apache_beam.runners.dataflow.dataflow_runner:Job 2021-01-08_16_34_19-2969077505530597073
is in state JOB_STATE_RUNNING
INFO:apache_beam.runners.dataflow.dataflow_runner:2021-01-09T00:34:19.624Z: JOB_MESSAGE_DETAILED:
Autoscaling was automatically enabled for job 2021-01-08_16_34_19-2969077505530597073.
INFO:apache_beam.runners.dataflow.dataflow_runner:2021-01-09T00:34:19.624Z: JOB_MESSAGE_DETAILED:
Autoscaling is enabled for job 2021-01-08_16_34_19-2969077505530597073. The number of workers
will be between 1 and 100.
INFO:apache_beam.runners.dataflow.dataflow_runner:2021-01-09T00:34:19.624Z: JOB_MESSAGE_WARNING:
Autoscaling is enabled for Dataflow Streaming Engine. Workers will scale between 1 and 100
unless maxNumWorkers is specified.
INFO:apache_beam.runners.dataflow.dataflow_runner:2021-01-09T00:34:25.198Z: JOB_MESSAGE_BASIC:
Worker configuration: n1-standard-2 in us-central1-f.
INFO:apache_beam.runners.dataflow.dataflow_runner:2021-01-09T00:34:26.027Z: JOB_MESSAGE_DETAILED:
Expanding SplittableParDo operations into optimizable parts.
INFO:apache_beam.runners.dataflow.dataflow_runner:2021-01-09T00:34:26.063Z: JOB_MESSAGE_DETAILED:
Expanding CollectionToSingleton operations into optimizable parts.
INFO:apache_beam.runners.dataflow.dataflow_runner:2021-01-09T00:34:26.184Z: JOB_MESSAGE_DETAILED:
Expanding CoGroupByKey operations into optimizable parts.
INFO:apache_beam.runners.dataflow.dataflow_runner:2021-01-09T00:34:26.212Z: JOB_MESSAGE_DEBUG:
Combiner lifting skipped for step group: GroupByKey not followed by a combiner.
INFO:apache_beam.runners.dataflow.dataflow_runner:2021-01-09T00:34:26.237Z: JOB_MESSAGE_DETAILED:
Expanding SplittableProcessKeyed operations into optimizable parts.
INFO:apache_beam.runners.dataflow.dataflow_runner:2021-01-09T00:34:26.264Z: JOB_MESSAGE_DETAILED:
Expanding GroupByKey operations into streaming Read/Write steps
INFO:apache_beam.runners.dataflow.dataflow_runner:2021-01-09T00:34:26.327Z: JOB_MESSAGE_DETAILED:
Lifting ValueCombiningMappingFns into MergeBucketsMappingFns
INFO:apache_beam.runners.dataflow.dataflow_runner:2021-01-09T00:34:26.404Z: JOB_MESSAGE_DEBUG:
Annotating graph with Autotuner information.
INFO:apache_beam.runners.dataflow.dataflow_runner:2021-01-09T00:34:26.459Z: JOB_MESSAGE_DETAILED:
Fusing adjacent ParDo, Read, Write, and Flatten operations
INFO:apache_beam.runners.dataflow.dataflow_runner:2021-01-09T00:34:26.481Z: JOB_MESSAGE_DETAILED:
Fusing consumer decode into ReadFromPubSub/Read
INFO:apache_beam.runners.dataflow.dataflow_runner:2021-01-09T00:34:26.506Z: JOB_MESSAGE_DETAILED:
Fusing consumer split into decode
INFO:apache_beam.runners.dataflow.dataflow_runner:2021-01-09T00:34:26.542Z: JOB_MESSAGE_DETAILED:
Fusing consumer pair_with_one into split
INFO:apache_beam.runners.dataflow.dataflow_runner:2021-01-09T00:34:26.575Z: JOB_MESSAGE_DETAILED:
Fusing consumer WindowInto(WindowIntoFn) into pair_with_one
INFO:apache_beam.runners.dataflow.dataflow_runner:2021-01-09T00:34:26.609Z: JOB_MESSAGE_DETAILED:
Fusing consumer group/WriteStream into WindowInto(WindowIntoFn)
INFO:apache_beam.runners.dataflow.dataflow_runner:2021-01-09T00:34:26.638Z: JOB_MESSAGE_DETAILED:
Fusing consumer group/MergeBuckets into group/ReadStream
INFO:apache_beam.runners.dataflow.dataflow_runner:2021-01-09T00:34:26.687Z: JOB_MESSAGE_DETAILED:
Fusing consumer count into group/MergeBuckets
INFO:apache_beam.runners.dataflow.dataflow_runner:2021-01-09T00:34:26.722Z: JOB_MESSAGE_DETAILED:
Fusing consumer format into count
INFO:apache_beam.runners.dataflow.dataflow_runner:2021-01-09T00:34:26.753Z: JOB_MESSAGE_DETAILED:
Fusing consumer encode into format
INFO:apache_beam.runners.dataflow.dataflow_runner:2021-01-09T00:34:26.780Z: JOB_MESSAGE_DETAILED:
Fusing consumer WriteToPubSub/ToProtobuf into encode
INFO:apache_beam.runners.dataflow.dataflow_runner:2021-01-09T00:34:26.807Z: JOB_MESSAGE_DETAILED:
Fusing consumer WriteToPubSub/Write/NativeWrite into WriteToPubSub/ToProtobuf
INFO:apache_beam.runners.dataflow.dataflow_runner:2021-01-09T00:34:26.836Z: JOB_MESSAGE_DEBUG:
Workflow config is missing a default resource spec.
INFO:apache_beam.runners.dataflow.dataflow_runner:2021-01-09T00:34:26.878Z: JOB_MESSAGE_DEBUG:
Adding StepResource setup and teardown to workflow graph.
INFO:apache_beam.runners.dataflow.dataflow_runner:2021-01-09T00:34:26.900Z: JOB_MESSAGE_DEBUG:
Adding workflow start and stop steps.
INFO:apache_beam.runners.dataflow.dataflow_runner:2021-01-09T00:34:26.935Z: JOB_MESSAGE_DEBUG:
Assigning stage ids.
INFO:apache_beam.runners.dataflow.dataflow_runner:2021-01-09T00:34:28.083Z: JOB_MESSAGE_DEBUG:
Starting worker pool setup.
INFO:apache_beam.runners.dataflow.dataflow_runner:2021-01-09T00:34:28.157Z: JOB_MESSAGE_DEBUG:
Starting worker pool setup.
INFO:apache_beam.runners.dataflow.dataflow_runner:2021-01-09T00:34:28.240Z: JOB_MESSAGE_BASIC:
Starting 1 workers in us-central1-f...
INFO:apache_beam.runners.dataflow.dataflow_runner:2021-01-09T00:34:53.675Z: JOB_MESSAGE_DETAILED:
Autoscaling: Raised the number of workers to 1 so that the pipeline can catch up with its
backlog and keep up with its input rate.
INFO:apache_beam.runners.dataflow.dataflow_runner:2021-01-09T00:34:56.367Z: JOB_MESSAGE_BASIC:
Your project already contains 100 Dataflow-created metric descriptors, so new user metrics
of the form custom.googleapis.com/* will not be created. However, all user metrics are also
available in the metric dataflow.googleapis.com/job/user_counter. If you rely on the custom
metrics, you can delete old / unused metric descriptors. See https://developers.google.com/apis-explorer/#p/monitoring/v3/monitoring.projects.metricDescriptors.list
and https://developers.google.com/apis-explorer/#p/monitoring/v3/monitoring.projects.metricDescriptors.delete

> Task :sdks:python:test-suites:dataflow:py36:preCommitIT_streaming_V2
INFO:apache_beam.runners.dataflow.dataflow_runner:2021-01-09T00:35:11.578Z: JOB_MESSAGE_DETAILED:
Workers have started successfully.
INFO:apache_beam.runners.dataflow.dataflow_runner:2021-01-09T00:35:11.606Z: JOB_MESSAGE_DETAILED:
Workers have started successfully.

> Task :sdks:python:test-suites:dataflow:py37:preCommitIT_streaming_V2
INFO:apache_beam.runners.dataflow.dataflow_runner:2021-01-09T00:35:30.228Z: JOB_MESSAGE_DETAILED:
Workers have started successfully.
INFO:apache_beam.runners.dataflow.dataflow_runner:2021-01-09T00:35:30.262Z: JOB_MESSAGE_DETAILED:
Workers have started successfully.

> Task :sdks:python:test-suites:dataflow:py36:preCommitIT_streaming_V2
WARNING:apache_beam.runners.dataflow.dataflow_runner:Timing out on waiting for job 2021-01-08_16_33_44-15647697560562727474
after 364 seconds
DEBUG:google.auth._default:Checking None for explicit credentials as part of auth process...
DEBUG:google.auth._default:Checking Cloud SDK credentials as part of auth process...
DEBUG:google.auth._default:Cloud SDK credentials not found on disk; not using them
DEBUG:google.auth._default:Checking for App Engine runtime as part of auth process...
DEBUG:google.auth._default:No App Engine library was found so cannot authentication via App
Engine Identity Credentials.
DEBUG:google.auth.transport._http_client:Making request: GET http://169.254.169.254
DEBUG:google.auth.transport._http_client:Making request: GET http://metadata.google.internal/computeMetadata/v1/project/project-id
DEBUG:google.auth.transport.requests:Making request: GET http://metadata.google.internal/computeMetadata/v1/instance/service-accounts/default/?recursive=true
DEBUG:urllib3.connectionpool:Starting new HTTP connection (1): metadata.google.internal:80
DEBUG:urllib3.connectionpool:http://metadata.google.internal:80 "GET /computeMetadata/v1/instance/service-accounts/default/?recursive=true
HTTP/1.1" 200 144
DEBUG:google.auth.transport.requests:Making request: GET http://metadata.google.internal/computeMetadata/v1/instance/service-accounts/844138762903-compute@developer.gserviceaccount.com/token?scopes=https%3A%2F%2Fwww.googleapis.com%2Fauth%2Fcloud-platform%2Chttps%3A%2F%2Fwww.googleapis.com%2Fauth%2Fpubsub
DEBUG:urllib3.connectionpool:http://metadata.google.internal:80 "GET /computeMetadata/v1/instance/service-accounts/844138762903-compute@developer.gserviceaccount.com/token?scopes=https%3A%2F%2Fwww.googleapis.com%2Fauth%2Fcloud-platform%2Chttps%3A%2F%2Fwww.googleapis.com%2Fauth%2Fpubsub
HTTP/1.1" 200 241

> Task :sdks:python:test-suites:dataflow:py37:preCommitIT_streaming_V2
WARNING:apache_beam.runners.dataflow.dataflow_runner:Timing out on waiting for job 2021-01-08_16_34_19-2969077505530597073
after 364 seconds
DEBUG:google.auth._default:Checking None for explicit credentials as part of auth process...
DEBUG:google.auth._default:Checking Cloud SDK credentials as part of auth process...
DEBUG:google.auth._default:Cloud SDK credentials not found on disk; not using them
DEBUG:google.auth._default:Checking for App Engine runtime as part of auth process...
DEBUG:google.auth._default:No App Engine library was found so cannot authentication via App
Engine Identity Credentials.
DEBUG:google.auth.transport._http_client:Making request: GET http://169.254.169.254
DEBUG:google.auth.transport._http_client:Making request: GET http://metadata.google.internal/computeMetadata/v1/project/project-id
DEBUG:google.auth.transport.requests:Making request: GET http://metadata.google.internal/computeMetadata/v1/instance/service-accounts/default/?recursive=true
DEBUG:urllib3.connectionpool:Starting new HTTP connection (1): metadata.google.internal:80
DEBUG:urllib3.connectionpool:http://metadata.google.internal:80 "GET /computeMetadata/v1/instance/service-accounts/default/?recursive=true
HTTP/1.1" 200 144
DEBUG:google.auth.transport.requests:Making request: GET http://metadata.google.internal/computeMetadata/v1/instance/service-accounts/844138762903-compute@developer.gserviceaccount.com/token?scopes=https%3A%2F%2Fwww.googleapis.com%2Fauth%2Fcloud-platform%2Chttps%3A%2F%2Fwww.googleapis.com%2Fauth%2Fpubsub
DEBUG:urllib3.connectionpool:http://metadata.google.internal:80 "GET /computeMetadata/v1/instance/service-accounts/844138762903-compute@developer.gserviceaccount.com/token?scopes=https%3A%2F%2Fwww.googleapis.com%2Fauth%2Fcloud-platform%2Chttps%3A%2F%2Fwww.googleapis.com%2Fauth%2Fpubsub
HTTP/1.1" 200 241

> Task :sdks:python:test-suites:dataflow:py36:preCommitIT_streaming_V2
Worker logs: https://console.cloud.google.com/dataflow/jobs/us-central1/2021-01-08_16_33_44-15647697560562727474?project=apache-beam-testing
test_streaming_wordcount_it (apache_beam.examples.streaming_wordcount_it_test.StreamingWordCountIT)
... ok

----------------------------------------------------------------------
XML: nosetests-preCommitIT-df-py36.xml
----------------------------------------------------------------------
XML: <https://ci-beam.apache.org/job/beam_PreCommit_Python_Cron/ws/src/sdks/python/nosetests.xml>
----------------------------------------------------------------------
Ran 1 test in 546.005s

OK

> Task :sdks:python:test-suites:dataflow:py37:preCommitIT_streaming_V2
Worker logs: https://console.cloud.google.com/dataflow/jobs/us-central1/2021-01-08_16_34_19-2969077505530597073?project=apache-beam-testing
test_streaming_wordcount_it (apache_beam.examples.streaming_wordcount_it_test.StreamingWordCountIT)
... ok

----------------------------------------------------------------------
XML: nosetests-preCommitIT-df-py37.xml
----------------------------------------------------------------------
XML: <https://ci-beam.apache.org/job/beam_PreCommit_Python_Cron/ws/src/sdks/python/nosetests.xml>
----------------------------------------------------------------------
Ran 1 test in 566.426s

OK

> Task :sdks:python:test-suites:dataflow:preCommitIT_V2

FAILURE: Build completed with 3 failures.

1: Task failed with an exception.
-----------
* What went wrong:
Execution failed for task ':sdks:python:test-suites:tox:py38:testPy38CloudCoverage'.
> Process 'command 'sh'' finished with non-zero exit value 1

* Try:
Run with --stacktrace option to get the stack trace. Run with --info or --debug option to
get more log output. Run with --scan to get full insights.
==============================================================================

2: Task failed with an exception.
-----------
* What went wrong:
Execution failed for task ':sdks:python:test-suites:tox:py37:testPy37Cloud'.
> Process 'command 'sh'' finished with non-zero exit value 1

* Try:
Run with --stacktrace option to get the stack trace. Run with --info or --debug option to
get more log output. Run with --scan to get full insights.
==============================================================================

3: Task failed with an exception.
-----------
* What went wrong:
Execution failed for task ':sdks:python:test-suites:tox:py36:testPy36Cloud'.
> Process 'command 'sh'' finished with non-zero exit value 1

* Try:
Run with --stacktrace option to get the stack trace. Run with --info or --debug option to
get more log output. Run with --scan to get full insights.
==============================================================================

* Get more help at https://help.gradle.org

Deprecated Gradle features were used in this build, making it incompatible with Gradle 7.0.
Use '--warning-mode all' to show the individual deprecation warnings.
See https://docs.gradle.org/6.7.1/userguide/command_line_interface.html#sec:command_line_warnings

BUILD FAILED in 42m 22s
101 actionable tasks: 74 executed, 27 from cache
Gradle was unable to watch the file system for changes. The inotify watches limit is too low.

Publishing build scan...
https://gradle.com/s/icfrafksbfjga

Build step 'Invoke Gradle script' changed build result to FAILURE
Build step 'Invoke Gradle script' marked build as failure

---------------------------------------------------------------------
To unsubscribe, e-mail: builds-unsubscribe@beam.apache.org
For additional commands, e-mail: builds-help@beam.apache.org


Mime
View raw message