beam-builds mailing list archives

Site index · List index
Message view « Date » · « Thread »
Top « Date » · « Thread »
From Apache Jenkins Server <jenk...@builds.apache.org>
Subject Build failed in Jenkins: beam_PostCommit_Go_VR_Flink #4321
Date Fri, 29 Jan 2021 12:29:38 GMT
See <https://ci-beam.apache.org/job/beam_PostCommit_Go_VR_Flink/4321/display/redirect>

Changes:


------------------------------------------
[...truncated 269.93 KB...]
      >
      component_coder_ids: "c13"
    >
  >
  coders: <
    key: "c15"
    value: <
      spec: <
        urn: "beam:coder:iterable:v1"
      >
      component_coder_ids: "c14"
    >
  >
  coders: <
    key: "c16"
    value: <
      spec: <
        urn: "beam:coder:kv:v1"
      >
      component_coder_ids: "c7"
      component_coder_ids: "c15"
    >
  >
  coders: <
    key: "c17"
    value: <
      spec: <
        urn: "beam:coder:kv:v1"
      >
      component_coder_ids: "c3"
      component_coder_ids: "c3"
    >
  >
  coders: <
    key: "c18"
    value: <
      spec: <
        urn: "beam:coder:iterable:v1"
      >
      component_coder_ids: "c3"
    >
  >
  coders: <
    key: "c19"
    value: <
      spec: <
        urn: "beam:coder:kv:v1"
      >
      component_coder_ids: "c3"
      component_coder_ids: "c18"
    >
  >
  coders: <
    key: "c2"
    value: <
      spec: <
        urn: "beam:go:coder:custom:v1"
        payload: "Cgd2YXJpbnR6EgIIAhqFAQpxZ2l0aHViLmNvbS9hcGFjaGUvYmVhbS9zZGtzL2dvL3Rlc3QvdmVuZG9yL2dpdGh1Yi5jb20vYXBhY2hlL2JlYW0vc2Rrcy9nby9wa2cvYmVhbS9jb3JlL3J1bnRpbWUvY29kZXJ4LmVuY1ZhckludFoSEAgWIgQIGUAPKgYIFBICCAgikQEKcWdpdGh1Yi5jb20vYXBhY2hlL2JlYW0vc2Rrcy9nby90ZXN0L3ZlbmRvci9naXRodWIuY29tL2FwYWNoZS9iZWFtL3Nka3MvZ28vcGtnL2JlYW0vY29yZS9ydW50aW1lL2NvZGVyeC5kZWNWYXJJbnRaEhwIFiIECBlAAyIGCBQSAggIKgQIGUAPKgQIGUAB"
      >
    >
  >
  coders: <
    key: "c3"
    value: <
      spec: <
        urn: "beam:coder:length_prefix:v1"
      >
      component_coder_ids: "c2"
    >
  >
  coders: <
    key: "c4"
    value: <
      spec: <
        urn: "beam:coder:kv:v1"
      >
      component_coder_ids: "c3"
      component_coder_ids: "c0"
    >
  >
  coders: <
    key: "c5"
    value: <
      spec: <
        urn: "beam:coder:iterable:v1"
      >
      component_coder_ids: "c0"
    >
  >
  coders: <
    key: "c6"
    value: <
      spec: <
        urn: "beam:coder:kv:v1"
      >
      component_coder_ids: "c3"
      component_coder_ids: "c5"
    >
  >
  coders: <
    key: "c7"
    value: <
      spec: <
        urn: "beam:coder:string_utf8:v1"
      >
    >
  >
  coders: <
    key: "c8"
    value: <
      spec: <
        urn: "beam:coder:kv:v1"
      >
      component_coder_ids: "c7"
      component_coder_ids: "c3"
    >
  >
  coders: <
    key: "c9"
    value: <
      spec: <
        urn: "beam:coder:kv:v1"
      >
      component_coder_ids: "c7"
      component_coder_ids: "c7"
    >
  >
  environments: <
    key: "go"
    value: <
      urn: "beam:env:docker:v1"
      payload: "\nAus.gcr.io/apache-beam-testing/jenkins/beam_go_sdk:20210129-120625"
      capabilities: "beam:protocol:progress_reporting:v0"
      capabilities: "beam:protocol:multi_core_bundle_processing:v1"
      capabilities: "beam:version:sdk_base:go"
      capabilities: "beam:coder:bytes:v1"
      capabilities: "beam:coder:bool:v1"
      capabilities: "beam:coder:varint:v1"
      capabilities: "beam:coder:double:v1"
      capabilities: "beam:coder:string_utf8:v1"
      capabilities: "beam:coder:length_prefix:v1"
      capabilities: "beam:coder:kv:v1"
      capabilities: "beam:coder:iterable:v1"
      capabilities: "beam:coder:state_backed_iterable:v1"
      capabilities: "beam:coder:windowed_value:v1"
      capabilities: "beam:coder:global_window:v1"
      capabilities: "beam:coder:interval_window:v1"
      dependencies: <
        type_urn: "beam:artifact:type:go_worker_binary:v1"
        role_urn: "beam:artifact:role:staging_to:v1"
        role_payload: "\n\006worker"
      >
    >
  >
>
root_transform_ids: "e1"
root_transform_ids: "e5"
root_transform_ids: "e3"
root_transform_ids: "s1"
root_transform_ids: "e11_reshuffle"
root_transform_ids: "e12"
root_transform_ids: "s5"
root_transform_ids: "s3"
root_transform_ids: "s2"
root_transform_ids: "s4"
2021/01/29 12:29:33 Test reshuffle:reshufflekv failed: 	connecting to job service
failed to dial server at localhost:57553
	caused by:
context deadline exceeded
2021/01/29 12:29:33 Result: 11 tests failed

if [[ ! -z "$JOB_PORT" ]]; then
  # Shut down the job server
  kill %1 || echo "Failed to shut down job server"
fi

if [[ "$PUSH_CONTAINER_TO_GCR" = 'yes' ]]; then
  # Delete the container locally and remotely
  docker rmi $CONTAINER:$TAG || echo "Failed to remove container"
  gcloud --quiet container images delete $CONTAINER:$TAG || echo "Failed to delete container"

  # Clean up tempdir
  rm -rf $TMPDIR
fi
Untagged: us.gcr.io/apache-beam-testing/jenkins/beam_go_sdk:20210129-120625
Untagged: us.gcr.io/apache-beam-testing/jenkins/beam_go_sdk@sha256:9594de42a55cef7b689c4c9db900d44cdcabe9088d1231e1b2818dc269f25178
Deleted: sha256:fe6730120ab81c515a3afb28c34044bb1f753cf8f915458954987dfa5490bc60
Deleted: sha256:3785c13b8d43f74ce90a58008c35e78baaca05ac86da3fa24d1683afc57c6af0
Deleted: sha256:9334fb3200381905827c27af1bfc551df8b10254f85d5780b1520834199283ca
Deleted: sha256:b4777433dba1986feab3c3aba3cea53347d2c69282d874da3958c57b17fe6931
Deleted: sha256:8c37db094780a34f925f6032b4acf6434e971b4c54e7912fd312561109f0bbb8
Deleted: sha256:2f36236175b09a4a0fed66f23423b7f11567d4988f408027d3373f8dbe05ea34
Deleted: sha256:0ae2cf22efe42a3c2b0474bed8fe9b0cb8e1faa409a4664ccb4c4203333b7598
Deleted: sha256:cff53fe95ef95b76fb7e33874f5d33b9b612eefbe13cae42060539fc1e89aa25
Deleted: sha256:2d74f26e1ca6cf05ebdc591b7bf854bd8e08c4d367f6c1e9824ab4a2a0c4caa4
Deleted: sha256:ba176336ce0f05b84a41c6b0a9cc9e68cbed45c38cc0ff78f5196e9be3f7879e
Deleted: sha256:11be0ec07da9f8c3aafb9722ccf3757b44a959cc98b5915d1c25bcb9c7a1d29c
Deleted: sha256:cdc6be22af49a78e054044d2f56611a805fad1604a8c1430514976414f1cee97
Deleted: sha256:17ac6a552d6fe5651445ff31dcbd0792458c33646b3f78c202b7a92bdc811deb
Deleted: sha256:50f8d15e03b7c88b4d25e91ff36d4599f440649b28b6ae5f455e3071c0835cd1
Deleted: sha256:3fc7d2879d801cad23ce7ff65f5a2f99afd574b426a3ee29e7be501c4e327e84
Deleted: sha256:542520fdded0b700d326579c19398838369d31e636901e0e376274a8b3472e05
Deleted: sha256:7cbf087af93649b96d38dc93fc0deea66a3d948fc30175634b266df3acd7e519
Digests:
- us.gcr.io/apache-beam-testing/jenkins/beam_go_sdk@sha256:9594de42a55cef7b689c4c9db900d44cdcabe9088d1231e1b2818dc269f25178
  Associated tags:
 - 20210129-120625
Tags:
- us.gcr.io/apache-beam-testing/jenkins/beam_go_sdk:20210129-120625
Deleted [us.gcr.io/apache-beam-testing/jenkins/beam_go_sdk:20210129-120625].
Deleted [us.gcr.io/apache-beam-testing/jenkins/beam_go_sdk@sha256:9594de42a55cef7b689c4c9db900d44cdcabe9088d1231e1b2818dc269f25178].
>>> FAILURE

if [[ "$TEST_EXIT_CODE" -eq 0 ]]; then
  echo ">>> SUCCESS"
else
  echo ">>> FAILURE"
fi
exit $TEST_EXIT_CODE

> Task :sdks:go:test:flinkValidatesRunner FAILED

FAILURE: Build failed with an exception.

* Where:
Build file '<https://ci-beam.apache.org/job/beam_PostCommit_Go_VR_Flink/ws/src/sdks/go/test/build.gradle'>
line: 150

* What went wrong:
Execution failed for task ':sdks:go:test:flinkValidatesRunner'.
> Process 'command 'sh'' finished with non-zero exit value 1

* Try:
Run with --stacktrace option to get the stack trace. Run with --info or --debug option to
get more log output. Run with --scan to get full insights.

* Get more help at https://help.gradle.org

Deprecated Gradle features were used in this build, making it incompatible with Gradle 7.0.
Use '--warning-mode all' to show the individual deprecation warnings.
See https://docs.gradle.org/6.8/userguide/command_line_interface.html#sec:command_line_warnings

BUILD FAILED in 29m 16s
130 actionable tasks: 88 executed, 42 from cache
Gradle was unable to watch the file system for changes. The inotify watches limit is too low.

Publishing build scan...
https://gradle.com/s/6v5fjrjapivzq

Build step 'Invoke Gradle script' changed build result to FAILURE
Build step 'Invoke Gradle script' marked build as failure

---------------------------------------------------------------------
To unsubscribe, e-mail: builds-unsubscribe@beam.apache.org
For additional commands, e-mail: builds-help@beam.apache.org


Mime
View raw message