beam-builds mailing list archives

Site index · List index
Message view « Date » · « Thread »
Top « Date » · « Thread »
From Apache Jenkins Server <jenk...@builds.apache.org>
Subject Build failed in Jenkins: beam_PostCommit_Java_VR_Dataflow_V2_Streaming #351
Date Sun, 31 Jan 2021 04:09:42 GMT
See <https://ci-beam.apache.org/job/beam_PostCommit_Java_VR_Dataflow_V2_Streaming/351/display/redirect>

Changes:


------------------------------------------
[...truncated 54.17 KB...]
> Task :sdks:go:resolveBuildDependencies
Resolving go.opencensus.io: commit='3fb168f674736c026e623310bfccb0691e6dec8a', urls=[https://github.com/census-instrumentation/opencensus-go]
Resolving golang.org/x/crypto: commit='d9133f5469342136e669e85192a26056b587f503', urls=[https://go.googlesource.com/crypto]
Resolving golang.org/x/debug: commit='95515998a8a4bd7448134b2cb5971dbeb12e0b77', urls=[https://go.googlesource.com/debug]

> Task :runners:java-fn-execution:compileJava FROM-CACHE
> Task :runners:java-fn-execution:classes UP-TO-DATE

> Task :sdks:java:container:pullLicenses
INFO:root:Pulling license for 199 dependencies using 16 threads.

> Task :runners:java-fn-execution:jar
> Task :sdks:java:expansion-service:compileJava FROM-CACHE
> Task :sdks:java:expansion-service:classes UP-TO-DATE
> Task :sdks:java:expansion-service:jar
> Task :runners:direct-java:compileJava FROM-CACHE
> Task :runners:direct-java:classes UP-TO-DATE
> Task :sdks:java:io:kafka:compileJava FROM-CACHE
> Task :sdks:java:io:kafka:classes UP-TO-DATE

> Task :sdks:go:resolveBuildDependencies
Resolving golang.org/x/net: commit='2fb46b16b8dda405028c50f7c7f0f9dd1fa6bfb1', urls=[https://go.googlesource.com/net]

> Task :sdks:java:io:kafka:jar
> Task :runners:direct-java:shadowJar FROM-CACHE
> Task :sdks:java:io:google-cloud-platform:compileJava FROM-CACHE
> Task :sdks:java:io:google-cloud-platform:classes UP-TO-DATE
> Task :sdks:java:io:google-cloud-platform:jar
> Task :runners:google-cloud-dataflow-java:compileJava FROM-CACHE
> Task :runners:google-cloud-dataflow-java:classes
> Task :sdks:java:container:java8:copyDockerfileDependencies
> Task :runners:google-cloud-dataflow-java:jar

> Task :sdks:java:container:pullLicenses
INFO:root:pull_licenses_java.py succeed. It took 2.748677 seconds with 16 threads.

> Task :sdks:java:io:google-cloud-platform:compileTestJava FROM-CACHE
> Task :sdks:java:io:google-cloud-platform:testClasses

> Task :sdks:go:resolveBuildDependencies
Resolving golang.org/x/oauth2: commit='5d25da1a8d43b66f2898c444f899c7bcfd6a407e', urls=[https://go.googlesource.com/oauth2]
Resolving golang.org/x/sync: commit='fd80eb99c8f653c847d294a001bdf2a3a6f768f5', urls=[https://go.googlesource.com/sync]

> Task :sdks:java:container:java8:copyJavaThirdPartyLicenses NO-SOURCE

> Task :sdks:java:container:goPrepare
Use project GOPATH: <https://ci-beam.apache.org/job/beam_PostCommit_Java_VR_Dataflow_V2_Streaming/ws/src/sdks/java/container/.gogradle/project_gopath>

> Task :sdks:java:io:google-cloud-platform:testJar
> Task :runners:google-cloud-dataflow-java:compileTestJava FROM-CACHE
> Task :runners:google-cloud-dataflow-java:testClasses UP-TO-DATE
> Task :runners:google-cloud-dataflow-java:testJar

> Task :sdks:go:resolveBuildDependencies
Resolving golang.org/x/sys: commit='fde4db37ae7ad8191b03d30d27f258b5291ae4e3', urls=[https://go.googlesource.com/sys]
Resolving golang.org/x/text: commit='23ae387dee1f90d29a23c0e87ee0b46038fbed0e', urls=[https://go.googlesource.com/text]
Resolving cached github.com/etcd-io/etcd: commit='11214aa33bf5a47d3d9d8dafe0f6b97237dfe921',
urls=[https://github.com/etcd-io/etcd.git, git@github.com:etcd-io/etcd.git]

> Task :release:go-licenses:java:dockerRun
+ go-licenses save github.com/apache/beam/sdks/java/container --save_path=/output/licenses
+ go-licenses csv github.com/apache/beam/sdks/java/container
+ tee /output/licenses/list.csv
+ chmod -R a+w /output/licenses

> Task :release:go-licenses:java:createLicenses
> Task :sdks:java:container:java8:copyGolangLicenses

> Task :sdks:go:resolveBuildDependencies
Resolving google.golang.org/api: commit='0324d5e90dc7753607860272666845fad9ceb97e', urls=[https://code.googlesource.com/google-api-go-client]
Resolving google.golang.org/genproto: commit='4d944d34d83c502a5f761500a14d8842648415c3', urls=[https://github.com/google/go-genproto]
Resolving google.golang.org/grpc: commit='5e8f83304c0563d1ba74db05fee83d9c18ab9a58', urls=[https://github.com/grpc/grpc-go]
Resolving google.golang.org/protobuf: commit='d165be301fb1e13390ad453281ded24385fd8ebc', urls=[https://go.googlesource.com/protobuf]
Resolving cached github.com/etcd-io/etcd: commit='11214aa33bf5a47d3d9d8dafe0f6b97237dfe921',
urls=[https://github.com/etcd-io/etcd.git, git@github.com:etcd-io/etcd.git]
Resolving cached github.com/etcd-io/etcd: commit='11214aa33bf5a47d3d9d8dafe0f6b97237dfe921',
urls=[https://github.com/etcd-io/etcd.git, git@github.com:etcd-io/etcd.git]

> Task :sdks:go:installDependencies
> Task :sdks:go:buildLinuxAmd64
> Task :sdks:go:goBuild

> Task :sdks:java:container:resolveBuildDependencies
Resolving ./github.com/apache/beam/sdks/go@<https://ci-beam.apache.org/job/beam_PostCommit_Java_VR_Dataflow_V2_Streaming/ws/src/sdks/go>

> Task :sdks:java:container:installDependencies

> Task :sdks:java:container:buildLinuxAmd64
Unable to watch the file system for changes. The inotify watches limit is too low.

> Task :sdks:java:container:goBuild
> Task :sdks:java:container:java8:copySdkHarnessLauncher
> Task :sdks:java:container:java8:dockerPrepare
> Task :sdks:java:container:java8:docker

> Task :runners:google-cloud-dataflow-java:buildAndPushDockerContainer
WARNING: `gcloud docker` will not be supported for Docker client versions above 18.03.

As an alternative, use `gcloud auth configure-docker` to configure `docker` to
use `gcloud` as a credential helper, then use `docker` as you would for non-GCR
registries, e.g. `docker pull gcr.io/project-id/my-image`. Add
`--verbosity=error` to silence this warning: `gcloud docker
--verbosity=error -- pull gcr.io/project-id/my-image`.

See: https://cloud.google.com/container-registry/docs/support/deprecation-notices#gcloud-docker

The push refers to repository [us.gcr.io/apache-beam-testing/java-postcommit-it/java]
6598686af1d5: Preparing
fb732d379805: Preparing
bcc3420d0dcd: Preparing
298f9f0f3bfa: Preparing
b4f16427f4e9: Preparing
8ae9ca523551: Preparing
8d102aff3d58: Preparing
6a9a1ab24822: Preparing
3adb5f756be1: Preparing
db8e9ba1cf20: Preparing
52944d79c91f: Preparing
25b2e6cfc187: Preparing
7df6dd475950: Preparing
7496c5e8691b: Preparing
aa7af8a465c6: Preparing
ef9a7b8862f4: Preparing
a1f2f42922b1: Preparing
52944d79c91f: Waiting
aa7af8a465c6: Waiting
7df6dd475950: Waiting
4762552ad7d8: Preparing
25b2e6cfc187: Waiting
8ae9ca523551: Waiting
4762552ad7d8: Waiting
ef9a7b8862f4: Waiting
6a9a1ab24822: Waiting
db8e9ba1cf20: Waiting
a1f2f42922b1: Waiting
7496c5e8691b: Waiting
3adb5f756be1: Waiting
b4f16427f4e9: Pushed
fb732d379805: Pushed
298f9f0f3bfa: Pushed
6598686af1d5: Pushed
bcc3420d0dcd: Pushed
6a9a1ab24822: Pushed
8d102aff3d58: Pushed
25b2e6cfc187: Layer already exists
7df6dd475950: Layer already exists
7496c5e8691b: Layer already exists
aa7af8a465c6: Layer already exists
ef9a7b8862f4: Layer already exists
a1f2f42922b1: Layer already exists
4762552ad7d8: Layer already exists
db8e9ba1cf20: Pushed
52944d79c91f: Pushed
8ae9ca523551: Pushed
3adb5f756be1: Pushed
20210131000103: digest: sha256:e04f1564145191f91bbadaaaa4ebf864090ec699ff14825bb20302bf25da5f42
size: 4098

> Task :runners:google-cloud-dataflow-java:validatesRunnerV2TestStreaming

org.apache.beam.sdk.transforms.CombineTest$BasicTests > testBasicCombine FAILED
    java.lang.RuntimeException at CombineTest.java:678

org.apache.beam.sdk.transforms.CombineTest$WindowingTests > testSlidingWindowsCombine FAILED
    java.lang.RuntimeException at CombineTest.java:1164

org.apache.beam.sdk.transforms.ParDoTest$StateTests > testValueStateSimple FAILED
    java.lang.RuntimeException at ParDoTest.java:1932

org.apache.beam.sdk.transforms.CreateTest > testCreateWithVoidType FAILED
    java.lang.RuntimeException at CreateTest.java:330

org.apache.beam.sdk.transforms.GroupByKeyTest > org.apache.beam.sdk.transforms.GroupByKeyTest$WindowTests.testGroupByKeyMergingWindows
FAILED
    java.lang.RuntimeException at GroupByKeyTest.java:585

org.apache.beam.sdk.transforms.ParDoSchemaTest > testSimpleSchemaPipeline FAILED
    java.lang.RuntimeException at ParDoSchemaTest.java:117

org.apache.beam.sdk.transforms.ViewTest > testIterableSideInput FAILED
    java.lang.RuntimeException at ViewTest.java:442

org.apache.beam.sdk.transforms.ViewTest > testMapSideInputIsImmutable FAILED
    java.lang.RuntimeException at ViewTest.java:1348

org.apache.beam.sdk.transforms.ParDoTest$MultipleInputsAndOutputTests > testParDoWithOnlyTaggedOutput
FAILED
    java.lang.RuntimeException at ParDoTest.java:768

232 tests completed, 9 failed, 2 skipped

> Task :runners:google-cloud-dataflow-java:validatesRunnerV2TestStreaming FAILED

> Task :runners:google-cloud-dataflow-java:cleanUpDockerImages
Untagged: us.gcr.io/apache-beam-testing/java-postcommit-it/java:20210131000103
Untagged: us.gcr.io/apache-beam-testing/java-postcommit-it/java@sha256:e04f1564145191f91bbadaaaa4ebf864090ec699ff14825bb20302bf25da5f42
Deleted: sha256:dfd38bf7b86aaca43c888579d47d2d78c1d860cbd3f90ceff36a2dbae4f60449
Deleted: sha256:6841ae74943687e4f2adcfcc222ec0a0d0dfdd08cffd1102cd1cb85bf531c9c4
Deleted: sha256:7bdf0bae084c3c3a8d625a9710dde53a9b06420b7b5fe9a7aad7ea76600913e8
Deleted: sha256:22586240fb29c9d6a07fbdc71eacdbcc457036e3b84682f7cc465c3e31b5d18d
Deleted: sha256:36cf8f77374a71484c0dea264369e91daf32c976d90b5df9e7a8109b98a00810
Deleted: sha256:072e8f328c6a0e158edaa2480c06d23c34e14276c7727b31ab30d0da94b7688d
Deleted: sha256:43ed960472f356e534e0d26e8de1108c2997bac195d9205db795e9ddd8841db3
Deleted: sha256:c9a568316a4f5364bd20689b4c9feb4a11933991dee8b1d0f31b1979de0764a8
Deleted: sha256:dbdeca545ff26bec38d37bc192d5e3612ffa6e0fd1e569c607e5da5519f0f871
Deleted: sha256:fe91d4cd0ac08c19e7fac8efe139639ce425b1ec945e7383b61d30f9eb6a304a
Deleted: sha256:50f991873004c4108d9157cdc073df30fa3e70f3e60648af0a3358198561c49a
Deleted: sha256:005afaecc91258de2a76863a5873df6e162ddc88296c2cd1c444f719ddf88a55
Deleted: sha256:a992423ef8a2c13c3e43121b32b5a9d48a524b7d7dfc24c50c5483826c5314df
Deleted: sha256:baa9653e7630d0abf1686f7c4ea326efa705256b7abc207ac720b020e5d445a6
Deleted: sha256:6d66a76f68ef869e69b6f21488a564a9bc1d68f91543e1ef53e5dfca4e363e6f
Deleted: sha256:b1a0c3fe68fdcff661f8dee77efeb23e75f323009ed8178c60db96bc5e2124a2
Deleted: sha256:d74f9f370d84d792bbef70396b8c35d72f31a19a9bb8c278d1d7f202027c460a
Deleted: sha256:8cdb4a62ad52f883d18dfd253ca02b6351c3c35105f4efcef1a633767759c9a3
Deleted: sha256:ad689eadb33ad64d5e039eb9770bbe74490de1b6e73fe481b1dfd9cce619c20a
Deleted: sha256:5f94e0d5d0c2ad0894dd3f64303edf318bc5f594a41e1f650340c994b58018a9
Deleted: sha256:9ff32b5c87749ae91ce5371ac322d58b4a4f32bf5a481c2f8bff51718fb5d807
Deleted: sha256:c2da6995263f9a43027c808eb9721b02242c1a71762a7f228aca0b0229c9556b
Deleted: sha256:ddd281b6998265895c9fe0df2c52364cfa6c4101aabeedf93d333fdeaf1dd7bf
Deleted: sha256:7e1c47bf67437aa4b72dcc4d21c8db8721ab8f9d1e78e72c6ad9111a590104c5
Deleted: sha256:699dfdf3afca6acb0082fa63d18cdd072a5a7d9edbb15ada03b8449588f68b36
Deleted: sha256:479acc8fe615ff7cd774f7e06dec2aaeb12d8fdc351ed66a3b42c750ea6c4f01
Digests:
- us.gcr.io/apache-beam-testing/java-postcommit-it/java@sha256:e04f1564145191f91bbadaaaa4ebf864090ec699ff14825bb20302bf25da5f42
  Associated tags:
 - 20210131000103
Tags:
- us.gcr.io/apache-beam-testing/java-postcommit-it/java:20210131000103
Deleted [us.gcr.io/apache-beam-testing/java-postcommit-it/java:20210131000103].
Deleted [us.gcr.io/apache-beam-testing/java-postcommit-it/java@sha256:e04f1564145191f91bbadaaaa4ebf864090ec699ff14825bb20302bf25da5f42].

FAILURE: Build failed with an exception.

* What went wrong:
Execution failed for task ':runners:google-cloud-dataflow-java:validatesRunnerV2TestStreaming'.
> There were failing tests. See the report at: file://<https://ci-beam.apache.org/job/beam_PostCommit_Java_VR_Dataflow_V2_Streaming/ws/src/runners/google-cloud-dataflow-java/build/reports/tests/validatesRunnerV2TestStreaming/index.html>

* Try:
Run with --stacktrace option to get the stack trace. Run with --info or --debug option to
get more log output. Run with --scan to get full insights.

* Get more help at https://help.gradle.org

Deprecated Gradle features were used in this build, making it incompatible with Gradle 7.0.
Use '--warning-mode all' to show the individual deprecation warnings.
See https://docs.gradle.org/6.8/userguide/command_line_interface.html#sec:command_line_warnings

BUILD FAILED in 4h 9m 11s
123 actionable tasks: 83 executed, 38 from cache, 2 up-to-date
Gradle was unable to watch the file system for changes. The inotify watches limit is too low.

Publishing build scan...
https://gradle.com/s/hhf55fudandzm

Build step 'Invoke Gradle script' changed build result to FAILURE
Build step 'Invoke Gradle script' marked build as failure

---------------------------------------------------------------------
To unsubscribe, e-mail: builds-unsubscribe@beam.apache.org
For additional commands, e-mail: builds-help@beam.apache.org


Mime
View raw message