beam-builds mailing list archives

Site index · List index
Message view « Date » · « Thread »
Top « Date » · « Thread »
From Apache Jenkins Server <jenk...@builds.apache.org>
Subject Build failed in Jenkins: beam_PostCommit_Java_VR_Dataflow_V2_Streaming #348
Date Sat, 30 Jan 2021 10:10:16 GMT
See <https://ci-beam.apache.org/job/beam_PostCommit_Java_VR_Dataflow_V2_Streaming/348/display/redirect?page=changes>

Changes:

[Kyle Weaver] [BEAM-11634] Give JobInvoker threads unique names.

[Kyle Weaver] [BEAM-10925] Add rule to replace Calc with BeamCalcRel for ZetaSQL UDFs.

[noreply] [BEAM-5214] Update java quickstart (#13833)


------------------------------------------
[...truncated 45.02 KB...]
Resolving github.com/stathat/go: commit='74669b9f388d9d788c97399a0824adbfee78400e', urls=[https://github.com/stathat/go.git,
git@github.com:stathat/go.git]
Resolving cached github.com/etcd-io/etcd: commit='11214aa33bf5a47d3d9d8dafe0f6b97237dfe921',
urls=[https://github.com/etcd-io/etcd.git, git@github.com:etcd-io/etcd.git]
Resolving cached github.com/etcd-io/etcd: commit='11214aa33bf5a47d3d9d8dafe0f6b97237dfe921',
urls=[https://github.com/etcd-io/etcd.git, git@github.com:etcd-io/etcd.git]
Resolving cached github.com/etcd-io/etcd: commit='11214aa33bf5a47d3d9d8dafe0f6b97237dfe921',
urls=[https://github.com/etcd-io/etcd.git, git@github.com:etcd-io/etcd.git]
Resolving cached github.com/etcd-io/etcd: commit='11214aa33bf5a47d3d9d8dafe0f6b97237dfe921',
urls=[https://github.com/etcd-io/etcd.git, git@github.com:etcd-io/etcd.git]
Resolving github.com/xordataexchange/crypt: commit='b2862e3d0a775f18c7cfe02273500ae307b61218',
urls=[https://github.com/xordataexchange/crypt.git, git@github.com:xordataexchange/crypt.git]

> Task :runners:local-java:jar
> Task :runners:core-construction-java:jar
> Task :runners:core-java:compileJava FROM-CACHE
> Task :runners:core-java:classes UP-TO-DATE
> Task :runners:core-java:jar
> Task :sdks:java:extensions:protobuf:extractIncludeProto
> Task :sdks:java:extensions:protobuf:generateProto NO-SOURCE
> Task :sdks:java:extensions:protobuf:compileJava FROM-CACHE
> Task :sdks:java:extensions:protobuf:classes UP-TO-DATE
> Task :sdks:java:extensions:google-cloud-platform-core:compileJava FROM-CACHE
> Task :sdks:java:extensions:google-cloud-platform-core:classes UP-TO-DATE
> Task :sdks:java:extensions:protobuf:jar
> Task :sdks:java:extensions:google-cloud-platform-core:jar
> Task :sdks:java:io:common:compileTestJava FROM-CACHE
> Task :sdks:java:io:common:testClasses UP-TO-DATE
> Task :sdks:java:io:common:testJar
> Task :sdks:java:harness:compileJava FROM-CACHE
> Task :sdks:java:harness:classes UP-TO-DATE
> Task :sdks:java:testing:test-utils:compileJava FROM-CACHE
> Task :sdks:java:testing:test-utils:classes UP-TO-DATE
> Task :sdks:java:testing:test-utils:jar
> Task :sdks:java:testing:test-utils:compileTestJava FROM-CACHE
> Task :sdks:java:testing:test-utils:testClasses UP-TO-DATE
> Task :sdks:java:harness:jar
> Task :sdks:java:testing:test-utils:testJar
> Task :sdks:java:core:compileTestJava FROM-CACHE
> Task :sdks:java:core:testClasses

> Task :sdks:go:resolveBuildDependencies
Resolving go.opencensus.io: commit='3fb168f674736c026e623310bfccb0691e6dec8a', urls=[https://github.com/census-instrumentation/opencensus-go]

> Task :sdks:java:core:shadowTestJar FROM-CACHE

> Task :sdks:java:container:pullLicenses
INFO:root:Pulling license for 199 dependencies using 16 threads.

> Task :sdks:java:extensions:google-cloud-platform-core:compileTestJava FROM-CACHE
> Task :sdks:java:extensions:google-cloud-platform-core:testClasses UP-TO-DATE
> Task :sdks:java:extensions:google-cloud-platform-core:testJar
> Task :runners:core-construction-java:compileTestJava FROM-CACHE
> Task :runners:core-construction-java:testClasses UP-TO-DATE
> Task :sdks:java:harness:shadowJar FROM-CACHE
> Task :runners:core-construction-java:testJar

> Task :sdks:go:resolveBuildDependencies
Resolving golang.org/x/crypto: commit='d9133f5469342136e669e85192a26056b587f503', urls=[https://go.googlesource.com/crypto]
Resolving golang.org/x/debug: commit='95515998a8a4bd7448134b2cb5971dbeb12e0b77', urls=[https://go.googlesource.com/debug]
Resolving golang.org/x/net: commit='2fb46b16b8dda405028c50f7c7f0f9dd1fa6bfb1', urls=[https://go.googlesource.com/net]
Resolving golang.org/x/oauth2: commit='5d25da1a8d43b66f2898c444f899c7bcfd6a407e', urls=[https://go.googlesource.com/oauth2]
Resolving golang.org/x/sync: commit='fd80eb99c8f653c847d294a001bdf2a3a6f768f5', urls=[https://go.googlesource.com/sync]

> Task :runners:java-fn-execution:compileJava FROM-CACHE
> Task :runners:java-fn-execution:classes UP-TO-DATE

> Task :sdks:java:container:pullLicenses
INFO:root:pull_licenses_java.py succeed. It took 4.227526 seconds with 16 threads.

> Task :runners:java-fn-execution:jar
> Task :sdks:java:container:java8:copyJavaThirdPartyLicenses NO-SOURCE
> Task :sdks:java:expansion-service:compileJava FROM-CACHE
> Task :sdks:java:expansion-service:classes UP-TO-DATE
> Task :sdks:java:expansion-service:jar
> Task :runners:direct-java:compileJava FROM-CACHE
> Task :runners:direct-java:classes UP-TO-DATE
> Task :sdks:java:io:kafka:compileJava FROM-CACHE
> Task :sdks:java:io:kafka:classes UP-TO-DATE
> Task :sdks:java:io:kafka:jar
> Task :runners:direct-java:shadowJar FROM-CACHE
> Task :sdks:java:io:google-cloud-platform:compileJava FROM-CACHE
> Task :sdks:java:io:google-cloud-platform:classes UP-TO-DATE
> Task :sdks:java:io:google-cloud-platform:jar
> Task :runners:google-cloud-dataflow-java:compileJava FROM-CACHE
> Task :runners:google-cloud-dataflow-java:classes
> Task :sdks:java:container:java8:copyDockerfileDependencies
> Task :runners:google-cloud-dataflow-java:jar
> Task :sdks:java:io:google-cloud-platform:compileTestJava FROM-CACHE
> Task :sdks:java:io:google-cloud-platform:testClasses
> Task :sdks:java:io:google-cloud-platform:testJar
> Task :runners:google-cloud-dataflow-java:compileTestJava FROM-CACHE
> Task :runners:google-cloud-dataflow-java:testClasses UP-TO-DATE
> Task :runners:google-cloud-dataflow-java:testJar

> Task :sdks:go:resolveBuildDependencies
Resolving golang.org/x/sys: commit='fde4db37ae7ad8191b03d30d27f258b5291ae4e3', urls=[https://go.googlesource.com/sys]
Resolving golang.org/x/text: commit='23ae387dee1f90d29a23c0e87ee0b46038fbed0e', urls=[https://go.googlesource.com/text]
Resolving cached github.com/etcd-io/etcd: commit='11214aa33bf5a47d3d9d8dafe0f6b97237dfe921',
urls=[https://github.com/etcd-io/etcd.git, git@github.com:etcd-io/etcd.git]
Resolving google.golang.org/api: commit='0324d5e90dc7753607860272666845fad9ceb97e', urls=[https://code.googlesource.com/google-api-go-client]
Resolving google.golang.org/genproto: commit='4d944d34d83c502a5f761500a14d8842648415c3', urls=[https://github.com/google/go-genproto]
Resolving google.golang.org/grpc: commit='5e8f83304c0563d1ba74db05fee83d9c18ab9a58', urls=[https://github.com/grpc/grpc-go]
Resolving google.golang.org/protobuf: commit='d165be301fb1e13390ad453281ded24385fd8ebc', urls=[https://go.googlesource.com/protobuf]
Resolving cached github.com/etcd-io/etcd: commit='11214aa33bf5a47d3d9d8dafe0f6b97237dfe921',
urls=[https://github.com/etcd-io/etcd.git, git@github.com:etcd-io/etcd.git]
Resolving cached github.com/etcd-io/etcd: commit='11214aa33bf5a47d3d9d8dafe0f6b97237dfe921',
urls=[https://github.com/etcd-io/etcd.git, git@github.com:etcd-io/etcd.git]

> Task :sdks:go:installDependencies
> Task :sdks:go:buildLinuxAmd64
> Task :sdks:go:goBuild

> Task :sdks:java:container:resolveBuildDependencies
Resolving ./github.com/apache/beam/sdks/go@<https://ci-beam.apache.org/job/beam_PostCommit_Java_VR_Dataflow_V2_Streaming/ws/src/sdks/go>

> Task :sdks:java:container:installDependencies

> Task :sdks:java:container:buildLinuxAmd64
Unable to watch the file system for changes. The inotify watches limit is too low.

> Task :sdks:java:container:goBuild
> Task :sdks:java:container:java8:copySdkHarnessLauncher

> Task :release:go-licenses:java:dockerRun
+ go-licenses save github.com/apache/beam/sdks/java/container --save_path=/output/licenses
+ go-licenses csv github.com/apache/beam/sdks/java/container
+ tee /output/licenses/list.csv
+ chmod -R a+w /output/licenses

> Task :release:go-licenses:java:createLicenses
> Task :sdks:java:container:java8:copyGolangLicenses
> Task :sdks:java:container:java8:dockerPrepare
> Task :sdks:java:container:java8:docker

> Task :runners:google-cloud-dataflow-java:buildAndPushDockerContainer
WARNING: `gcloud docker` will not be supported for Docker client versions above 18.03.

As an alternative, use `gcloud auth configure-docker` to configure `docker` to
use `gcloud` as a credential helper, then use `docker` as you would for non-GCR
registries, e.g. `docker pull gcr.io/project-id/my-image`. Add
`--verbosity=error` to silence this warning: `gcloud docker
--verbosity=error -- pull gcr.io/project-id/my-image`.

See: https://cloud.google.com/container-registry/docs/support/deprecation-notices#gcloud-docker

The push refers to repository [us.gcr.io/apache-beam-testing/java-postcommit-it/java]
54a84276a5be: Preparing
72e50027e206: Preparing
189150ef3044: Preparing
21157b3236df: Preparing
94586b575f71: Preparing
fcc01afb7f82: Preparing
fb9fdd8efcd5: Preparing
4f96a0f0d975: Preparing
e6279ae8e744: Preparing
884e998ae78e: Preparing
93e417fe8840: Preparing
25b2e6cfc187: Preparing
7df6dd475950: Preparing
7496c5e8691b: Preparing
aa7af8a465c6: Preparing
ef9a7b8862f4: Preparing
a1f2f42922b1: Preparing
4762552ad7d8: Preparing
fb9fdd8efcd5: Waiting
4f96a0f0d975: Waiting
25b2e6cfc187: Waiting
fcc01afb7f82: Waiting
4762552ad7d8: Waiting
7df6dd475950: Waiting
7496c5e8691b: Waiting
aa7af8a465c6: Waiting
ef9a7b8862f4: Waiting
93e417fe8840: Waiting
884e998ae78e: Waiting
e6279ae8e744: Waiting
a1f2f42922b1: Waiting
72e50027e206: Pushed
94586b575f71: Pushed
54a84276a5be: Pushed
21157b3236df: Pushed
4f96a0f0d975: Pushed
189150ef3044: Pushed
fb9fdd8efcd5: Pushed
25b2e6cfc187: Layer already exists
7df6dd475950: Layer already exists
7496c5e8691b: Layer already exists
aa7af8a465c6: Layer already exists
ef9a7b8862f4: Layer already exists
a1f2f42922b1: Layer already exists
4762552ad7d8: Layer already exists
93e417fe8840: Pushed
884e998ae78e: Pushed
fcc01afb7f82: Pushed
e6279ae8e744: Pushed
20210130060058: digest: sha256:ddaa80c3b0c9f3a871a97ea2e6b8c4130ecb6c9046797bf1b5a3005cea1233ed
size: 4098

> Task :runners:google-cloud-dataflow-java:validatesRunnerV2TestStreaming

org.apache.beam.sdk.transforms.SplittableDoFnTest > testSideInputUnbounded FAILED
    java.lang.RuntimeException at SplittableDoFnTest.java:383

org.apache.beam.sdk.metrics.MetricsTest$AttemptedMetricTests > testAttemptedDistributionMetrics
FAILED
    java.lang.RuntimeException at MetricsTest.java:363

org.apache.beam.sdk.transforms.ParDoTest$KeyTests > testKeyInOnTimerWithGenericKey FAILED
    java.lang.RuntimeException at ParDoTest.java:5379

org.apache.beam.sdk.transforms.ReifyTimestampsTest > extractFromValuesWhenValueTimestampedLaterSucceeds
FAILED
    java.lang.RuntimeException at ReifyTimestampsTest.java:128

org.apache.beam.sdk.transforms.ParDoTest$MultipleInputsAndOutputTests > testParDoWithTaggedOutput
FAILED
    java.lang.RuntimeException at ParDoTest.java:673

org.apache.beam.sdk.transforms.ParDoTest$MultipleInputsAndOutputTests > testMultiOutputParDoWithSideInputsIsCumulative
FAILED
    java.lang.RuntimeException at ParDoTest.java:1212

232 tests completed, 6 failed, 2 skipped

> Task :runners:google-cloud-dataflow-java:validatesRunnerV2TestStreaming FAILED

> Task :runners:google-cloud-dataflow-java:cleanUpDockerImages
Untagged: us.gcr.io/apache-beam-testing/java-postcommit-it/java:20210130060058
Untagged: us.gcr.io/apache-beam-testing/java-postcommit-it/java@sha256:ddaa80c3b0c9f3a871a97ea2e6b8c4130ecb6c9046797bf1b5a3005cea1233ed
Digests:
- us.gcr.io/apache-beam-testing/java-postcommit-it/java@sha256:ddaa80c3b0c9f3a871a97ea2e6b8c4130ecb6c9046797bf1b5a3005cea1233ed
  Associated tags:
 - 20210130060058
Tags:
- us.gcr.io/apache-beam-testing/java-postcommit-it/java:20210130060058
Deleted [us.gcr.io/apache-beam-testing/java-postcommit-it/java:20210130060058].
Deleted [us.gcr.io/apache-beam-testing/java-postcommit-it/java@sha256:ddaa80c3b0c9f3a871a97ea2e6b8c4130ecb6c9046797bf1b5a3005cea1233ed].

FAILURE: Build failed with an exception.

* What went wrong:
Execution failed for task ':runners:google-cloud-dataflow-java:validatesRunnerV2TestStreaming'.
> There were failing tests. See the report at: file://<https://ci-beam.apache.org/job/beam_PostCommit_Java_VR_Dataflow_V2_Streaming/ws/src/runners/google-cloud-dataflow-java/build/reports/tests/validatesRunnerV2TestStreaming/index.html>

* Try:
Run with --stacktrace option to get the stack trace. Run with --info or --debug option to
get more log output. Run with --scan to get full insights.

* Get more help at https://help.gradle.org

Deprecated Gradle features were used in this build, making it incompatible with Gradle 7.0.
Use '--warning-mode all' to show the individual deprecation warnings.
See https://docs.gradle.org/6.8/userguide/command_line_interface.html#sec:command_line_warnings

BUILD FAILED in 4h 9m 49s
123 actionable tasks: 83 executed, 38 from cache, 2 up-to-date
Gradle was unable to watch the file system for changes. The inotify watches limit is too low.

Publishing build scan...
https://gradle.com/s/melek2lwko7vu

Build step 'Invoke Gradle script' changed build result to FAILURE
Build step 'Invoke Gradle script' marked build as failure

---------------------------------------------------------------------
To unsubscribe, e-mail: builds-unsubscribe@beam.apache.org
For additional commands, e-mail: builds-help@beam.apache.org


Mime
View raw message