beam-builds mailing list archives

Site index · List index
Message view « Date » · « Thread »
Top « Date » · « Thread »
From Apache Jenkins Server <jenk...@builds.apache.org>
Subject Build failed in Jenkins: beam_PreCommit_Python_Cron #4373
Date Thu, 01 Jul 2021 06:02:10 GMT
See <https://ci-beam.apache.org/job/beam_PreCommit_Python_Cron/4373/display/redirect>

Changes:


------------------------------------------
Started by timer
Running as SYSTEM
[EnvInject] - Loading node environment variables.
Building remotely on apache-beam-jenkins-15 (beam) in workspace <https://ci-beam.apache.org/job/beam_PreCommit_Python_Cron/ws/>
The recommended git tool is: NONE
No credentials specified
Wiping out workspace first.
Cloning the remote Git repository
Cloning repository https://github.com/apache/beam.git
 > git init <https://ci-beam.apache.org/job/beam_PreCommit_Python_Cron/ws/src> #
timeout=10
Fetching upstream changes from https://github.com/apache/beam.git
 > git --version # timeout=10
 > git --version # 'git version 2.7.4'
 > git fetch --tags --progress https://github.com/apache/beam.git +refs/heads/*:refs/remotes/origin/*
# timeout=10
 > git config remote.origin.url https://github.com/apache/beam.git # timeout=10
 > git config --add remote.origin.fetch +refs/heads/*:refs/remotes/origin/* # timeout=10
 > git config remote.origin.url https://github.com/apache/beam.git # timeout=10
Fetching upstream changes from https://github.com/apache/beam.git
 > git fetch --tags --progress https://github.com/apache/beam.git +refs/heads/*:refs/remotes/origin/*
+refs/pull/${ghprbPullId}/*:refs/remotes/origin/pr/${ghprbPullId}/* # timeout=10
 > git rev-parse origin/master^{commit} # timeout=10
Checking out Revision 7b30339a64949bcb7c1bc11305b8c9ab49e12942 (origin/master)
 > git config core.sparsecheckout # timeout=10
 > git checkout -f 7b30339a64949bcb7c1bc11305b8c9ab49e12942 # timeout=10
Commit message: "[BEAM-12548] Add EqualsList functionality to PAssert (#15110)"
 > git rev-list --no-walk 7b30339a64949bcb7c1bc11305b8c9ab49e12942 # timeout=10
No emails were triggered.
[EnvInject] - Executing scripts and injecting environment variables after the SCM step.
[EnvInject] - Injecting as environment variables the properties content 
SPARK_LOCAL_IP=127.0.0.1
SETUPTOOLS_USE_DISTUTILS=stdlib

[EnvInject] - Variables injected successfully.
[Gradle] - Launching build.
[src] $ <https://ci-beam.apache.org/job/beam_PreCommit_Python_Cron/ws/src/gradlew> --continue
--max-workers=12 -Dorg.gradle.jvmargs=-Xms2g -Dorg.gradle.jvmargs=-Xmx4g -Dorg.gradle.vfs.watch=false
-Pdocker-pull-licenses :pythonPreCommit
Starting a Gradle Daemon, 1 busy Daemon could not be reused, use --status for details
> Task :buildSrc:compileJava NO-SOURCE
> Task :buildSrc:compileGroovy FROM-CACHE
> Task :buildSrc:pluginDescriptors
> Task :buildSrc:processResources
> Task :buildSrc:classes
> Task :buildSrc:jar
> Task :buildSrc:assemble
> Task :buildSrc:spotlessGroovy FROM-CACHE
> Task :buildSrc:spotlessGroovyCheck UP-TO-DATE
> Task :buildSrc:spotlessGroovyGradle FROM-CACHE
> Task :buildSrc:spotlessGroovyGradleCheck UP-TO-DATE
> Task :buildSrc:spotlessCheck UP-TO-DATE
> Task :buildSrc:pluginUnderTestMetadata
> Task :buildSrc:compileTestJava NO-SOURCE
> Task :buildSrc:compileTestGroovy NO-SOURCE
> Task :buildSrc:processTestResources NO-SOURCE
> Task :buildSrc:testClasses UP-TO-DATE
> Task :buildSrc:test NO-SOURCE
> Task :buildSrc:validatePlugins FROM-CACHE
> Task :buildSrc:check UP-TO-DATE
> Task :buildSrc:build
Configuration on demand is an incubating feature.

FAILURE: Build completed with 7 failures.

1: Task failed with an exception.
-----------
* What went wrong:
Gradle could not start your build.
> Cannot create service of type TaskExecuter using method ProjectExecutionServices.createTaskExecuter()
as there is a problem with parameter #17 of type ReservedFileSystemLocationRegistry.
   > Cannot create service of type ReservedFileSystemLocationRegistry using method ProjectExecutionServices.createReservedFileLocationRegistry()
as there is a problem with parameter #1 of type List<ReservedFileSystemLocation>.
      > Could not create service of type ExecutionHistoryCacheAccess using ExecutionGradleServices.createCacheAccess().
         > Failed to create directory '<https://ci-beam.apache.org/job/beam_PreCommit_Python_Cron/ws/src/.gradle/6.8.3/executionHistory'>

* Try:
Run with --stacktrace option to get the stack trace. Run with --info or --debug option to
get more log output. Run with --scan to get full insights.
==============================================================================

2: Task failed with an exception.
-----------
* What went wrong:
Gradle could not start your build.
> Cannot create service of type TaskExecuter using method ProjectExecutionServices.createTaskExecuter()
as there is a problem with parameter #17 of type ReservedFileSystemLocationRegistry.
   > Cannot create service of type ReservedFileSystemLocationRegistry using method ProjectExecutionServices.createReservedFileLocationRegistry()
as there is a problem with parameter #1 of type List<ReservedFileSystemLocation>.
      > Could not create service of type ExecutionHistoryCacheAccess using ExecutionGradleServices.createCacheAccess().
         > Failed to create directory '<https://ci-beam.apache.org/job/beam_PreCommit_Python_Cron/ws/src/.gradle/6.8.3/executionHistory'>

* Try:
Run with --stacktrace option to get the stack trace. Run with --info or --debug option to
get more log output. Run with --scan to get full insights.
==============================================================================

3: Task failed with an exception.
-----------
* What went wrong:
Gradle could not start your build.
> Cannot create service of type TaskExecuter using method ProjectExecutionServices.createTaskExecuter()
as there is a problem with parameter #17 of type ReservedFileSystemLocationRegistry.
   > Cannot create service of type ReservedFileSystemLocationRegistry using method ProjectExecutionServices.createReservedFileLocationRegistry()
as there is a problem with parameter #1 of type List<ReservedFileSystemLocation>.
      > Could not create service of type ExecutionHistoryCacheAccess using ExecutionGradleServices.createCacheAccess().
         > Failed to create directory '<https://ci-beam.apache.org/job/beam_PreCommit_Python_Cron/ws/src/.gradle/6.8.3/executionHistory'>

* Try:
Run with --stacktrace option to get the stack trace. Run with --info or --debug option to
get more log output. Run with --scan to get full insights.
==============================================================================

4: Task failed with an exception.
-----------
* What went wrong:
Gradle could not start your build.
> Cannot create service of type TaskExecuter using method ProjectExecutionServices.createTaskExecuter()
as there is a problem with parameter #17 of type ReservedFileSystemLocationRegistry.
   > Cannot create service of type ReservedFileSystemLocationRegistry using method ProjectExecutionServices.createReservedFileLocationRegistry()
as there is a problem with parameter #1 of type List<ReservedFileSystemLocation>.
      > Could not create service of type ExecutionHistoryCacheAccess using ExecutionGradleServices.createCacheAccess().
         > Failed to create directory '<https://ci-beam.apache.org/job/beam_PreCommit_Python_Cron/ws/src/.gradle/6.8.3/executionHistory'>

* Try:
Run with --stacktrace option to get the stack trace. Run with --info or --debug option to
get more log output. Run with --scan to get full insights.
==============================================================================

5: Task failed with an exception.
-----------
* What went wrong:
Gradle could not start your build.
> Cannot create service of type TaskExecuter using method ProjectExecutionServices.createTaskExecuter()
as there is a problem with parameter #17 of type ReservedFileSystemLocationRegistry.
   > Cannot create service of type ReservedFileSystemLocationRegistry using method ProjectExecutionServices.createReservedFileLocationRegistry()
as there is a problem with parameter #1 of type List<ReservedFileSystemLocation>.
      > Could not create service of type ExecutionHistoryCacheAccess using ExecutionGradleServices.createCacheAccess().
         > Failed to create directory '<https://ci-beam.apache.org/job/beam_PreCommit_Python_Cron/ws/src/.gradle/6.8.3/executionHistory'>

* Try:
Run with --stacktrace option to get the stack trace. Run with --info or --debug option to
get more log output. Run with --scan to get full insights.
==============================================================================

6: Task failed with an exception.
-----------
* What went wrong:
Gradle could not start your build.
> Cannot create service of type TaskExecuter using method ProjectExecutionServices.createTaskExecuter()
as there is a problem with parameter #17 of type ReservedFileSystemLocationRegistry.
   > Cannot create service of type ReservedFileSystemLocationRegistry using method ProjectExecutionServices.createReservedFileLocationRegistry()
as there is a problem with parameter #1 of type List<ReservedFileSystemLocation>.
      > Could not create service of type ExecutionHistoryCacheAccess using ExecutionGradleServices.createCacheAccess().
         > Failed to create directory '<https://ci-beam.apache.org/job/beam_PreCommit_Python_Cron/ws/src/.gradle/6.8.3/executionHistory'>

* Try:
Run with --stacktrace option to get the stack trace. Run with --info or --debug option to
get more log output. Run with --scan to get full insights.
==============================================================================

7: Task failed with an exception.
-----------
* What went wrong:
Gradle could not start your build.
> Cannot create service of type TaskExecuter using method ProjectExecutionServices.createTaskExecuter()
as there is a problem with parameter #17 of type ReservedFileSystemLocationRegistry.
   > Cannot create service of type ReservedFileSystemLocationRegistry using method ProjectExecutionServices.createReservedFileLocationRegistry()
as there is a problem with parameter #1 of type List<ReservedFileSystemLocation>.
      > Could not create service of type ExecutionHistoryCacheAccess using ExecutionGradleServices.createCacheAccess().
         > Failed to create directory '<https://ci-beam.apache.org/job/beam_PreCommit_Python_Cron/ws/src/.gradle/6.8.3/executionHistory'>

* Try:
Run with --stacktrace option to get the stack trace. Run with --info or --debug option to
get more log output. Run with --scan to get full insights.
==============================================================================

* Get more help at https://help.gradle.org

Deprecated Gradle features were used in this build, making it incompatible with Gradle 7.0.
Use '--warning-mode all' to show the individual deprecation warnings.
See https://docs.gradle.org/6.8.3/userguide/command_line_interface.html#sec:command_line_warnings

BUILD FAILED in 22s

Publishing build scan...
https://gradle.com/s/bemf5qkvh4h2c

Build step 'Invoke Gradle script' changed build result to FAILURE
Build step 'Invoke Gradle script' marked build as failure

---------------------------------------------------------------------
To unsubscribe, e-mail: builds-unsubscribe@beam.apache.org
For additional commands, e-mail: builds-help@beam.apache.org


Mime
View raw message