beam-builds mailing list archives

Site index · List index
Message view « Date » · « Thread »
Top « Date » · « Thread »
From Apache Jenkins Server <jenk...@builds.apache.org>
Subject Build failed in Jenkins: beam_PostCommit_XVR_Direct #1393
Date Thu, 01 Jul 2021 06:10:51 GMT
See <https://ci-beam.apache.org/job/beam_PostCommit_XVR_Direct/1393/display/redirect>

Changes:


------------------------------------------
[...truncated 119.62 KB...]
  Downloading numpy-1.19.5-cp36-cp36m-manylinux2010_x86_64.whl (14.8 MB)
Collecting scipy==1.4.1
  Downloading scipy-1.4.1-cp36-cp36m-manylinux1_x86_64.whl (26.1 MB)
Collecting scikit-learn==0.24.1
  Downloading scikit_learn-0.24.1-cp36-cp36m-manylinux2010_x86_64.whl (22.2 MB)
Collecting pandas==1.1.5
  Downloading pandas-1.1.5-cp36-cp36m-manylinux1_x86_64.whl (9.5 MB)
Collecting protorpc==0.12.0
  Downloading protorpc-0.12.0.tar.gz (117 kB)
Collecting python-gflags==3.1.2
  Downloading python-gflags-3.1.2.tar.gz (52 kB)
Collecting tensorflow==2.5.0
  Downloading tensorflow-2.5.0-cp36-cp36m-manylinux2010_x86_64.whl (454.3 MB)
Collecting tenacity>=5.0.2
  Downloading tenacity-7.0.0-py2.py3-none-any.whl (23 kB)
Collecting pyhamcrest<2.0,>=1.9
  Downloading PyHamcrest-1.10.1-py3-none-any.whl (48 kB)
Collecting pytest==4.6.11
  Downloading pytest-4.6.11-py2.py3-none-any.whl (231 kB)
Collecting nose==1.3.7
  Downloading nose-1.3.7-py3-none-any.whl (154 kB)
Collecting six>=1.5.2
  Downloading six-1.16.0-py2.py3-none-any.whl (11 kB)
Collecting docopt
  Downloading docopt-0.6.2.tar.gz (25 kB)
Collecting pyparsing<3,>=2.4.2
  Downloading pyparsing-2.4.7-py2.py3-none-any.whl (67 kB)
Collecting pyasn1>=0.1.7
  Downloading pyasn1-0.4.8-py2.py3-none-any.whl (77 kB)
Collecting pyasn1-modules>=0.0.5
  Downloading pyasn1_modules-0.2.8-py2.py3-none-any.whl (155 kB)
Collecting rsa>=3.1.4
  Downloading rsa-4.7.2-py3-none-any.whl (34 kB)
Requirement already satisfied: setuptools in /usr/local/lib/python3.6/site-packages (from
protobuf==3.12.2->-r /tmp/base_image_requirements.txt (line 36)) (57.0.0)
Collecting googleapis-common-protos<2.0dev,>=1.6.0
  Downloading googleapis_common_protos-1.53.0-py2.py3-none-any.whl (198 kB)
Collecting fasteners>=0.14
  Downloading fasteners-0.16.3-py2.py3-none-any.whl (28 kB)
Collecting grpc-google-iam-v1<0.13dev,>=0.12.3
  Downloading grpc-google-iam-v1-0.12.3.tar.gz (13 kB)
Collecting google-api-core[grpc]<2.0.0dev,>=1.14.0
  Downloading google_api_core-1.30.0-py2.py3-none-any.whl (93 kB)
Collecting google-resumable-media<2.0dev,>=0.5.0
  Downloading google_resumable_media-1.3.1-py2.py3-none-any.whl (75 kB)
Collecting google-api-python-client!=1.12.0,!=2.0.2
  Downloading google_api_python_client-2.11.0-py2.py3-none-any.whl (7.0 MB)
Collecting google-auth-httplib2
  Downloading google_auth_httplib2-0.1.0-py2.py3-none-any.whl (9.3 kB)
Collecting soupsieve>1.2
  Downloading soupsieve-2.2.1-py3-none-any.whl (33 kB)
Collecting idna<3,>=2.5
  Downloading idna-2.10-py2.py3-none-any.whl (58 kB)
Collecting chardet<4,>=3.0.2
  Downloading chardet-3.0.4-py2.py3-none-any.whl (133 kB)
Collecting urllib3!=1.25.0,!=1.25.1,<1.26,>=1.21.1
  Downloading urllib3-1.25.11-py2.py3-none-any.whl (127 kB)
Collecting certifi>=2017.4.17
  Downloading certifi-2021.5.30-py2.py3-none-any.whl (145 kB)
Collecting joblib>=0.11
  Downloading joblib-1.0.1-py3-none-any.whl (303 kB)
Collecting threadpoolctl>=2.0.0
  Downloading threadpoolctl-2.1.0-py3-none-any.whl (12 kB)
Requirement already satisfied: wheel~=0.35 in /usr/local/lib/python3.6/site-packages (from
tensorflow==2.5.0->-r /tmp/base_image_requirements.txt (line 82)) (0.36.2)
Collecting keras-nightly~=2.5.0.dev
  Downloading keras_nightly-2.5.0.dev2021032900-py2.py3-none-any.whl (1.2 MB)
Collecting opt-einsum~=3.3.0
  Downloading opt_einsum-3.3.0-py3-none-any.whl (65 kB)
Collecting absl-py~=0.10
  Downloading absl_py-0.13.0-py3-none-any.whl (132 kB)
Collecting wrapt~=1.12.1
  Downloading wrapt-1.12.1.tar.gz (27 kB)
Collecting termcolor~=1.1.0
  Downloading termcolor-1.1.0.tar.gz (3.9 kB)
Collecting h5py~=3.1.0
  Downloading h5py-3.1.0-cp36-cp36m-manylinux1_x86_64.whl (4.0 MB)
Collecting keras-preprocessing~=1.1.2
  Downloading Keras_Preprocessing-1.1.2-py2.py3-none-any.whl (42 kB)
Collecting six>=1.5.2
  Downloading six-1.15.0-py2.py3-none-any.whl (10 kB)
Collecting tensorflow-estimator<2.6.0,>=2.5.0rc0
  Downloading tensorflow_estimator-2.5.0-py2.py3-none-any.whl (462 kB)
Collecting google-pasta~=0.2
  Downloading google_pasta-0.2.0-py3-none-any.whl (57 kB)
Collecting gast==0.4.0
  Downloading gast-0.4.0-py3-none-any.whl (9.8 kB)
Collecting tensorboard~=2.5
  Downloading tensorboard-2.5.0-py3-none-any.whl (6.0 MB)
Collecting astunparse~=1.6.3
  Downloading astunparse-1.6.3-py2.py3-none-any.whl (12 kB)
Collecting flatbuffers~=1.12.0
  Downloading flatbuffers-1.12-py2.py3-none-any.whl (15 kB)
Collecting more-itertools>=4.0.0
  Downloading more_itertools-8.8.0-py3-none-any.whl (48 kB)
Collecting attrs>=17.4.0
  Downloading attrs-21.2.0-py2.py3-none-any.whl (53 kB)
Collecting importlib-metadata>=0.12
  Downloading importlib_metadata-4.6.0-py3-none-any.whl (17 kB)
Collecting atomicwrites>=1.0
  Downloading atomicwrites-1.4.0-py2.py3-none-any.whl (6.8 kB)
Collecting wcwidth
  Downloading wcwidth-0.2.5-py2.py3-none-any.whl (30 kB)
Collecting packaging
  Downloading packaging-20.9-py2.py3-none-any.whl (40 kB)
Collecting py>=1.5.0
  Downloading py-1.10.0-py2.py3-none-any.whl (97 kB)
Collecting pluggy<1.0,>=0.12
  Downloading pluggy-0.13.1-py2.py3-none-any.whl (18 kB)
Collecting google-api-core[grpc,grpcgcp]<2.0.0dev,>=1.14.0
  Downloading google_api_core-1.29.0-py2.py3-none-any.whl (93 kB)
  Downloading google_api_core-1.28.0-py2.py3-none-any.whl (92 kB)
  Downloading google_api_core-1.27.0-py2.py3-none-any.whl (93 kB)
  Downloading google_api_core-1.26.3-py2.py3-none-any.whl (93 kB)
  Downloading google_api_core-1.26.2-py2.py3-none-any.whl (93 kB)
  Downloading google_api_core-1.26.1-py2.py3-none-any.whl (92 kB)
  Downloading google_api_core-1.26.0-py2.py3-none-any.whl (92 kB)
  Downloading google_api_core-1.25.1-py2.py3-none-any.whl (92 kB)
  Downloading google_api_core-1.25.0-py2.py3-none-any.whl (92 kB)
  Downloading google_api_core-1.24.1-py2.py3-none-any.whl (92 kB)
  Downloading google_api_core-1.24.0-py2.py3-none-any.whl (91 kB)
  Downloading google_api_core-1.23.0-py2.py3-none-any.whl (91 kB)
  Downloading google_api_core-1.22.4-py2.py3-none-any.whl (91 kB)
  Downloading google_api_core-1.22.3-py2.py3-none-any.whl (91 kB)
  Downloading google_api_core-1.22.2-py2.py3-none-any.whl (91 kB)
  Downloading google_api_core-1.22.1-py2.py3-none-any.whl (91 kB)
Collecting uritemplate<4dev,>=3.0.0
  Downloading uritemplate-3.0.1-py2.py3-none-any.whl (15 kB)
Collecting google-crc32c<2.0dev,>=1.0
  Downloading google_crc32c-1.1.2-cp36-cp36m-manylinux2014_x86_64.whl (38 kB)
Collecting cffi>=1.0.0
  Downloading cffi-1.14.5-cp36-cp36m-manylinux1_x86_64.whl (401 kB)
Collecting pycparser
  Downloading pycparser-2.20-py2.py3-none-any.whl (112 kB)
Collecting cached-property
  Downloading cached_property-1.5.2-py2.py3-none-any.whl (7.6 kB)
Collecting zipp>=0.5
  Downloading zipp-3.4.1-py3-none-any.whl (5.2 kB)
Collecting tensorboard-data-server<0.7.0,>=0.6.0
  Downloading tensorboard_data_server-0.6.1-py3-none-manylinux2010_x86_64.whl (4.9 MB)
Collecting tensorboard-plugin-wit>=1.6.0
  Downloading tensorboard_plugin_wit-1.8.0-py3-none-any.whl (781 kB)
Collecting google-auth-oauthlib<0.5,>=0.4.1
  Downloading google_auth_oauthlib-0.4.4-py2.py3-none-any.whl (18 kB)
Collecting markdown>=2.6.8
  Downloading Markdown-3.3.4-py3-none-any.whl (97 kB)
Collecting werkzeug>=0.11.15
  Downloading Werkzeug-2.0.1-py3-none-any.whl (288 kB)
Collecting requests-oauthlib>=0.7.0
  Downloading requests_oauthlib-1.3.0-py2.py3-none-any.whl (23 kB)
Collecting oauthlib>=3.0.0
  Downloading oauthlib-3.1.1-py2.py3-none-any.whl (146 kB)
Building wheels for collected packages: avro-python3, crcmod, dill, future, hdfs, google-apitools,
google-cloud-profiler, bs4, mmh3, python-snappy, protorpc, python-gflags, grpc-google-iam-v1,
termcolor, wrapt, docopt
  Building wheel for avro-python3 (setup.py): started
  Building wheel for avro-python3 (setup.py): finished with status 'done'
  Created wheel for avro-python3: filename=avro_python3-1.8.2-py3-none-any.whl size=43248
sha256=1fa9b7bc5975bb3ec16692a5cf560911a876e1182ffb7089b380d8a2ae32576a
  Stored in directory: /root/.cache/pip/wheels/e0/ba/3c/a8eb0be8169baf00d0b07b401b0a2f2c6f9d26147da5f1ca65
  Building wheel for crcmod (setup.py): started
  Building wheel for crcmod (setup.py): finished with status 'done'
  Created wheel for crcmod: filename=crcmod-1.7-cp36-cp36m-linux_x86_64.whl size=36016 sha256=4f1594f193d4ffbf26bed84c406c444dfe83b12f16f2dfa574d710d43bea399e
  Stored in directory: /root/.cache/pip/wheels/ac/bb/07/adfb4ffd0aaace2022ea25c082a7cdc688b10d30e86d6d2fde
  Building wheel for dill (setup.py): started
  Building wheel for dill (setup.py): finished with status 'done'
  Created wheel for dill: filename=dill-0.3.1.1-py3-none-any.whl size=78544 sha256=f05205835b48f65ea7cf0cb6e38de9c2a590ab1f59ef1a854be154b699e0658b
  Stored in directory: /root/.cache/pip/wheels/09/84/74/d2b4feb9ac9488bc83c475cb2cbe8e8b7d9cea8320d32f3787
  Building wheel for future (setup.py): started
  Building wheel for future (setup.py): finished with status 'done'
  Created wheel for future: filename=future-0.18.2-py3-none-any.whl size=491070 sha256=6ff287ec0503598f84cc35cd0ee79120aa0d44c4b01695e19027ad99b6203806
  Stored in directory: /root/.cache/pip/wheels/6e/9c/ed/4499c9865ac1002697793e0ae05ba6be33553d098f3347fb94
  Building wheel for hdfs (setup.py): started
  Building wheel for hdfs (setup.py): finished with status 'done'
  Created wheel for hdfs: filename=hdfs-2.5.8-py3-none-any.whl size=33227 sha256=ff745c5827364c87feef4b955498c2572660e832e4c767f23ef500481e3c85f8
  Stored in directory: /root/.cache/pip/wheels/3e/0c/c3/26ad975f80274d6bf73ed4d8facd055648f452428bc1623283
  Building wheel for google-apitools (setup.py): started
  Building wheel for google-apitools (setup.py): finished with status 'done'
  Created wheel for google-apitools: filename=google_apitools-0.5.31-py3-none-any.whl size=131041
sha256=50451e4546c06ea809303a0aab978e9dbc1ac58eb98184f476a283e3f26f0522
  Stored in directory: /root/.cache/pip/wheels/19/90/12/279bd3b09f3c9a4a0a5416b196eeec18ebc0e11d90ac342159
  Building wheel for google-cloud-profiler (setup.py): started
  Building wheel for google-cloud-profiler (setup.py): finished with status 'done'
  Created wheel for google-cloud-profiler: filename=google_cloud_profiler-3.0.4-cp36-cp36m-linux_x86_64.whl
size=739381 sha256=1e7d519a7196ee4010a6c4052b0422a605a07c047da8335478df813656ce79c7
  Stored in directory: /root/.cache/pip/wheels/eb/82/66/37d4f371c683eb0c0c4ce7f6462980686a5de391b62acd74c8
  Building wheel for bs4 (setup.py): started
  Building wheel for bs4 (setup.py): finished with status 'done'
  Created wheel for bs4: filename=bs4-0.0.1-py3-none-any.whl size=1271 sha256=bb42bbdc2385b926c53be5aee856ea704689a37c6e91e85cade5690c468126dd
  Stored in directory: /root/.cache/pip/wheels/19/f5/6d/a97dd4f22376d4472d5f4c76c7646876052ff3166b3cf71050
  Building wheel for mmh3 (setup.py): started
  Building wheel for mmh3 (setup.py): finished with status 'done'
  Created wheel for mmh3: filename=mmh3-2.5.1-cp36-cp36m-linux_x86_64.whl size=46590 sha256=55c24ab1912734126e52dcddd18c0dd366e4a099845911b81090b7673a59f877
  Stored in directory: /root/.cache/pip/wheels/cc/3a/98/fc5e7f8e1840cf6dcf2435260b29661db90a0b22dbd2739df6
  Building wheel for python-snappy (setup.py): started
  Building wheel for python-snappy (setup.py): finished with status 'done'
  Created wheel for python-snappy: filename=python_snappy-0.5.4-cp36-cp36m-linux_x86_64.whl
size=44815 sha256=a34888dabcd5cefec76cdeb59a5a0760b3233aec89b12d6e2d015ee8cbb661e1
  Stored in directory: /root/.cache/pip/wheels/03/f4/41/fedfca3681b5188b8963add3ea48aa16b3b18a3a4f2c6a61b6
  Building wheel for protorpc (setup.py): started
  Building wheel for protorpc (setup.py): finished with status 'done'
  Created wheel for protorpc: filename=protorpc-0.12.0-py3-none-any.whl size=137685 sha256=823495d3ade7f8b446412f2327198b25828e549712ed7b6e48ffc94331c7a2f1
  Stored in directory: /root/.cache/pip/wheels/03/96/13/2f157e956ee2276c227533f279766e4e4ccf60c7036e7eecd3
  Building wheel for python-gflags (setup.py): started
  Building wheel for python-gflags (setup.py): finished with status 'done'
  Created wheel for python-gflags: filename=python_gflags-3.1.2-py3-none-any.whl size=57386
sha256=cb94017fab7a5f536402b5c76d60980657c6a8b288659b8ca6f03c12de242c6a
  Stored in directory: /root/.cache/pip/wheels/39/5f/9e/c32620d2f8898c726bb6dc8708616c457cf885d3890f4cb31d
  Building wheel for grpc-google-iam-v1 (setup.py): started
  Building wheel for grpc-google-iam-v1 (setup.py): finished with status 'done'
  Created wheel for grpc-google-iam-v1: filename=grpc_google_iam_v1-0.12.3-py3-none-any.whl
size=18514 sha256=ceeb01124429eb23414a87a4e1c5626e368d0e9f691fd931e27c1e569dce0c5d
  Stored in directory: /root/.cache/pip/wheels/76/65/cd/392da05e43270f143b6c5076ba88d39144abff586792593e7c
  Building wheel for termcolor (setup.py): started
  Building wheel for termcolor (setup.py): finished with status 'done'
  Created wheel for termcolor: filename=termcolor-1.1.0-py3-none-any.whl size=4847 sha256=c169d887409de6e554be5d4776a4dc075c754b383a7aec796f11dfa4d2548152
  Stored in directory: /root/.cache/pip/wheels/93/2a/eb/e58dbcbc963549ee4f065ff80a59f274cc7210b6eab962acdc
  Building wheel for wrapt (setup.py): started
  Building wheel for wrapt (setup.py): finished with status 'done'
  Created wheel for wrapt: filename=wrapt-1.12.1-cp36-cp36m-linux_x86_64.whl size=75270 sha256=cf36efeb72fb53fc81eeaf6d48c09f50d70600781b379cc5d0f6f9a0fcc5feb9
  Stored in directory: /root/.cache/pip/wheels/32/42/7f/23cae9ff6ef66798d00dc5d659088e57dbba01566f6c60db63
  Building wheel for docopt (setup.py): started
  Building wheel for docopt (setup.py): finished with status 'done'
  Created wheel for docopt: filename=docopt-0.6.2-py2.py3-none-any.whl size=13724 sha256=19374982e28a8985be284eabeb7bacd188f1deb12aa53727e050f8a311e783ca
  Stored in directory: /root/.cache/pip/wheels/3f/2a/fa/4d7a888e69774d5e6e855d190a8a51b357d77cc05eb1c097c9
Successfully built avro-python3 crcmod dill future hdfs google-apitools google-cloud-profiler
bs4 mmh3 python-snappy protorpc python-gflags grpc-google-iam-v1 termcolor wrapt docopt
Installing collected packages: urllib3, six, pyasn1, idna, chardet, certifi, zipp, typing-extensions,
rsa, requests, pyparsing, pycparser, pyasn1-modules, protobuf, oauthlib, cachetools, requests-oauthlib,
pytz, importlib-metadata, httplib2, grpcio, googleapis-common-protos, google-auth, dataclasses,
cffi, werkzeug, uritemplate, tensorboard-plugin-wit, tensorboard-data-server, soupsieve, numpy,
markdown, grpcio-gcp, google-crc32c, google-auth-oauthlib, google-auth-httplib2, google-api-core,
cached-property, absl-py, wrapt, wcwidth, threadpoolctl, termcolor, tensorflow-estimator,
tensorboard, scipy, pyyaml, python-dateutil, py, pluggy, packaging, opt-einsum, oauth2client,
more-itertools, keras-preprocessing, keras-nightly, joblib, h5py, grpc-google-iam-v1, google-resumable-media,
google-pasta, google-cloud-core, google-api-python-client, gast, flatbuffers, fasteners, docopt,
beautifulsoup4, attrs, atomicwrites, astunparse, tensorflow, tenacity, scikit-learn, python-snappy,
python-gflags, pytest, pymongo, pyhamcrest, pydot, pyarrow, protorpc, pillow, pandas, nose,
mmh3, hdfs, guppy3, google-python-cloud-debugger, google-cloud-vision, google-cloud-videointelligence,
google-cloud-spanner, google-cloud-pubsub, google-cloud-profiler, google-cloud-language, google-cloud-dlp,
google-cloud-datastore, google-cloud-bigtable, google-cloud-bigquery, google-apitools, future,
freezegun, fastavro, dill, cython, crcmod, bs4, avro-python3
ERROR: Could not install packages due to an OSError: [Errno 28] No space left on device

The command '/bin/sh -c pip install -r /tmp/base_image_requirements.txt &&   
 python -c "from google.protobuf.internal import api_implementation; assert api_implementation._default_implementation_type
== 'cpp'; print ('Verified fast protobuf used.')" &&     rm -rf /root/.cache/pip &&
    rm -rf /tmp/base_image_requirements.txt' returned a non-zero code: 1

> Task :sdks:python:container:py36:docker FAILED

> Task :sdks:python:test-suites:direct:xlang:fnApiJobServerCleanup
Killing process at 4552

FAILURE: Build failed with an exception.

* What went wrong:
Execution failed for task ':sdks:python:container:py36:docker'.
> Process 'command 'docker'' finished with non-zero exit value 1

* Try:
Run with --stacktrace option to get the stack trace. Run with --info or --debug option to
get more log output. Run with --scan to get full insights.

* Get more help at https://help.gradle.org

Deprecated Gradle features were used in this build, making it incompatible with Gradle 7.0.
Use '--warning-mode all' to show the individual deprecation warnings.
See https://docs.gradle.org/6.8.3/userguide/command_line_interface.html#sec:command_line_warnings

BUILD FAILED in 10m 18s
160 actionable tasks: 113 executed, 43 from cache, 4 up-to-date

Publishing build scan...
https://gradle.com/s/ft4qsrarmw4yw

Build step 'Invoke Gradle script' changed build result to FAILURE
Build step 'Invoke Gradle script' marked build as failure

---------------------------------------------------------------------
To unsubscribe, e-mail: builds-unsubscribe@beam.apache.org
For additional commands, e-mail: builds-help@beam.apache.org


Mime
View raw message