beam-builds mailing list archives

Site index · List index
Message view « Date » · « Thread »
Top « Date » · « Thread »
From Apache Jenkins Server <jenk...@builds.apache.org>
Subject Build failed in Jenkins: beam_PostCommit_Java_VR_Dataflow_V2_Streaming #1006
Date Tue, 20 Jul 2021 23:37:14 GMT
See <https://ci-beam.apache.org/job/beam_PostCommit_Java_VR_Dataflow_V2_Streaming/1006/display/redirect>

Changes:


------------------------------------------
[...truncated 54.04 KB...]
> Task :sdks:java:harness:compileJava FROM-CACHE
> Task :sdks:java:harness:classes UP-TO-DATE

> Task :sdks:java:container:pullLicenses
Finished license_scripts.sh

> Task :sdks:java:container:java8:copyJavaThirdPartyLicenses NO-SOURCE
> Task :sdks:java:core:shadowTestJar FROM-CACHE
> Task :sdks:java:extensions:protobuf:jar
> Task :sdks:java:io:common:compileTestJava FROM-CACHE
> Task :sdks:java:harness:jar
> Task :sdks:java:extensions:google-cloud-platform-core:compileTestJava FROM-CACHE
> Task :sdks:java:extensions:google-cloud-platform-core:testClasses UP-TO-DATE
> Task :sdks:java:extensions:google-cloud-platform-core:testJar
> Task :sdks:java:io:common:testClasses UP-TO-DATE
> Task :sdks:java:io:common:testJar
> Task :sdks:java:testing:test-utils:compileJava FROM-CACHE
> Task :sdks:java:testing:test-utils:classes UP-TO-DATE
> Task :sdks:java:testing:test-utils:jar
> Task :sdks:java:testing:test-utils:compileTestJava FROM-CACHE
> Task :sdks:java:testing:test-utils:testClasses UP-TO-DATE
> Task :sdks:java:testing:test-utils:testJar
> Task :runners:core-construction-java:compileTestJava FROM-CACHE
> Task :runners:core-construction-java:testClasses UP-TO-DATE
> Task :sdks:java:extensions:protobuf:extractIncludeTestProto
> Task :sdks:java:extensions:protobuf:generateTestProto FROM-CACHE
> Task :runners:core-construction-java:testJar
> Task :sdks:java:extensions:protobuf:compileTestJava FROM-CACHE
> Task :sdks:java:extensions:protobuf:testClasses
> Task :sdks:java:extensions:protobuf:testJar
> Task :sdks:java:harness:shadowJar FROM-CACHE

> Task :sdks:go:resolveBuildDependencies
Resolving golang.org/x/net: commit='2fb46b16b8dda405028c50f7c7f0f9dd1fa6bfb1', urls=[https://go.googlesource.com/net]
Resolving golang.org/x/oauth2: commit='5d25da1a8d43b66f2898c444f899c7bcfd6a407e', urls=[https://go.googlesource.com/oauth2]
Resolving golang.org/x/sync: commit='fd80eb99c8f653c847d294a001bdf2a3a6f768f5', urls=[https://go.googlesource.com/sync]

> Task :runners:java-fn-execution:compileJava FROM-CACHE
> Task :runners:java-fn-execution:classes UP-TO-DATE
> Task :runners:java-fn-execution:jar
> Task :sdks:java:expansion-service:compileJava FROM-CACHE
> Task :sdks:java:expansion-service:classes UP-TO-DATE
> Task :sdks:java:expansion-service:jar
> Task :sdks:java:io:kafka:compileJava FROM-CACHE
> Task :sdks:java:io:kafka:classes UP-TO-DATE
> Task :runners:direct-java:compileJava FROM-CACHE
> Task :runners:direct-java:classes UP-TO-DATE
> Task :runners:direct-java:shadowJar FROM-CACHE
> Task :sdks:java:io:kafka:jar
> Task :sdks:java:io:google-cloud-platform:compileJava FROM-CACHE
> Task :sdks:java:io:google-cloud-platform:classes UP-TO-DATE
> Task :sdks:java:io:google-cloud-platform:jar
> Task :sdks:java:container:java8:copyDockerfileDependencies
> Task :runners:google-cloud-dataflow-java:compileJava FROM-CACHE
> Task :runners:google-cloud-dataflow-java:classes
> Task :runners:google-cloud-dataflow-java:jar
> Task :sdks:java:io:google-cloud-platform:compileTestJava FROM-CACHE
> Task :sdks:java:io:google-cloud-platform:testClasses

> Task :sdks:go:resolveBuildDependencies
Resolving golang.org/x/sys: commit='fde4db37ae7ad8191b03d30d27f258b5291ae4e3', urls=[https://go.googlesource.com/sys]

> Task :sdks:java:io:google-cloud-platform:testJar
> Task :runners:google-cloud-dataflow-java:compileTestJava FROM-CACHE
> Task :runners:google-cloud-dataflow-java:testClasses UP-TO-DATE
> Task :runners:google-cloud-dataflow-java:testJar

> Task :sdks:go:resolveBuildDependencies
Resolving golang.org/x/text: commit='23ae387dee1f90d29a23c0e87ee0b46038fbed0e', urls=[https://go.googlesource.com/text]
Resolving cached github.com/etcd-io/etcd: commit='11214aa33bf5a47d3d9d8dafe0f6b97237dfe921',
urls=[https://github.com/etcd-io/etcd.git, git@github.com:etcd-io/etcd.git]

> Task :release:go-licenses:java:dockerRun
+ go-licenses save github.com/apache/beam/sdks/java/container --save_path=/output/licenses
+ go-licenses csv github.com/apache/beam/sdks/java/container
+ tee /output/licenses/list.csv
github.com/apache/beam/sdks/java/container,https://github.com/apache/beam/blob/master/LICENSE,Apache-2.0
github.com/apache/beam/sdks/go/pkg/beam,https://github.com/apache/beam/blob/master/sdks/go/README.md,Apache-2.0
google.golang.org/grpc,https://github.com/grpc/grpc-go/blob/master/LICENSE,Apache-2.0
google.golang.org/genproto/googleapis/rpc/status,https://github.com/googleapis/go-genproto/blob/master/LICENSE,Apache-2.0
golang.org/x/sys,https://go.googlesource.com/sys/+/refs/heads/master/LICENSE,BSD-3-Clause
github.com/golang/protobuf,https://github.com/golang/protobuf/blob/master/LICENSE,BSD-3-Clause
google.golang.org/protobuf,https://go.googlesource.com/protobuf/+/refs/heads/master/LICENSE,BSD-3-Clause
golang.org/x/net,https://go.googlesource.com/net/+/refs/heads/master/LICENSE,BSD-3-Clause
golang.org/x/text,https://go.googlesource.com/text/+/refs/heads/master/LICENSE,BSD-3-Clause
+ chmod -R a+w /output/licenses

> Task :release:go-licenses:java:createLicenses
> Task :sdks:java:container:java8:copyGolangLicenses

> Task :sdks:go:resolveBuildDependencies
Resolving google.golang.org/api: commit='0324d5e90dc7753607860272666845fad9ceb97e', urls=[https://code.googlesource.com/google-api-go-client]
Resolving google.golang.org/genproto: commit='4d944d34d83c502a5f761500a14d8842648415c3', urls=[https://github.com/google/go-genproto]
Resolving google.golang.org/grpc: commit='5e8f83304c0563d1ba74db05fee83d9c18ab9a58', urls=[https://github.com/grpc/grpc-go]
Resolving google.golang.org/protobuf: commit='d165be301fb1e13390ad453281ded24385fd8ebc', urls=[https://go.googlesource.com/protobuf]
Resolving cached github.com/etcd-io/etcd: commit='11214aa33bf5a47d3d9d8dafe0f6b97237dfe921',
urls=[https://github.com/etcd-io/etcd.git, git@github.com:etcd-io/etcd.git]
Resolving cached github.com/etcd-io/etcd: commit='11214aa33bf5a47d3d9d8dafe0f6b97237dfe921',
urls=[https://github.com/etcd-io/etcd.git, git@github.com:etcd-io/etcd.git]

> Task :sdks:go:installDependencies
> Task :sdks:go:buildLinuxAmd64
> Task :sdks:go:goBuild

> Task :sdks:java:container:resolveBuildDependencies
Resolving ./github.com/apache/beam/sdks/go@<https://ci-beam.apache.org/job/beam_PostCommit_Java_VR_Dataflow_V2_Streaming/ws/src/sdks/go>

> Task :sdks:java:container:installDependencies
> Task :sdks:java:container:buildLinuxAmd64
> Task :sdks:java:container:goBuild
> Task :sdks:java:container:java8:copySdkHarnessLauncher
> Task :sdks:java:container:java8:dockerPrepare
> Task :sdks:java:container:java8:docker

> Task :runners:google-cloud-dataflow-java:buildAndPushDockerContainer
WARNING: `gcloud docker` will not be supported for Docker client versions above 18.03.

As an alternative, use `gcloud auth configure-docker` to configure `docker` to
use `gcloud` as a credential helper, then use `docker` as you would for non-GCR
registries, e.g. `docker pull gcr.io/project-id/my-image`. Add
`--verbosity=error` to silence this warning: `gcloud docker
--verbosity=error -- pull gcr.io/project-id/my-image`.

See: https://cloud.google.com/container-registry/docs/support/deprecation-notices#gcloud-docker

The push refers to repository [us.gcr.io/apache-beam-testing/java-postcommit-it/java]
d668e9b93fdd: Preparing
6b2b621d9168: Preparing
d1b14416232e: Preparing
0d9be91d5ba4: Preparing
4d18b8070670: Preparing
5b6eb01c6a34: Preparing
fbfd9dde44f2: Preparing
f5fdc65273d5: Preparing
ded757e1a0c4: Preparing
e8d31fb19786: Preparing
5edb8161bf9b: Preparing
6cc0827d957f: Preparing
aed5f5426b27: Preparing
4d18b8070670: Waiting
c3d00b097cce: Preparing
79c550eb7bd2: Preparing
7095af798ace: Preparing
fe6a4fdbedc0: Preparing
e4d0e810d54a: Preparing
4e006334a6fd: Preparing
5b6eb01c6a34: Waiting
5edb8161bf9b: Waiting
f5fdc65273d5: Waiting
6cc0827d957f: Waiting
fbfd9dde44f2: Waiting
ded757e1a0c4: Waiting
4e006334a6fd: Waiting
e4d0e810d54a: Waiting
fe6a4fdbedc0: Waiting
aed5f5426b27: Waiting
e8d31fb19786: Waiting
c3d00b097cce: Waiting
7095af798ace: Waiting
d1b14416232e: Pushed
6b2b621d9168: Pushed
d668e9b93fdd: Pushed
5b6eb01c6a34: Pushed
4d18b8070670: Pushed
ded757e1a0c4: Pushed
0d9be91d5ba4: Pushed
f5fdc65273d5: Pushed
6cc0827d957f: Pushed
aed5f5426b27: Layer already exists
c3d00b097cce: Layer already exists
7095af798ace: Layer already exists
79c550eb7bd2: Layer already exists
fe6a4fdbedc0: Layer already exists
5edb8161bf9b: Pushed
e4d0e810d54a: Layer already exists
4e006334a6fd: Layer already exists
fbfd9dde44f2: Pushed
e8d31fb19786: Pushed
20210720180057: digest: sha256:2dc70cffa7dfac40f07c647d4310db6fe722d1775856efefea919f00bb9b90ca
size: 4310

> Task :runners:google-cloud-dataflow-java:validatesRunnerV2TestStreaming

org.apache.beam.sdk.transforms.ParDoTest$TimerTests > testTwoTimersSettingEachOtherWithCreateAsInputUnbounded
FAILED
    java.lang.RuntimeException at ParDoTest.java:4534

241 tests completed, 1 failed, 4 skipped

> Task :runners:google-cloud-dataflow-java:validatesRunnerV2TestStreaming FAILED

> Task :runners:google-cloud-dataflow-java:cleanUpDockerImages
Untagged: us.gcr.io/apache-beam-testing/java-postcommit-it/java:20210720180057
Untagged: us.gcr.io/apache-beam-testing/java-postcommit-it/java@sha256:2dc70cffa7dfac40f07c647d4310db6fe722d1775856efefea919f00bb9b90ca
Deleted: sha256:cc680a7e906c8cc68cb9b994784eb380a15ece67521b881411c7020dfce702fd
Deleted: sha256:df55800415d200fe11b22b9ec0b5a7e7910dc264ba115f330ead45ecaa381d17
Deleted: sha256:03c3b83309b4a3d2e51237a09cd976aa03a82f05e9c9fe1c83feb3a27e44a2db
Deleted: sha256:44d93b0127ef03898645ce0244e18752b6b475b7c4e60c30280116e230d03562
Deleted: sha256:4f3f9abd426e2022dcd93350adfd871037309705ce8ecbaf00b1860179bd3a88
Deleted: sha256:759b2bdefaadfff90f13a64c6df8fab699dde5e22a62afc0d072b01d99d99f77
Deleted: sha256:ce606f0ffe3ee917fc3a5d87b2215723328e33531f7829f07e1e883d098c80e3
Deleted: sha256:9495cbadb59bcc2f78661d5bbeded738b12b90471d00aad1d0887e7b39769db6
Deleted: sha256:1edafa1ad85b8ca2f85a55cf3cb85a379e3ec1811d1ff92a0a2e0e5b7b0c90ae
Deleted: sha256:6e578ee866b469a555d1e8997ba07e831bbfceb3719efc99d5eaed52543ebf34
Deleted: sha256:82f1a1450c4e5983d517a4e65b7aa3cce9ae3ceca73259420561b1a8dcd8a556
Deleted: sha256:ecb7c894c893fe018d3aaea033edf123f40ea677d4e608fcf698007748f2dfcb
Deleted: sha256:44eb67755388795f9fe4f56af034ce307817b1db10a24418525e7c3d6061406d
Deleted: sha256:9af88b5d8d20c902c7e3565b7bce6dc4e1cccf475e19fc67bfa6e346dcc3e8a3
Deleted: sha256:2634bb11b85989085a279f3b2029e8d80c76188ee4cba31d8793b1d17a367037
Deleted: sha256:2389c850bf1514e283444c2c17afb0b4331cd773a2a8522a7817ccb92fa2f9bc
Deleted: sha256:86a3bdf674460c80aabd8e348c1dc02aefce999304ed382cde36f973e6dea6e0
Deleted: sha256:af9a5da25e3db9de7fbe95b1b40dc57dfd117d0351ec172c92a8e677d2a4603e
Deleted: sha256:658c2d9180746f1d74884036de1577e59ca510f39073ef069e206cf29a5c7f96
Deleted: sha256:7f7236fc30c80cb63169ba2ad2b27a7e836bfc7d9d5fb7d89eb5d1b3c90bad21
Deleted: sha256:c97e23aebac90618dee674a4493bfbe8a5bc780e2d92db54db025bbe7616def1
Deleted: sha256:a27b7c24b2662e1158c00ff983460c6b41132d20e1163bc3a155fa7fd92a2dad
Deleted: sha256:e1055b3d8a84bca5dc3b6ab6792e28eedbf181e3e61bea7537741387b4295322
Deleted: sha256:c18349d50fb90321ec9302e4446224a728b948ec83cb4a88959ff5d4f12c6795
Deleted: sha256:1e580aee152628a93d6189bc68682b3574f7a653ff9c01703006d9cfe95a4d0a
Deleted: sha256:a73921c2fbed772bf33a1f176e5a226ca7a48039260c07c13faa8bd88d5b2e48
Deleted: sha256:99ee561cebdb144fa288970a5fdf599205f098ab652ab3b7e9cc3a48b9cc035a
Deleted: sha256:c831acfc87411fdd74fc841b1039b308949a575054bf446dc8e1764e56101c92
Digests:
- us.gcr.io/apache-beam-testing/java-postcommit-it/java@sha256:2dc70cffa7dfac40f07c647d4310db6fe722d1775856efefea919f00bb9b90ca
  Associated tags:
 - 20210720180057
Tags:
- us.gcr.io/apache-beam-testing/java-postcommit-it/java:20210720180057
Deleted [us.gcr.io/apache-beam-testing/java-postcommit-it/java:20210720180057].
Deleted [us.gcr.io/apache-beam-testing/java-postcommit-it/java@sha256:2dc70cffa7dfac40f07c647d4310db6fe722d1775856efefea919f00bb9b90ca].

FAILURE: Build failed with an exception.

* What went wrong:
Execution failed for task ':runners:google-cloud-dataflow-java:validatesRunnerV2TestStreaming'.
> There were failing tests. See the report at: file://<https://ci-beam.apache.org/job/beam_PostCommit_Java_VR_Dataflow_V2_Streaming/ws/src/runners/google-cloud-dataflow-java/build/reports/tests/validatesRunnerV2TestStreaming/index.html>

* Try:
Run with --stacktrace option to get the stack trace. Run with --info or --debug option to
get more log output. Run with --scan to get full insights.

* Get more help at https://help.gradle.org

Deprecated Gradle features were used in this build, making it incompatible with Gradle 7.0.
Use '--warning-mode all' to show the individual deprecation warnings.
See https://docs.gradle.org/6.8.3/userguide/command_line_interface.html#sec:command_line_warnings

BUILD FAILED in 5h 36m 46s
130 actionable tasks: 89 executed, 39 from cache, 2 up-to-date

Publishing build scan...
https://gradle.com/s/yfdgbic77dwf2

Build step 'Invoke Gradle script' changed build result to FAILURE
Build step 'Invoke Gradle script' marked build as failure

---------------------------------------------------------------------
To unsubscribe, e-mail: builds-unsubscribe@beam.apache.org
For additional commands, e-mail: builds-help@beam.apache.org


Mime
View raw message