beam-builds mailing list archives

Site index · List index
Message view « Date » · « Thread »
Top « Date » · « Thread »
From Apache Jenkins Server <jenk...@builds.apache.org>
Subject Build failed in Jenkins: beam_PostCommit_Java_DataflowV2 #439
Date Wed, 21 Jul 2021 08:06:22 GMT
See <https://ci-beam.apache.org/job/beam_PostCommit_Java_DataflowV2/439/display/redirect?page=changes>

Changes:

[noreply] Update Container beam-master-20210720 (#15197)


------------------------------------------
[...truncated 74.55 KB...]
> Task :sdks:java:container:java8:docker

> Task :runners:google-cloud-dataflow-java:buildAndPushDockerContainer
WARNING: `gcloud docker` will not be supported for Docker client versions above 18.03.

As an alternative, use `gcloud auth configure-docker` to configure `docker` to
use `gcloud` as a credential helper, then use `docker` as you would for non-GCR
registries, e.g. `docker pull gcr.io/project-id/my-image`. Add
`--verbosity=error` to silence this warning: `gcloud docker
--verbosity=error -- pull gcr.io/project-id/my-image`.

See: https://cloud.google.com/container-registry/docs/support/deprecation-notices#gcloud-docker

The push refers to repository [us.gcr.io/apache-beam-testing/java-postcommit-it/java]
3b2c37af8aa2: Preparing
06a8bec137d5: Preparing
53ca751d2a7c: Preparing
2ce0803948d7: Preparing
cefee0db162c: Preparing
57cda9b9f7b5: Preparing
11dac8cfe0dd: Preparing
053d9739505f: Preparing
9650505ad883: Preparing
01d98a9c0f46: Preparing
565958547bd0: Preparing
8cd7059d2a48: Preparing
aed5f5426b27: Preparing
c3d00b097cce: Preparing
79c550eb7bd2: Preparing
7095af798ace: Preparing
fe6a4fdbedc0: Preparing
11dac8cfe0dd: Waiting
e4d0e810d54a: Preparing
053d9739505f: Waiting
4e006334a6fd: Preparing
8cd7059d2a48: Waiting
79c550eb7bd2: Waiting
aed5f5426b27: Waiting
7095af798ace: Waiting
fe6a4fdbedc0: Waiting
c3d00b097cce: Waiting
565958547bd0: Waiting
57cda9b9f7b5: Waiting
06a8bec137d5: Pushed
53ca751d2a7c: Pushed
cefee0db162c: Pushed
3b2c37af8aa2: Pushed
57cda9b9f7b5: Pushed
053d9739505f: Pushed
9650505ad883: Pushed
2ce0803948d7: Pushed
aed5f5426b27: Layer already exists
c3d00b097cce: Layer already exists
565958547bd0: Pushed
79c550eb7bd2: Layer already exists
7095af798ace: Layer already exists
fe6a4fdbedc0: Layer already exists
e4d0e810d54a: Layer already exists
4e006334a6fd: Layer already exists
11dac8cfe0dd: Pushed
8cd7059d2a48: Pushed
01d98a9c0f46: Pushed
20210721060053: digest: sha256:967bae51fe42ce821ad6fc3031380edf0fa96fb698f1b98bb13aeb2bcbc05734
size: 4310

> Task :runners:google-cloud-dataflow-java:coreSDKJavaRunnerV2IntegrationTest NO-SOURCE
> Task :runners:google-cloud-dataflow-java:examplesJavaRunnerV2IntegrationTest

***********************************************************
***********************************************************
**********************Set Up Pubsub************************
The Pub/Sub topic has been set up for this example: projects/apache-beam-testing/topics/testpipeline-jenkins-0721061050-cb23ce41
The Pub/Sub subscription has been set up for this example: projects/apache-beam-testing/subscriptions/testpipeline-jenkins-0721061050-cb23ce41
******************Set Up Big Query Table*******************
The BigQuery table has been set up for this example: apache-beam-testing:traffic_routes_1626847845509.traffic_routes_table
*************************Tear Down*************************
The Pub/Sub topic has been deleted: projects/apache-beam-testing/topics/testpipeline-jenkins-0721061050-cb23ce41
The Pub/Sub subscription has been deleted: projects/apache-beam-testing/subscriptions/testpipeline-jenkins-0721061050-cb23ce41
The BigQuery table might contain the example's output, and it is not deleted automatically:
apache-beam-testing:traffic_routes_1626847845509.traffic_routes_table
Please go to the Developers Console to delete it manually. Otherwise, you may be charged for
its usage.
***********************************************************
***********************************************************

***********************************************************
***********************************************************
**********************Set Up Pubsub************************
The Pub/Sub topic has been set up for this example: projects/apache-beam-testing/topics/testpipeline-jenkins-0721063444-19c9ac31
The Pub/Sub subscription has been set up for this example: projects/apache-beam-testing/subscriptions/testpipeline-jenkins-0721063444-19c9ac31
******************Set Up Big Query Table*******************
The BigQuery table has been set up for this example: apache-beam-testing:traffic_max_lane_flow_1626849284208.traffic_max_lane_flow_table
*************************Tear Down*************************
The Pub/Sub topic has been deleted: projects/apache-beam-testing/topics/testpipeline-jenkins-0721063444-19c9ac31
The Pub/Sub subscription has been deleted: projects/apache-beam-testing/subscriptions/testpipeline-jenkins-0721063444-19c9ac31
The BigQuery table might contain the example's output, and it is not deleted automatically:
apache-beam-testing:traffic_max_lane_flow_1626849284208.traffic_max_lane_flow_table
Please go to the Developers Console to delete it manually. Otherwise, you may be charged for
its usage.
***********************************************************
***********************************************************

> Task :runners:google-cloud-dataflow-java:googleCloudPlatformRunnerV2IntegrationTest

org.apache.beam.sdk.io.gcp.bigquery.BigQueryIOStorageReadIT > testBigQueryStorageRead1GArrow
FAILED
    java.lang.RuntimeException at BigQueryIOStorageReadIT.java:102

org.apache.beam.sdk.io.gcp.bigquery.BigQuerySchemaUpdateOptionsIT > testAllowFieldAddition
FAILED
    java.lang.RuntimeException at BigQuerySchemaUpdateOptionsIT.java:154

org.apache.beam.sdk.io.gcp.bigquery.BigQueryTimePartitioningClusteringIT > testE2EBigQueryClusteringDynamicDestinations
FAILED
    java.lang.RuntimeException at BigQueryTimePartitioningClusteringIT.java:221

org.apache.beam.sdk.io.gcp.bigquery.BigQueryIOReadIT > testBigQueryRead1G FAILED
    java.lang.RuntimeException at BigQueryIOReadIT.java:86

org.apache.beam.sdk.io.gcp.bigquery.BigQuerySchemaUpdateOptionsIT > testAllowFieldRelaxation
FAILED
    java.lang.RuntimeException at BigQuerySchemaUpdateOptionsIT.java:154

org.apache.beam.sdk.io.gcp.healthcare.HL7v2IOReadWriteIT > testHL7v2IOE2E FAILED
    java.lang.RuntimeException at HL7v2IOReadWriteIT.java:119

org.apache.beam.sdk.io.gcp.bigquery.BigQueryTimePartitioningClusteringIT > testE2EBigQueryTimePartitioning
FAILED
    java.lang.RuntimeException at BigQueryTimePartitioningClusteringIT.java:144

org.apache.beam.sdk.io.gcp.bigquery.BigQueryIOReadIT > testBigQueryRead1M FAILED
    java.lang.RuntimeException at BigQueryIOReadIT.java:86

org.apache.beam.sdk.io.gcp.pubsub.PubsubReadIT > testReadPubsubMessageId FAILED
    java.lang.AssertionError at PubsubReadIT.java:88

org.apache.beam.sdk.io.gcp.bigquery.BigQueryTimePartitioningClusteringIT > testE2EBigQueryClustering
FAILED
    java.lang.RuntimeException at BigQueryTimePartitioningClusteringIT.java:169

org.apache.beam.sdk.io.gcp.datastore.V1ReadIT > testE2EV1Read FAILED
    java.lang.RuntimeException at V1ReadIT.java:92

org.apache.beam.sdk.io.gcp.bigquery.BigQueryIOReadIT > testBigQueryRead1T FAILED
    java.lang.RuntimeException at BigQueryIOReadIT.java:86

org.apache.beam.sdk.io.gcp.pubsub.PubsubReadIT > testReadPublicData FAILED
    java.lang.AssertionError at PubsubReadIT.java:60

org.apache.beam.sdk.io.gcp.bigquery.BigQueryToTableIT > testNewTypesQueryWithReshuffle
FAILED
    java.lang.RuntimeException at BigQueryToTableIT.java:116

org.apache.beam.sdk.io.gcp.datastore.V1ReadIT > testE2EV1ReadWithGQLQueryWithLimit FAILED
    java.lang.RuntimeException at V1ReadIT.java:135

org.apache.beam.sdk.io.gcp.bigquery.BigQueryNestedRecordsIT > testNestedRecords FAILED
    java.lang.RuntimeException at BigQueryNestedRecordsIT.java:116

org.apache.beam.sdk.io.gcp.spanner.SpannerReadIT > testQuery FAILED
    java.lang.RuntimeException at SpannerReadIT.java:169

org.apache.beam.sdk.io.gcp.datastore.V1ReadIT > testE2EV1ReadWithGQLQueryWithNoLimit FAILED
    java.lang.RuntimeException at V1ReadIT.java:135

org.apache.beam.sdk.io.gcp.bigquery.BigQueryToTableIT > testLegacyQueryWithoutReshuffle
FAILED
    java.lang.RuntimeException at BigQueryToTableIT.java:116

org.apache.beam.sdk.io.gcp.bigtable.BigtableWriteIT > testE2EBigtableWrite FAILED
    java.lang.RuntimeException at BigtableWriteIT.java:130

org.apache.beam.sdk.io.gcp.spanner.SpannerReadIT > testRead FAILED
    java.lang.RuntimeException at SpannerReadIT.java:149

org.apache.beam.sdk.io.gcp.bigquery.BigQueryToTableIT > testNewTypesQueryWithoutReshuffle
FAILED
    java.lang.RuntimeException at BigQueryToTableIT.java:116

org.apache.beam.sdk.io.gcp.healthcare.HL7v2IOWriteIT > testHL7v2IOWrite FAILED
    java.lang.RuntimeException at HL7v2IOWriteIT.java:92

org.apache.beam.sdk.io.gcp.spanner.SpannerReadIT > testReadAllRecordsInDb FAILED
    java.lang.RuntimeException at SpannerReadIT.java:201

org.apache.beam.sdk.io.gcp.bigquery.BigQueryToTableIT > testStandardQueryWithoutCustom
FAILED
    java.lang.RuntimeException at BigQueryToTableIT.java:116

org.apache.beam.sdk.io.gcp.bigtable.BigtableReadIT > testE2EBigtableRead FAILED
    java.lang.RuntimeException at BigtableReadIT.java:58

org.apache.beam.sdk.io.gcp.datastore.V1WriteIT > testE2EV1WriteWithLargeEntities FAILED
    java.lang.RuntimeException at V1WriteIT.java:104

org.apache.beam.sdk.io.gcp.datastore.V1WriteIT > testE2EV1Write FAILED
    java.lang.RuntimeException at V1WriteIT.java:69

37 tests completed, 28 failed, 1 skipped

> Task :runners:google-cloud-dataflow-java:googleCloudPlatformRunnerV2IntegrationTest FAILED

> Task :runners:google-cloud-dataflow-java:cleanUpDockerImages
Untagged: us.gcr.io/apache-beam-testing/java-postcommit-it/java:20210721060053
Untagged: us.gcr.io/apache-beam-testing/java-postcommit-it/java@sha256:967bae51fe42ce821ad6fc3031380edf0fa96fb698f1b98bb13aeb2bcbc05734
Deleted: sha256:5f9c796918460a6bc81707d72216aa660ed5d20425243f21e4a428527651abc9
Deleted: sha256:074a35e91c533a5952d16d2bcf547182130a9c60c293793dfad85e3cb97c0b7b
Deleted: sha256:43f309b52329bf5325acb6152b84daf92d88d728333b1c9900d6da8b475ebc68
Deleted: sha256:562b90b937458b8041737e0b8c44922a8cb6c824799017f3f220f1eb6cfc944d
Deleted: sha256:d65f75867677479c4092d6343f6a333f6696e5d5bd9f5553a706e2c1864dd055
Deleted: sha256:65506f7e64fecd4d7882a92ff759efb4b1415b5544e7a2db81b8d1544a4fa242
Deleted: sha256:607cb1df549f38f38e0f262becb047bf03fd366a197cd4dc6ea102ad53b0914e
Deleted: sha256:00917869b7fbba8d2b468336e9be8c56cc705f0776d5cc340fd0aa2dc2cd1801
Deleted: sha256:ef0a4b128f64af7bbd6883e0cf2f49ad0f030a6872579d6c10a702eeaba3c78e
Deleted: sha256:7ac3c7635995c8742d6801d20966215b2ff6aba6d659397e12f7c433dd8d6785
Deleted: sha256:be13d669a115d6d1a0913565666bf78a25dbd23b8b4152b6929df89ef9a3ac47
Deleted: sha256:9e3dffcc03a6f1baa40a81866e8c2bd5ae9f7d333ff6221970a3dbdee6f634d5
Deleted: sha256:6cabb41350418fd12c125ebfdef10f03fede624d81e9fef5ebac2d9273dbe4b6
Deleted: sha256:d6a91dac4e7e9e3dd41b8d354e46e89dad43eb01ad90db76c2f9ad16b5f76e70
Deleted: sha256:4a85db1b9ae10e2fc1a262dbc82853f855e6f8e775e4210f3c8923f899c99bc8
Deleted: sha256:43076adfe7e5babaf7e84c8d5b60bb94c67809a93e38afa582b2113350b973fc
ERROR: (gcloud.container.images.delete) [us.gcr.io/apache-beam-testing/java-postcommit-it/java:20210721060053]
is not a valid name. Expected tag in the form "base:tag" or "tag" or digest in the form "sha256:<digest>"

> Task :runners:google-cloud-dataflow-java:cleanUpDockerImages FAILED

FAILURE: Build completed with 2 failures.

1: Task failed with an exception.
-----------
* What went wrong:
Execution failed for task ':runners:google-cloud-dataflow-java:googleCloudPlatformRunnerV2IntegrationTest'.
> There were failing tests. See the report at: file://<https://ci-beam.apache.org/job/beam_PostCommit_Java_DataflowV2/ws/src/runners/google-cloud-dataflow-java/build/reports/tests/googleCloudPlatformRunnerV2IntegrationTest/index.html>

* Try:
Run with --stacktrace option to get the stack trace. Run with --info or --debug option to
get more log output. Run with --scan to get full insights.
==============================================================================

2: Task failed with an exception.
-----------
* Where:
Build file '<https://ci-beam.apache.org/job/beam_PostCommit_Java_DataflowV2/ws/src/runners/google-cloud-dataflow-java/build.gradle'>
line: 279

* What went wrong:
Execution failed for task ':runners:google-cloud-dataflow-java:cleanUpDockerImages'.
> Process 'command 'gcloud'' finished with non-zero exit value 1

* Try:
Run with --stacktrace option to get the stack trace. Run with --info or --debug option to
get more log output. Run with --scan to get full insights.
==============================================================================

* Get more help at https://help.gradle.org

Deprecated Gradle features were used in this build, making it incompatible with Gradle 7.0.
Use '--warning-mode all' to show the individual deprecation warnings.
See https://docs.gradle.org/6.8.3/userguide/command_line_interface.html#sec:command_line_warnings

BUILD FAILED in 2h 5m 55s
135 actionable tasks: 93 executed, 40 from cache, 2 up-to-date

Publishing build scan...
https://gradle.com/s/ijov73tbrrjyg

Build step 'Invoke Gradle script' changed build result to FAILURE
Build step 'Invoke Gradle script' marked build as failure

---------------------------------------------------------------------
To unsubscribe, e-mail: builds-unsubscribe@beam.apache.org
For additional commands, e-mail: builds-help@beam.apache.org


Mime
View raw message