beam-builds mailing list archives

Site index · List index
Message view « Date » · « Thread »
Top « Date » · « Thread »
From Apache Jenkins Server <jenk...@builds.apache.org>
Subject Build failed in Jenkins: beam_PerformanceTests_XmlIOIT #4790
Date Thu, 01 Jul 2021 06:08:05 GMT
See <https://ci-beam.apache.org/job/beam_PerformanceTests_XmlIOIT/4790/display/redirect>

Changes:


------------------------------------------
[...truncated 985.69 KB...]
	at java.io.BufferedOutputStream.flushBuffer(BufferedOutputStream.java:82)
	at java.io.BufferedOutputStream.flush(BufferedOutputStream.java:140)
	at java.io.FilterOutputStream.flush(FilterOutputStream.java:140)
	at org.gradle.cache.internal.btree.ByteOutput.done(ByteOutput.java:62)
	at org.gradle.cache.internal.btree.FileBackedBlockStore$BlockImpl.write(FileBackedBlockStore.java:223)
	at org.gradle.cache.internal.btree.FileBackedBlockStore.write(FileBackedBlockStore.java:136)
	... 23 more
Failed to execute org.gradle.cache.internal.AsyncCacheAccessDecoratedCache$$Lambda$167/980314407@fe70267.
org.gradle.api.UncheckedIOException: Could not add entry '<https://ci-beam.apache.org/job/beam_PerformanceTests_XmlIOIT/ws/src/sdks/java/core/src/test/java/org/apache/beam/sdk/util/ExposedByteArrayInputStreamTest.java'>
to cache fileHashes.bin (<https://ci-beam.apache.org/job/beam_PerformanceTests_XmlIOIT/ws/src/.gradle/6.8.3/fileHashes/fileHashes.bin).>
	at org.gradle.cache.internal.btree.BTreePersistentIndexedCache.put(BTreePersistentIndexedCache.java:162)
	at org.gradle.cache.internal.DefaultMultiProcessSafePersistentIndexedCache.lambda$put$1(DefaultMultiProcessSafePersistentIndexedCache.java:67)
	at org.gradle.cache.internal.DefaultFileLockManager$DefaultFileLock.doWriteAction(DefaultFileLockManager.java:215)
	at org.gradle.cache.internal.DefaultFileLockManager$DefaultFileLock.writeFile(DefaultFileLockManager.java:205)
	at org.gradle.cache.internal.DefaultCacheAccess$UnitOfWorkFileAccess.writeFile(DefaultCacheAccess.java:449)
	at org.gradle.cache.internal.DefaultMultiProcessSafePersistentIndexedCache.put(DefaultMultiProcessSafePersistentIndexedCache.java:67)
	at org.gradle.cache.internal.AsyncCacheAccessDecoratedCache.lambda$putLater$1(AsyncCacheAccessDecoratedCache.java:56)
	at org.gradle.internal.concurrent.ExecutorPolicy$CatchAndRecordFailures.onExecute(ExecutorPolicy.java:64)
	at org.gradle.cache.internal.CacheAccessWorker$2.run(CacheAccessWorker.java:185)
	at org.gradle.internal.Factories$1.create(Factories.java:31)
	at org.gradle.cache.internal.DefaultCacheAccess.useCache(DefaultCacheAccess.java:220)
	at org.gradle.cache.internal.DefaultCacheAccess.useCache(DefaultCacheAccess.java:201)
	at org.gradle.cache.internal.CacheAccessWorker.flushOperations(CacheAccessWorker.java:175)
	at org.gradle.cache.internal.CacheAccessWorker.run(CacheAccessWorker.java:145)
	at org.gradle.internal.concurrent.ExecutorPolicy$CatchAndRecordFailures.onExecute(ExecutorPolicy.java:64)
	at org.gradle.internal.concurrent.ManagedExecutorImpl$1.run(ManagedExecutorImpl.java:48)
	at java.util.concurrent.ThreadPoolExecutor.runWorker(ThreadPoolExecutor.java:1149)
	at java.util.concurrent.ThreadPoolExecutor$Worker.run(ThreadPoolExecutor.java:624)
	at org.gradle.internal.concurrent.ThreadFactoryImpl$ManagedThreadRunnable.run(ThreadFactoryImpl.java:56)
	at java.lang.Thread.run(Thread.java:748)
Caused by: org.gradle.api.UncheckedIOException: java.io.IOException: No space left on device
	at org.gradle.cache.internal.btree.FileBackedBlockStore.write(FileBackedBlockStore.java:140)
	at org.gradle.cache.internal.btree.CachingBlockStore.flush(CachingBlockStore.java:64)
	at org.gradle.cache.internal.btree.FreeListBlockStore.flush(FreeListBlockStore.java:103)
	at org.gradle.cache.internal.btree.StateCheckBlockStore.flush(StateCheckBlockStore.java:85)
	at org.gradle.cache.internal.btree.BTreePersistentIndexedCache.put(BTreePersistentIndexedCache.java:160)
	... 19 more
Caused by: java.io.IOException: No space left on device
	at java.io.RandomAccessFile.writeBytes(Native Method)
	at java.io.RandomAccessFile.write(RandomAccessFile.java:525)
	at org.gradle.internal.io.RandomAccessFileOutputStream.write(RandomAccessFileOutputStream.java:46)
	at java.io.BufferedOutputStream.flushBuffer(BufferedOutputStream.java:82)
	at java.io.BufferedOutputStream.flush(BufferedOutputStream.java:140)
	at java.io.FilterOutputStream.flush(FilterOutputStream.java:140)
	at org.gradle.cache.internal.btree.ByteOutput.done(ByteOutput.java:62)
	at org.gradle.cache.internal.btree.FileBackedBlockStore$BlockImpl.write(FileBackedBlockStore.java:223)
	at org.gradle.cache.internal.btree.FileBackedBlockStore.write(FileBackedBlockStore.java:136)
	... 23 more
Failed to execute org.gradle.cache.internal.AsyncCacheAccessDecoratedCache$$Lambda$167/980314407@4e75d5be.
org.gradle.api.UncheckedIOException: Could not add entry '<https://ci-beam.apache.org/job/beam_PerformanceTests_XmlIOIT/ws/src/sdks/java/core/src/test/java/org/apache/beam/sdk/RequiresStableInputIT.java'>
to cache fileHashes.bin (<https://ci-beam.apache.org/job/beam_PerformanceTests_XmlIOIT/ws/src/.gradle/6.8.3/fileHashes/fileHashes.bin).>
	at org.gradle.cache.internal.btree.BTreePersistentIndexedCache.put(BTreePersistentIndexedCache.java:162)
	at org.gradle.cache.internal.DefaultMultiProcessSafePersistentIndexedCache.lambda$put$1(DefaultMultiProcessSafePersistentIndexedCache.java:67)
	at org.gradle.cache.internal.DefaultFileLockManager$DefaultFileLock.doWriteAction(DefaultFileLockManager.java:215)
	at org.gradle.cache.internal.DefaultFileLockManager$DefaultFileLock.writeFile(DefaultFileLockManager.java:205)
	at org.gradle.cache.internal.DefaultCacheAccess$UnitOfWorkFileAccess.writeFile(DefaultCacheAccess.java:449)
	at org.gradle.cache.internal.DefaultMultiProcessSafePersistentIndexedCache.put(DefaultMultiProcessSafePersistentIndexedCache.java:67)
	at org.gradle.cache.internal.AsyncCacheAccessDecoratedCache.lambda$putLater$1(AsyncCacheAccessDecoratedCache.java:56)
	at org.gradle.internal.concurrent.ExecutorPolicy$CatchAndRecordFailures.onExecute(ExecutorPolicy.java:64)
	at org.gradle.cache.internal.CacheAccessWorker$2.run(CacheAccessWorker.java:185)
	at org.gradle.internal.Factories$1.create(Factories.java:31)
	at org.gradle.cache.internal.DefaultCacheAccess.useCache(DefaultCacheAccess.java:220)
	at org.gradle.cache.internal.DefaultCacheAccess.useCache(DefaultCacheAccess.java:201)
	at org.gradle.cache.internal.CacheAccessWorker.flushOperations(CacheAccessWorker.java:175)
	at org.gradle.cache.internal.CacheAccessWorker.run(CacheAccessWorker.java:145)
	at org.gradle.internal.concurrent.ExecutorPolicy$CatchAndRecordFailures.onExecute(ExecutorPolicy.java:64)
	at org.gradle.internal.concurrent.ManagedExecutorImpl$1.run(ManagedExecutorImpl.java:48)
	at java.util.concurrent.ThreadPoolExecutor.runWorker(ThreadPoolExecutor.java:1149)
	at java.util.concurrent.ThreadPoolExecutor$Worker.run(ThreadPoolExecutor.java:624)
	at org.gradle.internal.concurrent.ThreadFactoryImpl$ManagedThreadRunnable.run(ThreadFactoryImpl.java:56)
	at java.lang.Thread.run(Thread.java:748)
Caused by: org.gradle.api.UncheckedIOException: java.io.IOException: No space left on device
	at org.gradle.cache.internal.btree.FileBackedBlockStore.write(FileBackedBlockStore.java:140)
	at org.gradle.cache.internal.btree.CachingBlockStore.flush(CachingBlockStore.java:64)
	at org.gradle.cache.internal.btree.FreeListBlockStore.flush(FreeListBlockStore.java:103)
	at org.gradle.cache.internal.btree.StateCheckBlockStore.flush(StateCheckBlockStore.java:85)
	at org.gradle.cache.internal.btree.BTreePersistentIndexedCache.put(BTreePersistentIndexedCache.java:160)
	... 19 more
Caused by: java.io.IOException: No space left on device
	at java.io.RandomAccessFile.writeBytes(Native Method)
	at java.io.RandomAccessFile.write(RandomAccessFile.java:525)
	at org.gradle.internal.io.RandomAccessFileOutputStream.write(RandomAccessFileOutputStream.java:46)
	at java.io.BufferedOutputStream.flushBuffer(BufferedOutputStream.java:82)
	at java.io.BufferedOutputStream.flush(BufferedOutputStream.java:140)
	at java.io.FilterOutputStream.flush(FilterOutputStream.java:140)
	at org.gradle.cache.internal.btree.ByteOutput.done(ByteOutput.java:62)
	at org.gradle.cache.internal.btree.FileBackedBlockStore$BlockImpl.write(FileBackedBlockStore.java:223)
	at org.gradle.cache.internal.btree.FileBackedBlockStore.write(FileBackedBlockStore.java:136)
	... 23 more
Failed to execute org.gradle.cache.internal.AsyncCacheAccessDecoratedCache$$Lambda$167/980314407@4ffa7756.
org.gradle.api.UncheckedIOException: Could not add entry '<https://ci-beam.apache.org/job/beam_PerformanceTests_XmlIOIT/ws/src/sdks/java/core/src/test/java/org/apache/beam/sdk/PipelineTest.java'>
to cache fileHashes.bin (<https://ci-beam.apache.org/job/beam_PerformanceTests_XmlIOIT/ws/src/.gradle/6.8.3/fileHashes/fileHashes.bin).>
	at org.gradle.cache.internal.btree.BTreePersistentIndexedCache.put(BTreePersistentIndexedCache.java:162)
	at org.gradle.cache.internal.DefaultMultiProcessSafePersistentIndexedCache.lambda$put$1(DefaultMultiProcessSafePersistentIndexedCache.java:67)
	at org.gradle.cache.internal.DefaultFileLockManager$DefaultFileLock.doWriteAction(DefaultFileLockManager.java:215)
	at org.gradle.cache.internal.DefaultFileLockManager$DefaultFileLock.writeFile(DefaultFileLockManager.java:205)
	at org.gradle.cache.internal.DefaultCacheAccess$UnitOfWorkFileAccess.writeFile(DefaultCacheAccess.java:449)
	at org.gradle.cache.internal.DefaultMultiProcessSafePersistentIndexedCache.put(DefaultMultiProcessSafePersistentIndexedCache.java:67)
	at org.gradle.cache.internal.AsyncCacheAccessDecoratedCache.lambda$putLater$1(AsyncCacheAccessDecoratedCache.java:56)
	at org.gradle.internal.concurrent.ExecutorPolicy$CatchAndRecordFailures.onExecute(ExecutorPolicy.java:64)
	at org.gradle.cache.internal.CacheAccessWorker$2.run(CacheAccessWorker.java:185)
	at org.gradle.internal.Factories$1.create(Factories.java:31)
	at org.gradle.cache.internal.DefaultCacheAccess.useCache(DefaultCacheAccess.java:220)
	at org.gradle.cache.internal.DefaultCacheAccess.useCache(DefaultCacheAccess.java:201)
	at org.gradle.cache.internal.CacheAccessWorker.flushOperations(CacheAccessWorker.java:175)
	at org.gradle.cache.internal.CacheAccessWorker.run(CacheAccessWorker.java:145)
	at org.gradle.internal.concurrent.ExecutorPolicy$CatchAndRecordFailures.onExecute(ExecutorPolicy.java:64)
	at org.gradle.internal.concurrent.ManagedExecutorImpl$1.run(ManagedExecutorImpl.java:48)
	at java.util.concurrent.ThreadPoolExecutor.runWorker(ThreadPoolExecutor.java:1149)
	at java.util.concurrent.ThreadPoolExecutor$Worker.run(ThreadPoolExecutor.java:624)
	at org.gradle.internal.concurrent.ThreadFactoryImpl$ManagedThreadRunnable.run(ThreadFactoryImpl.java:56)
	at java.lang.Thread.run(Thread.java:748)
Caused by: org.gradle.api.UncheckedIOException: java.io.IOException: No space left on device
	at org.gradle.cache.internal.btree.FileBackedBlockStore.write(FileBackedBlockStore.java:140)
	at org.gradle.cache.internal.btree.CachingBlockStore.flush(CachingBlockStore.java:64)
	at org.gradle.cache.internal.btree.FreeListBlockStore.flush(FreeListBlockStore.java:103)
	at org.gradle.cache.internal.btree.StateCheckBlockStore.flush(StateCheckBlockStore.java:85)
	at org.gradle.cache.internal.btree.BTreePersistentIndexedCache.put(BTreePersistentIndexedCache.java:160)
	... 19 more
Caused by: java.io.IOException: No space left on device
	at java.io.RandomAccessFile.writeBytes(Native Method)
	at java.io.RandomAccessFile.write(RandomAccessFile.java:525)
	at org.gradle.internal.io.RandomAccessFileOutputStream.write(RandomAccessFileOutputStream.java:46)
	at java.io.BufferedOutputStream.flushBuffer(BufferedOutputStream.java:82)
	at java.io.BufferedOutputStream.flush(BufferedOutputStream.java:140)
	at java.io.FilterOutputStream.flush(FilterOutputStream.java:140)
	at org.gradle.cache.internal.btree.ByteOutput.done(ByteOutput.java:62)
	at org.gradle.cache.internal.btree.FileBackedBlockStore$BlockImpl.write(FileBackedBlockStore.java:223)
	at org.gradle.cache.internal.btree.FileBackedBlockStore.write(FileBackedBlockStore.java:136)
	... 23 more
Failed to execute org.gradle.cache.internal.AsyncCacheAccessDecoratedCache$$Lambda$167/980314407@1e07ddbe.
org.gradle.api.UncheckedIOException: Could not add entry '<https://ci-beam.apache.org/job/beam_PerformanceTests_XmlIOIT/ws/src/sdks/java/core/src/test/java/org/apache/beam/sdk/TestUtils.java'>
to cache fileHashes.bin (<https://ci-beam.apache.org/job/beam_PerformanceTests_XmlIOIT/ws/src/.gradle/6.8.3/fileHashes/fileHashes.bin).>
	at org.gradle.cache.internal.btree.BTreePersistentIndexedCache.put(BTreePersistentIndexedCache.java:162)
	at org.gradle.cache.internal.DefaultMultiProcessSafePersistentIndexedCache.lambda$put$1(DefaultMultiProcessSafePersistentIndexedCache.java:67)
	at org.gradle.cache.internal.DefaultFileLockManager$DefaultFileLock.doWriteAction(DefaultFileLockManager.java:215)
	at org.gradle.cache.internal.DefaultFileLockManager$DefaultFileLock.writeFile(DefaultFileLockManager.java:205)
	at org.gradle.cache.internal.DefaultCacheAccess$UnitOfWorkFileAccess.writeFile(DefaultCacheAccess.java:449)
	at org.gradle.cache.internal.DefaultMultiProcessSafePersistentIndexedCache.put(DefaultMultiProcessSafePersistentIndexedCache.java:67)
	at org.gradle.cache.internal.AsyncCacheAccessDecoratedCache.lambda$putLater$1(AsyncCacheAccessDecoratedCache.java:56)
	at org.gradle.internal.concurrent.ExecutorPolicy$CatchAndRecordFailures.onExecute(ExecutorPolicy.java:64)
	at org.gradle.cache.internal.CacheAccessWorker$2.run(CacheAccessWorker.java:185)
	at org.gradle.internal.Factories$1.create(Factories.java:31)
	at org.gradle.cache.internal.DefaultCacheAccess.useCache(DefaultCacheAccess.java:220)
	at org.gradle.cache.internal.DefaultCacheAccess.useCache(DefaultCacheAccess.java:201)
	at org.gradle.cache.internal.CacheAccessWorker.flushOperations(CacheAccessWorker.java:175)
	at org.gradle.cache.internal.CacheAccessWorker.run(CacheAccessWorker.java:145)
	at org.gradle.internal.concurrent.ExecutorPolicy$CatchAndRecordFailures.onExecute(ExecutorPolicy.java:64)
	at org.gradle.internal.concurrent.ManagedExecutorImpl$1.run(ManagedExecutorImpl.java:48)
	at java.util.concurrent.ThreadPoolExecutor.runWorker(ThreadPoolExecutor.java:1149)
	at java.util.concurrent.ThreadPoolExecutor$Worker.run(ThreadPoolExecutor.java:624)
	at org.gradle.internal.concurrent.ThreadFactoryImpl$ManagedThreadRunnable.run(ThreadFactoryImpl.java:56)
	at java.lang.Thread.run(Thread.java:748)
Caused by: org.gradle.api.UncheckedIOException: java.io.IOException: No space left on device
	at org.gradle.cache.internal.btree.FileBackedBlockStore.write(FileBackedBlockStore.java:140)
	at org.gradle.cache.internal.btree.CachingBlockStore.flush(CachingBlockStore.java:64)
	at org.gradle.cache.internal.btree.FreeListBlockStore.flush(FreeListBlockStore.java:103)
	at org.gradle.cache.internal.btree.StateCheckBlockStore.flush(StateCheckBlockStore.java:85)
	at org.gradle.cache.internal.btree.BTreePersistentIndexedCache.put(BTreePersistentIndexedCache.java:160)
	... 19 more
Caused by: java.io.IOException: No space left on device
	at java.io.RandomAccessFile.writeBytes(Native Method)
	at java.io.RandomAccessFile.write(RandomAccessFile.java:525)
	at org.gradle.internal.io.RandomAccessFileOutputStream.write(RandomAccessFileOutputStream.java:46)
	at java.io.BufferedOutputStream.flushBuffer(BufferedOutputStream.java:82)
	at java.io.BufferedOutputStream.flush(BufferedOutputStream.java:140)
	at java.io.FilterOutputStream.flush(FilterOutputStream.java:140)
	at org.gradle.cache.internal.btree.ByteOutput.done(ByteOutput.java:62)
	at org.gradle.cache.internal.btree.FileBackedBlockStore$BlockImpl.write(FileBackedBlockStore.java:223)
	at org.gradle.cache.internal.btree.FileBackedBlockStore.write(FileBackedBlockStore.java:136)
	... 23 more

> Task :sdks:java:core:compileTestJava FAILED
Custom actions are attached to task ':sdks:java:core:compileTestJava'.
Build cache key for task ':sdks:java:core:compileTestJava' is 26813e79020d269e22fa432b25b68578
Task ':sdks:java:core:compileTestJava' is not up-to-date because:
  No history is available.
:sdks:java:core:compileTestJava (Thread[Daemon ****,5,main]) completed. Took 1.481 secs.

FAILURE: Build completed with 3 failures.

1: Task failed with an exception.
-----------
* What went wrong:
Execution failed for task ':sdks:java:harness:jar'.
> Could not add file '<https://ci-beam.apache.org/job/beam_PerformanceTests_XmlIOIT/ws/src/sdks/java/harness/build/classes/java/main/org/apache/beam/fn/harness/HandlesSplits$SplitResult.class'>
to ZIP '<https://ci-beam.apache.org/job/beam_PerformanceTests_XmlIOIT/ws/src/sdks/java/harness/build/libs/beam-sdks-java-harness-2.32.0-SNAPSHOT-unshaded.jar'.>

* Try:
Run with --stacktrace option to get the stack trace. Run with --debug option to get more log
output. Run with --scan to get full insights.
==============================================================================

2: Task failed with an exception.
-----------
* What went wrong:
Execution failed for task ':sdks:java:harness:shadowJar'.
> Failed to create directory '<https://ci-beam.apache.org/job/beam_PerformanceTests_XmlIOIT/ws/src/sdks/java/harness/build/tmp/shadowJar'>

* Try:
Run with --stacktrace option to get the stack trace. Run with --debug option to get more log
output. Run with --scan to get full insights.
==============================================================================

3: Task failed with an exception.
-----------
* What went wrong:
Execution failed for task ':sdks:java:core:compileTestJava'.
> Failed to load cache entry for task ':sdks:java:core:compileTestJava'

* Try:
Run with --stacktrace option to get the stack trace. Run with --debug option to get more log
output. Run with --scan to get full insights.
==============================================================================

* Get more help at https://help.gradle.org

Deprecated Gradle features were used in this build, making it incompatible with Gradle 7.0.
Use '--warning-mode all' to show the individual deprecation warnings.
See https://docs.gradle.org/6.8.3/userguide/command_line_interface.html#sec:command_line_warnings

BUILD FAILED in 43s
93 actionable tasks: 65 executed, 28 from cache

A build scan cannot be produced as an error occurred spooling the build data.
Please report this problem via https://gradle.com/help/plugin and include the following via
copy/paste:

----------
Gradle version: 6.8.3
Plugin version: 3.4.1

java.lang.IllegalStateException: Could not close the event spooler due to previous errors.
	at com.gradle.scan.plugin.internal.f.c.c.a(SourceFile:128)
	at com.gradle.scan.plugin.internal.q.a$a.a(SourceFile:31)
	at com.gradle.scan.plugin.internal.q.a$a.a(SourceFile:20)
	at com.gradle.scan.plugin.internal.q.a.c(SourceFile:67)
----------


FAILURE: Build failed with an exception.

* What went wrong:
Could not add entry ':sdks:java:harness:jar' to cache executionHistory.bin (<https://ci-beam.apache.org/job/beam_PerformanceTests_XmlIOIT/ws/src/.gradle/6.8.3/executionHistory/executionHistory.bin).>
> java.io.IOException: No space left on device

* Try:
Run with --stacktrace option to get the stack trace. Run with --debug option to get more log
output. Run with --scan to get full insights.

* Get more help at https://help.gradle.org

Deprecated Gradle features were used in this build, making it incompatible with Gradle 7.0.
Use '--warning-mode all' to show the individual deprecation warnings.
See https://docs.gradle.org/6.8.3/userguide/command_line_interface.html#sec:command_line_warnings

BUILD FAILED in 43s
Build step 'Invoke Gradle script' changed build result to FAILURE
Build step 'Invoke Gradle script' marked build as failure

---------------------------------------------------------------------
To unsubscribe, e-mail: builds-unsubscribe@beam.apache.org
For additional commands, e-mail: builds-help@beam.apache.org


Mime
View raw message