beam-builds mailing list archives

Site index · List index
Message view « Date » · « Thread »
Top « Date » · « Thread »
From Apache Jenkins Server <jenk...@builds.apache.org>
Subject Build failed in Jenkins: beam_PostCommit_Java_Nexmark_Dataflow_V2 #231
Date Wed, 21 Jul 2021 07:32:50 GMT
See <https://ci-beam.apache.org/job/beam_PostCommit_Java_Nexmark_Dataflow_V2/231/display/redirect?page=changes>

Changes:

[noreply] Update Container beam-master-20210720 (#15197)


------------------------------------------
[...truncated 695.90 KB...]
Jul 21, 2021 7:26:44 AM org.apache.beam.sdk.testutils.metrics.MetricsReader getCounterMetric
2021-07-21T07:26:44.081Z WARNING: streaming query appears to have been stuck for 56 min.
SEVERE: Failed to get metric fatal, from namespace Query7
2021-07-21T07:26:44.081Z no activity
2021-07-21T07:26:59.125Z RUNNING Query7
2021-07-21T07:26:59.739Z sample of 78.9 sec not long enough to calculate steady-state event
rate
Jul 21, 2021 7:26:59 AM org.apache.beam.sdk.testutils.metrics.MetricsReader getCounterMetric
SEVERE: Failed to get metric fatal, from namespace Query7
2021-07-21T07:26:59.817Z WARNING: streaming query appears to have been stuck for 56 min.
2021-07-21T07:26:59.817Z no activity
2021-07-21T07:27:14.861Z RUNNING Query7
2021-07-21T07:27:15.538Z sample of 78.9 sec not long enough to calculate steady-state event
rate
Jul 21, 2021 7:27:15 AM org.apache.beam.sdk.testutils.metrics.MetricsReader getCounterMetric
2021-07-21T07:27:15.604Z WARNING: streaming query appears to have been stuck for 57 min.
SEVERE: Failed to get metric fatal, from namespace Query7
2021-07-21T07:27:15.605Z no activity
2021-07-21T07:27:30.680Z RUNNING Query7
2021-07-21T07:27:31.392Z sample of 78.9 sec not long enough to calculate steady-state event
rate
Jul 21, 2021 7:27:31 AM org.apache.beam.sdk.testutils.metrics.MetricsReader getCounterMetric
2021-07-21T07:27:31.446Z WARNING: streaming query appears to have been stuck for 57 min.
SEVERE: Failed to get metric fatal, from namespace Query7
2021-07-21T07:27:31.446Z no activity
2021-07-21T07:27:46.476Z RUNNING Query7
2021-07-21T07:27:47.114Z sample of 78.9 sec not long enough to calculate steady-state event
rate
Jul 21, 2021 7:27:47 AM org.apache.beam.sdk.testutils.metrics.MetricsReader getCounterMetric
2021-07-21T07:27:47.170Z WARNING: streaming query appears to have been stuck for 57 min.
2021-07-21T07:27:47.171Z no activity
SEVERE: Failed to get metric fatal, from namespace Query7
2021-07-21T07:28:02.210Z RUNNING Query7
2021-07-21T07:28:02.912Z sample of 78.9 sec not long enough to calculate steady-state event
rate
Jul 21, 2021 7:28:03 AM org.apache.beam.sdk.testutils.metrics.MetricsReader getCounterMetric
SEVERE: Failed to get metric fatal, from namespace Query7
2021-07-21T07:28:03.025Z WARNING: streaming query appears to have been stuck for 57 min.
2021-07-21T07:28:03.025Z no activity
2021-07-21T07:28:18.073Z RUNNING Query7
2021-07-21T07:28:18.791Z sample of 78.9 sec not long enough to calculate steady-state event
rate
Jul 21, 2021 7:28:18 AM org.apache.beam.sdk.testutils.metrics.MetricsReader getCounterMetric
2021-07-21T07:28:18.882Z WARNING: streaming query appears to have been stuck for 58 min.
SEVERE: Failed to get metric fatal, from namespace Query7
2021-07-21T07:28:18.882Z no activity
2021-07-21T07:28:33.911Z RUNNING Query7
2021-07-21T07:28:34.575Z sample of 78.9 sec not long enough to calculate steady-state event
rate
Jul 21, 2021 7:28:34 AM org.apache.beam.sdk.testutils.metrics.MetricsReader getCounterMetric
SEVERE: Failed to get metric fatal, from namespace Query7
2021-07-21T07:28:34.632Z WARNING: streaming query appears to have been stuck for 58 min.
2021-07-21T07:28:34.632Z no activity
2021-07-21T07:28:49.671Z RUNNING Query7
2021-07-21T07:28:50.398Z sample of 78.9 sec not long enough to calculate steady-state event
rate
Jul 21, 2021 7:28:50 AM org.apache.beam.sdk.testutils.metrics.MetricsReader getCounterMetric
2021-07-21T07:28:50.455Z WARNING: streaming query appears to have been stuck for 58 min.
SEVERE: Failed to get metric fatal, from namespace Query7
2021-07-21T07:28:50.455Z no activity
2021-07-21T07:29:05.493Z RUNNING Query7
2021-07-21T07:29:06.195Z sample of 78.9 sec not long enough to calculate steady-state event
rate
Jul 21, 2021 7:29:06 AM org.apache.beam.sdk.testutils.metrics.MetricsReader getCounterMetric
2021-07-21T07:29:06.258Z WARNING: streaming query appears to have been stuck for 58 min.
2021-07-21T07:29:06.258Z no activity
SEVERE: Failed to get metric fatal, from namespace Query7
2021-07-21T07:29:21.294Z RUNNING Query7
2021-07-21T07:29:22.103Z sample of 78.9 sec not long enough to calculate steady-state event
rate
Jul 21, 2021 7:29:22 AM org.apache.beam.sdk.testutils.metrics.MetricsReader getCounterMetric
2021-07-21T07:29:22.163Z WARNING: streaming query appears to have been stuck for 59 min.
SEVERE: Failed to get metric fatal, from namespace Query7
2021-07-21T07:29:22.163Z no activity
2021-07-21T07:29:37.205Z RUNNING Query7
2021-07-21T07:29:37.866Z sample of 78.9 sec not long enough to calculate steady-state event
rate
Jul 21, 2021 7:29:37 AM org.apache.beam.sdk.testutils.metrics.MetricsReader getCounterMetric
SEVERE: Failed to get metric fatal, from namespace Query7
2021-07-21T07:29:37.919Z WARNING: streaming query appears to have been stuck for 59 min.
2021-07-21T07:29:37.919Z no activity
2021-07-21T07:29:52.950Z RUNNING Query7
2021-07-21T07:29:53.607Z sample of 78.9 sec not long enough to calculate steady-state event
rate
Jul 21, 2021 7:29:53 AM org.apache.beam.sdk.testutils.metrics.MetricsReader getCounterMetric
SEVERE: Failed to get metric fatal, from namespace Query7
2021-07-21T07:29:53.671Z WARNING: streaming query appears to have been stuck for 59 min.
2021-07-21T07:29:53.672Z no activity
2021-07-21T07:30:08.712Z RUNNING Query7
2021-07-21T07:30:09.318Z sample of 78.9 sec not long enough to calculate steady-state event
rate
Jul 21, 2021 7:30:09 AM org.apache.beam.sdk.testutils.metrics.MetricsReader getCounterMetric
SEVERE: Failed to get metric fatal, from namespace Query7
2021-07-21T07:30:09.389Z WARNING: streaming query appears to have been stuck for 59 min.
2021-07-21T07:30:09.389Z no activity
2021-07-21T07:30:24.441Z RUNNING Query7
2021-07-21T07:30:25.018Z sample of 78.9 sec not long enough to calculate steady-state event
rate
Jul 21, 2021 7:30:25 AM org.apache.beam.sdk.testutils.metrics.MetricsReader getCounterMetric
2021-07-21T07:30:25.088Z ERROR: streaming query appears to have been stuck for 60 minutes,
cancelling job.
SEVERE: Failed to get metric fatal, from namespace Query7
2021-07-21T07:30:25.143Z no activity
2021-07-21T07:30:40.180Z RUNNING Query7 (waiting for shutdown)
2021-07-21T07:30:40.847Z sample of 78.9 sec not long enough to calculate steady-state event
rate
2021-07-21T07:30:40.848Z no activity
2021-07-21T07:30:55.911Z RUNNING Query7 (waiting for shutdown)
2021-07-21T07:30:56.578Z sample of 78.9 sec not long enough to calculate steady-state event
rate
2021-07-21T07:30:56.578Z no activity
2021-07-21T07:31:11.618Z RUNNING Query7 (waiting for shutdown)
2021-07-21T07:31:12.302Z sample of 78.9 sec not long enough to calculate steady-state event
rate
2021-07-21T07:31:12.302Z no activity
2021-07-21T07:31:27.334Z RUNNING Query7 (waiting for shutdown)
2021-07-21T07:31:27.988Z sample of 78.9 sec not long enough to calculate steady-state event
rate
2021-07-21T07:31:27.988Z no activity
2021-07-21T07:31:43.016Z RUNNING Query7 (waiting for shutdown)
2021-07-21T07:31:43.787Z sample of 78.9 sec not long enough to calculate steady-state event
rate
2021-07-21T07:31:43.788Z no activity
2021-07-21T07:31:58.828Z RUNNING Query7 (waiting for shutdown)
2021-07-21T07:31:59.557Z sample of 78.9 sec not long enough to calculate steady-state event
rate
2021-07-21T07:31:59.557Z no activity
2021-07-21T07:32:14.606Z RUNNING Query7 (waiting for shutdown)
2021-07-21T07:32:15.217Z sample of 78.9 sec not long enough to calculate steady-state event
rate
2021-07-21T07:32:15.217Z no activity
2021-07-21T07:32:30.241Z RUNNING Query7 (waiting for shutdown)
2021-07-21T07:32:31.252Z sample of 78.9 sec not long enough to calculate steady-state event
rate
2021-07-21T07:32:31.252Z no activity
2021-07-21T07:32:46.290Z CANCELLED Query7 (waiting for shutdown)
2021-07-21T07:32:46.322Z sample of 78.9 sec not long enough to calculate steady-state event
rate

==========================================================================================
Run started 2021-07-21T06:20:10.443Z and ran for PT4355.879S

Default configuration:
{"debug":true,"query":null,"sourceType":"DIRECT","generateEventFilePathPrefix":null,"sinkType":"DEVNULL","exportSummaryToBigQuery":false,"pubSubMode":"COMBINED","pubsubMessageSerializationMethod":"CODER","sideInputType":"DIRECT","sideInputRowCount":500,"sideInputNumShards":3,"sideInputUrl":null,"sessionGap":600000,"numEvents":100000,"numEventGenerators":100,"rateShape":"SINE","firstEventRate":10000,"nextEventRate":10000,"rateUnit":"PER_SECOND","ratePeriodSec":600,"preloadSeconds":0,"streamTimeout":240,"isRateLimited":false,"useWallclockEventTime":false,"avgPersonByteSize":200,"avgAuctionByteSize":500,"avgBidByteSize":100,"hotAuctionRatio":2,"hotSellersRatio":4,"hotBiddersRatio":4,"windowSizeSec":10,"windowPeriodSec":5,"watermarkHoldbackSec":0,"numInFlightAuctions":100,"numActivePeople":1000,"coderStrategy":"HAND","cpuDelayMs":0,"diskBusyBytes":0,"auctionSkip":123,"fanout":5,"maxAuctionsWaitingTime":600,"occasionalDelaySec":3,"probDelayedEvent":0.1,"maxLogEvents":100000,"usePubsubPublishTime":false,"outOfOrderGroupSize":1,"numKeyBuckets":20000,"pardoCPUFactor":1.0}

Configurations:
  Conf  Description
  0000  query:PASSTHROUGH; numEvents:10000000
  0001  query:CURRENCY_CONVERSION; numEvents:10000000
  0002  query:SELECTION; numEvents:10000000
  0003  query:LOCAL_ITEM_SUGGESTION; numEvents:10000000
  0004  query:AVERAGE_PRICE_FOR_CATEGORY; numEvents:1000000
  0005  query:HOT_ITEMS; numEvents:10000000
  0006  query:AVERAGE_SELLING_PRICE_BY_SELLER; numEvents:1000000
  0007  query:HIGHEST_BID; numEvents:10000000
  0008  query:MONITOR_NEW_USERS; numEvents:10000000
  0009  query:WINNING_BIDS; numEvents:1000000
  0010  query:LOG_TO_SHARDED_FILES; numEvents:10000000
  0011  query:USER_SESSIONS; numEvents:10000000
  0012  query:PROCESSING_TIME_WINDOWS; numEvents:10000000
  0013  query:PORTABILITY_BATCH; numEvents:10000000
  0014  query:BOUNDED_SIDE_INPUT_JOIN; numEvents:10000000
  0015  query:SESSION_SIDE_INPUT_JOIN; numEvents:10000000

Performance:
  Conf  Runtime(sec)    (Baseline)  Events(/sec)    (Baseline)       Results    (Baseline)
  0000          35.5                    208858.3                     7409457             

  0001          27.0                    112266.0                     2793086             

  0002          28.7                    308351.1                       70966             

  0003          92.7                    107917.9                       59507             

  0004  *** not run ***
  0005         507.2                     19535.3                        4536             

  0006  *** not run ***
  0007         387.5                     25399.5                          97             

        *** Cancelling streaming job since it appeared stuck for 60 min. ***
  0008         134.5                     73722.3                       92011             

  0009  *** not run ***
  0010         130.9                     75294.5                         100             

  0011         590.6                     16933.1                     1839657             

  0012         129.4                     76626.2                      311693             

  0013  *** not run ***
  0014  *** not run ***
  0015  *** not run ***
==========================================================================================


==========================================================================================
Run started 2021-07-21T06:20:10.443Z and ran for PT4356.084S

Default configuration:
{"debug":true,"query":null,"sourceType":"DIRECT","generateEventFilePathPrefix":null,"sinkType":"DEVNULL","exportSummaryToBigQuery":false,"pubSubMode":"COMBINED","pubsubMessageSerializationMethod":"CODER","sideInputType":"DIRECT","sideInputRowCount":500,"sideInputNumShards":3,"sideInputUrl":null,"sessionGap":600000,"numEvents":100000,"numEventGenerators":100,"rateShape":"SINE","firstEventRate":10000,"nextEventRate":10000,"rateUnit":"PER_SECOND","ratePeriodSec":600,"preloadSeconds":0,"streamTimeout":240,"isRateLimited":false,"useWallclockEventTime":false,"avgPersonByteSize":200,"avgAuctionByteSize":500,"avgBidByteSize":100,"hotAuctionRatio":2,"hotSellersRatio":4,"hotBiddersRatio":4,"windowSizeSec":10,"windowPeriodSec":5,"watermarkHoldbackSec":0,"numInFlightAuctions":100,"numActivePeople":1000,"coderStrategy":"HAND","cpuDelayMs":0,"diskBusyBytes":0,"auctionSkip":123,"fanout":5,"maxAuctionsWaitingTime":600,"occasionalDelaySec":3,"probDelayedEvent":0.1,"maxLogEvents":100000,"usePubsubPublishTime":false,"outOfOrderGroupSize":1,"numKeyBuckets":20000,"pardoCPUFactor":1.0}

Configurations:
  Conf  Description
  0000  query:PASSTHROUGH; numEvents:10000000
  0001  query:CURRENCY_CONVERSION; numEvents:10000000
  0002  query:SELECTION; numEvents:10000000
  0003  query:LOCAL_ITEM_SUGGESTION; numEvents:10000000
  0004  query:AVERAGE_PRICE_FOR_CATEGORY; numEvents:1000000
  0005  query:HOT_ITEMS; numEvents:10000000
  0006  query:AVERAGE_SELLING_PRICE_BY_SELLER; numEvents:1000000
  0007  query:HIGHEST_BID; numEvents:10000000
  0008  query:MONITOR_NEW_USERS; numEvents:10000000
  0009  query:WINNING_BIDS; numEvents:1000000
  0010  query:LOG_TO_SHARDED_FILES; numEvents:10000000
  0011  query:USER_SESSIONS; numEvents:10000000
  0012  query:PROCESSING_TIME_WINDOWS; numEvents:10000000
  0013  query:PORTABILITY_BATCH; numEvents:10000000
  0014  query:BOUNDED_SIDE_INPUT_JOIN; numEvents:10000000
  0015  query:SESSION_SIDE_INPUT_JOIN; numEvents:10000000

Performance:
  Conf  Runtime(sec)    (Baseline)  Events(/sec)    (Baseline)       Results    (Baseline)
  0000          35.5                    208858.3                     7409457             

  0001          27.0                    112266.0                     2793086             

  0002          28.7                    308351.1                       70966             

  0003          92.7                    107917.9                       59507             

  0004  *** not run ***
  0005         507.2                     19535.3                        4536             

  0006  *** not run ***
  0007         387.5                     25399.5                          97             

        *** Cancelling streaming job since it appeared stuck for 60 min. ***
  0008         134.5                     73722.3                       92011             

  0009  *** not run ***
  0010         130.9                     75294.5                         100             

  0011         590.6                     16933.1                     1839657             

  0012         129.4                     76626.2                      311693             

  0013  *** not run ***
  0014  *** not run ***
  0015  *** not run ***
==========================================================================================

Exception in thread "main" java.lang.RuntimeException: Execution was not successful
	at org.apache.beam.sdk.nexmark.Main.runAll(Main.java:186)
	at org.apache.beam.sdk.nexmark.Main.main(Main.java:495)

> Task :sdks:java:testing:nexmark:run FAILED

> Task :runners:google-cloud-dataflow-java:cleanUpDockerImages
Untagged: us.gcr.io/apache-beam-testing/java-postcommit-it/java:20210721061921
Untagged: us.gcr.io/apache-beam-testing/java-postcommit-it/java@sha256:9b24804183b0cebcd429debdef2753f52b40e4d0d9ebfc405c5eb52d390b6b9d
Digests:
- us.gcr.io/apache-beam-testing/java-postcommit-it/java@sha256:9b24804183b0cebcd429debdef2753f52b40e4d0d9ebfc405c5eb52d390b6b9d
  Associated tags:
 - 20210721061921
Tags:
- us.gcr.io/apache-beam-testing/java-postcommit-it/java:20210721061921
Deleted [us.gcr.io/apache-beam-testing/java-postcommit-it/java:20210721061921].
Deleted [us.gcr.io/apache-beam-testing/java-postcommit-it/java@sha256:9b24804183b0cebcd429debdef2753f52b40e4d0d9ebfc405c5eb52d390b6b9d].

FAILURE: Build failed with an exception.

* What went wrong:
Execution failed for task ':sdks:java:testing:nexmark:run'.
> Process 'command '/usr/lib/jvm/java-8-openjdk-amd64/bin/java'' finished with non-zero
exit value 1

* Try:
Run with --stacktrace option to get the stack trace. Run with --info or --debug option to
get more log output. Run with --scan to get full insights.

* Get more help at https://help.gradle.org

Deprecated Gradle features were used in this build, making it incompatible with Gradle 7.0.
Use '--warning-mode all' to show the individual deprecation warnings.
See https://docs.gradle.org/6.8.3/userguide/command_line_interface.html#sec:command_line_warnings

BUILD FAILED in 1h 13m 31s
129 actionable tasks: 15 executed, 114 up-to-date

Publishing build scan...
https://gradle.com/s/ynas7oy46zqbq

Build step 'Invoke Gradle script' changed build result to FAILURE
Build step 'Invoke Gradle script' marked build as failure

---------------------------------------------------------------------
To unsubscribe, e-mail: builds-unsubscribe@beam.apache.org
For additional commands, e-mail: builds-help@beam.apache.org


Mime
View raw message