beam-builds mailing list archives

Site index · List index
Message view « Date » · « Thread »
Top « Date » · « Thread »
From Apache Jenkins Server <jenk...@builds.apache.org>
Subject Build failed in Jenkins: beam_PerformanceTests_AvroIOIT_HDFS #4694
Date Thu, 01 Jul 2021 06:08:04 GMT
See <https://ci-beam.apache.org/job/beam_PerformanceTests_AvroIOIT_HDFS/4694/display/redirect>

Changes:


------------------------------------------
[...truncated 260.37 KB...]
Full recompilation is required because no incremental change information is available. This
is usually caused by clean builds or changing compiler arguments.
Starting process 'Gradle Worker Daemon 4'. Working directory: /home/jenkins/.gradle/****s
Command: /usr/lib/jvm/java-8-openjdk-amd64/bin/java -Djava.security.manager=****.org.gradle.process.internal.****.child.BootstrapSecurityManager
-Xbootclasspath/p:/home/jenkins/.gradle/caches/modules-2/files-2.1/com.google.errorprone/javac/9+181-r4173-1/bdf4c0aa7d540ee1f7bf14d47447aea4bbf450c5/javac-9+181-r4173-1.jar
-Xmx512m -Dfile.encoding=UTF-8 -Duser.country=US -Duser.language=en -Duser.variant -cp /home/jenkins/.gradle/caches/6.8.3/****Main/gradle-****.jar
****.org.gradle.process.internal.****.GradleWorkerMain 'Gradle Worker Daemon 4'
Successfully started process 'Gradle Worker Daemon 4'
Started Gradle **** daemon (0.96 secs) with fork options DaemonForkOptions{executable=/usr/lib/jvm/java-8-openjdk-amd64/bin/java,
minHeapSize=null, maxHeapSize=null, jvmArgs=[-Xbootclasspath/p:/home/jenkins/.gradle/caches/modules-2/files-2.1/com.google.errorprone/javac/9+181-r4173-1/bdf4c0aa7d540ee1f7bf14d47447aea4bbf450c5/javac-9+181-r4173-1.jar],
keepAliveMode=SESSION}.
Compiling with JDK Java compiler API.

> Task :sdks:java:io:parquet:compileTestJava
Created classpath snapshot for incremental compilation in 5.295 secs. 1735 duplicate classes
found in classpath (see all with --debug).
Invalidating in-memory cache of /home/jenkins/.gradle/caches/journal-1/file-access.bin
Stored cache entry for task ':sdks:java:io:parquet:compileTestJava' with cache key 03eb2f3a2e0a98b51111705ace8865f2
:sdks:java:io:parquet:compileTestJava (Thread[Execution **** for ':' Thread 9,5,main]) completed.
Took 14.447 secs.
:sdks:java:io:parquet:testClasses (Thread[Execution **** for ':' Thread 9,5,main]) started.

> Task :sdks:java:io:parquet:testClasses
Skipping task ':sdks:java:io:parquet:testClasses' as it has no actions.
:sdks:java:io:parquet:testClasses (Thread[Execution **** for ':' Thread 9,5,main]) completed.
Took 0.0 secs.
:sdks:java:io:parquet:testJar (Thread[Execution **** for ':' Thread 9,5,main]) started.

> Task :sdks:java:io:parquet:testJar
Caching disabled for task ':sdks:java:io:parquet:testJar' because:
  Caching has not been enabled for the task
Task ':sdks:java:io:parquet:testJar' is not up-to-date because:
  No history is available.
:sdks:java:io:parquet:testJar (Thread[Execution **** for ':' Thread 9,5,main]) completed.
Took 0.037 secs.

> Task :sdks:java:extensions:google-cloud-platform-core:compileTestJava
Custom actions are attached to task ':sdks:java:extensions:google-cloud-platform-core:compileTestJava'.
Build cache key for task ':sdks:java:extensions:google-cloud-platform-core:compileTestJava'
is a444ccc9bb2f659260749e6d6f4c9e4e
Task ':sdks:java:extensions:google-cloud-platform-core:compileTestJava' is not up-to-date
because:
  No history is available.
The input changes require a full rebuild for incremental task ':sdks:java:extensions:google-cloud-platform-core:compileTestJava'.
Full recompilation is required because no incremental change information is available. This
is usually caused by clean builds or changing compiler arguments.
Starting process 'Gradle Worker Daemon 5'. Working directory: /home/jenkins/.gradle/****s
Command: /usr/lib/jvm/java-8-openjdk-amd64/bin/java -Djava.security.manager=****.org.gradle.process.internal.****.child.BootstrapSecurityManager
-Xbootclasspath/p:/home/jenkins/.gradle/caches/modules-2/files-2.1/com.google.errorprone/javac/9+181-r4173-1/bdf4c0aa7d540ee1f7bf14d47447aea4bbf450c5/javac-9+181-r4173-1.jar
-Xmx512m -Dfile.encoding=UTF-8 -Duser.country=US -Duser.language=en -Duser.variant -cp /home/jenkins/.gradle/caches/6.8.3/****Main/gradle-****.jar
****.org.gradle.process.internal.****.GradleWorkerMain 'Gradle Worker Daemon 5'
Successfully started process 'Gradle Worker Daemon 5'
Started Gradle **** daemon (0.826 secs) with fork options DaemonForkOptions{executable=/usr/lib/jvm/java-8-openjdk-amd64/bin/java,
minHeapSize=null, maxHeapSize=null, jvmArgs=[-Xbootclasspath/p:/home/jenkins/.gradle/caches/modules-2/files-2.1/com.google.errorprone/javac/9+181-r4173-1/bdf4c0aa7d540ee1f7bf14d47447aea4bbf450c5/javac-9+181-r4173-1.jar],
keepAliveMode=SESSION}.
Compiling with JDK Java compiler API.
Note: Some input files use or override a deprecated API.
Note: Recompile with -Xlint:deprecation for details.
Created classpath snapshot for incremental compilation in 0.63 secs. 910 duplicate classes
found in classpath (see all with --debug).
Invalidating in-memory cache of /home/jenkins/.gradle/caches/journal-1/file-access.bin
Stored cache entry for task ':sdks:java:extensions:google-cloud-platform-core:compileTestJava'
with cache key a444ccc9bb2f659260749e6d6f4c9e4e
:sdks:java:extensions:google-cloud-platform-core:compileTestJava (Thread[Execution **** for
':' Thread 4,5,main]) completed. Took 15.661 secs.
:sdks:java:extensions:google-cloud-platform-core:testClasses (Thread[Execution **** for ':'
Thread 4,5,main]) started.

> Task :sdks:java:extensions:google-cloud-platform-core:testClasses
Skipping task ':sdks:java:extensions:google-cloud-platform-core:testClasses' as it has no
actions.
:sdks:java:extensions:google-cloud-platform-core:testClasses (Thread[Execution **** for ':'
Thread 4,5,main]) completed. Took 0.0 secs.
:sdks:java:extensions:google-cloud-platform-core:testJar (Thread[Execution **** for ':' Thread
4,5,main]) started.

> Task :sdks:java:io:hadoop-file-system:compileJava
Created classpath snapshot for incremental compilation in 0.023 secs. 443 duplicate classes
found in classpath (see all with --debug).
Stored cache entry for task ':sdks:java:io:hadoop-file-system:compileJava' with cache key
5d52dc8dac408d2019750dacfee4ff15
:sdks:java:io:hadoop-file-system:compileJava (Thread[Execution **** for ':' Thread 11,5,main])
completed. Took 21.275 secs.
:sdks:java:io:hadoop-file-system:classes (Thread[Execution **** for ':' Thread 11,5,main])
started.

> Task :sdks:java:io:hadoop-file-system:classes
Skipping task ':sdks:java:io:hadoop-file-system:classes' as it has no actions.
:sdks:java:io:hadoop-file-system:classes (Thread[Execution **** for ':' Thread 11,5,main])
completed. Took 0.0 secs.
:sdks:java:io:hadoop-file-system:jar (Thread[Execution **** for ':' Thread 11,5,main]) started.

> Task :sdks:java:extensions:google-cloud-platform-core:testJar
Caching disabled for task ':sdks:java:extensions:google-cloud-platform-core:testJar' because:
  Caching has not been enabled for the task
Task ':sdks:java:extensions:google-cloud-platform-core:testJar' is not up-to-date because:
  No history is available.
file or directory '<https://ci-beam.apache.org/job/beam_PerformanceTests_AvroIOIT_HDFS/ws/src/sdks/java/extensions/google-cloud-platform-core/build/resources/test',>
not found
:sdks:java:extensions:google-cloud-platform-core:testJar (Thread[Execution **** for ':' Thread
4,5,main]) completed. Took 0.03 secs.

> Task :sdks:java:io:hadoop-file-system:jar
Caching disabled for task ':sdks:java:io:hadoop-file-system:jar' because:
  Caching has not been enabled for the task
Task ':sdks:java:io:hadoop-file-system:jar' is not up-to-date because:
  No history is available.
file or directory '<https://ci-beam.apache.org/job/beam_PerformanceTests_AvroIOIT_HDFS/ws/src/sdks/java/io/hadoop-file-system/build/resources/main',>
not found
:sdks:java:io:hadoop-file-system:jar (Thread[Execution **** for ':' Thread 11,5,main]) completed.
Took 0.054 secs.
:sdks:java:io:hadoop-file-system:compileTestJava (Thread[Execution **** for ':' Thread 6,5,main])
started.

> Task :sdks:java:harness:shadowJar
Custom actions are attached to task ':sdks:java:harness:shadowJar'.
Build cache key for task ':sdks:java:harness:shadowJar' is d483a320fb461f0e246f24604e66017d
Task ':sdks:java:harness:shadowJar' is not up-to-date because:
  No history is available.
file or directory '<https://ci-beam.apache.org/job/beam_PerformanceTests_AvroIOIT_HDFS/ws/src/sdks/java/harness/build/resources/main',>
not found

> Task :sdks:java:io:xml:compileJava
Note: Some input files use or override a deprecated API.
Note: Recompile with -Xlint:deprecation for details.
Created classpath snapshot for incremental compilation in 0.02 secs. 1 duplicate classes found
in classpath (see all with --debug).
Stored cache entry for task ':sdks:java:io:xml:compileJava' with cache key c406df143a58637d9f05154390d7be96
:sdks:java:io:xml:compileJava (Thread[Execution **** for ':' Thread 8,5,main]) completed.
Took 21.678 secs.
:sdks:java:io:xml:classes (Thread[Execution **** for ':' Thread 9,5,main]) started.

> Task :sdks:java:io:xml:classes
Skipping task ':sdks:java:io:xml:classes' as it has no actions.
:sdks:java:io:xml:classes (Thread[Execution **** for ':' Thread 9,5,main]) completed. Took
0.0 secs.
:sdks:java:io:xml:jar (Thread[Execution **** for ':' Thread 9,5,main]) started.

> Task :sdks:java:io:xml:jar
Caching disabled for task ':sdks:java:io:xml:jar' because:
  Caching has not been enabled for the task
Task ':sdks:java:io:xml:jar' is not up-to-date because:
  No history is available.
file or directory '<https://ci-beam.apache.org/job/beam_PerformanceTests_AvroIOIT_HDFS/ws/src/sdks/java/io/xml/build/resources/main',>
not found
:sdks:java:io:xml:jar (Thread[Execution **** for ':' Thread 9,5,main]) completed. Took 0.038
secs.
:sdks:java:io:xml:compileTestJava (Thread[Execution **** for ':' Thread 8,5,main]) started.

> Task :sdks:java:extensions:protobuf:compileTestJava
Note: Some input files use or override a deprecated API.
Note: Recompile with -Xlint:deprecation for details.
Note: Some input files use unchecked or unsafe operations.
Note: Recompile with -Xlint:unchecked for details.
Created classpath snapshot for incremental compilation in 0.044 secs. 910 duplicate classes
found in classpath (see all with --debug).
Invalidating in-memory cache of /home/jenkins/.gradle/caches/journal-1/file-access.bin
Stored cache entry for task ':sdks:java:extensions:protobuf:compileTestJava' with cache key
e8f4a576e00b2bfeef5817f387b7b4fa
:sdks:java:extensions:protobuf:compileTestJava (Thread[Execution **** for ':' Thread 7,5,main])
completed. Took 16.964 secs.
:sdks:java:extensions:protobuf:testClasses (Thread[Execution **** for ':' Thread 7,5,main])
started.

> Task :sdks:java:extensions:protobuf:testClasses
Skipping task ':sdks:java:extensions:protobuf:testClasses' as it has no actions.
:sdks:java:extensions:protobuf:testClasses (Thread[Execution **** for ':' Thread 7,5,main])
completed. Took 0.0 secs.
:sdks:java:extensions:protobuf:testJar (Thread[Execution **** for ':' Thread 7,5,main]) started.

> Task :sdks:java:extensions:protobuf:testJar
Caching disabled for task ':sdks:java:extensions:protobuf:testJar' because:
  Caching has not been enabled for the task
Task ':sdks:java:extensions:protobuf:testJar' is not up-to-date because:
  No history is available.
:sdks:java:extensions:protobuf:testJar (Thread[Execution **** for ':' Thread 7,5,main]) completed.
Took 0.08 secs.

> Task :sdks:java:io:hadoop-file-system:compileTestJava
Invalidating in-memory cache of /home/jenkins/.gradle/caches/6.8.3/fileHashes/fileHashes.bin
Invalidating in-memory cache of /home/jenkins/.gradle/caches/6.8.3/fileHashes/resourceHashesCache.bin
Custom actions are attached to task ':sdks:java:io:hadoop-file-system:compileTestJava'.
Build cache key for task ':sdks:java:io:hadoop-file-system:compileTestJava' is 66a4cc2090af6ff18ea7f777df20f34d
Task ':sdks:java:io:hadoop-file-system:compileTestJava' is not up-to-date because:
  No history is available.
The input changes require a full rebuild for incremental task ':sdks:java:io:hadoop-file-system:compileTestJava'.
Full recompilation is required because no incremental change information is available. This
is usually caused by clean builds or changing compiler arguments.
Compiling with JDK Java compiler API.

> Task :sdks:java:io:xml:compileTestJava
Custom actions are attached to task ':sdks:java:io:xml:compileTestJava'.
Build cache key for task ':sdks:java:io:xml:compileTestJava' is 3c73cb3f230b7ec35b4e0c170091119c
Task ':sdks:java:io:xml:compileTestJava' is not up-to-date because:
  No history is available.
The input changes require a full rebuild for incremental task ':sdks:java:io:xml:compileTestJava'.
Full recompilation is required because no incremental change information is available. This
is usually caused by clean builds or changing compiler arguments.
Compiling with JDK Java compiler API.
Note: Some input files use or override a deprecated API.
Note: Recompile with -Xlint:deprecation for details.
Created classpath snapshot for incremental compilation in 0.022 secs. 910 duplicate classes
found in classpath (see all with --debug).
Invalidating in-memory cache of /home/jenkins/.gradle/caches/journal-1/file-access.bin
Stored cache entry for task ':sdks:java:io:xml:compileTestJava' with cache key 3c73cb3f230b7ec35b4e0c170091119c
:sdks:java:io:xml:compileTestJava (Thread[Execution **** for ':' Thread 8,5,main]) completed.
Took 3.043 secs.
:sdks:java:io:xml:testClasses (Thread[Execution **** for ':' Thread 8,5,main]) started.

> Task :sdks:java:io:xml:testClasses
Skipping task ':sdks:java:io:xml:testClasses' as it has no actions.
:sdks:java:io:xml:testClasses (Thread[Execution **** for ':' Thread 8,5,main]) completed.
Took 0.0 secs.
:sdks:java:io:xml:testJar (Thread[Execution **** for ':' Thread 7,5,main]) started.

> Task :sdks:java:io:xml:testJar
Caching disabled for task ':sdks:java:io:xml:testJar' because:
  Caching has not been enabled for the task
Task ':sdks:java:io:xml:testJar' is not up-to-date because:
  No history is available.
file or directory '<https://ci-beam.apache.org/job/beam_PerformanceTests_AvroIOIT_HDFS/ws/src/sdks/java/io/xml/build/resources/test',>
not found
:sdks:java:io:xml:testJar (Thread[Execution **** for ':' Thread 7,5,main]) completed. Took
0.01 secs.
:sdks:java:io:file-based-io-tests:compileTestJava (Thread[Execution **** for ':' Thread 7,5,main])
started.

> Task :sdks:java:io:hadoop-file-system:compileTestJava
Note: Some input files use or override a deprecated API.
Note: Recompile with -Xlint:deprecation for details.
Created classpath snapshot for incremental compilation in 0.07 secs. 1441 duplicate classes
found in classpath (see all with --debug).
Stored cache entry for task ':sdks:java:io:hadoop-file-system:compileTestJava' with cache
key 66a4cc2090af6ff18ea7f777df20f34d
:sdks:java:io:hadoop-file-system:compileTestJava (Thread[Execution **** for ':' Thread 6,5,main])
completed. Took 4.425 secs.
:sdks:java:io:hadoop-file-system:testClasses (Thread[Execution **** for ':' Thread 8,5,main])
started.

> Task :sdks:java:io:hadoop-file-system:testClasses
Skipping task ':sdks:java:io:hadoop-file-system:testClasses' as it has no actions.
:sdks:java:io:hadoop-file-system:testClasses (Thread[Execution **** for ':' Thread 8,5,main])
completed. Took 0.0 secs.
:sdks:java:io:hadoop-file-system:testJar (Thread[Execution **** for ':' Thread 8,5,main])
started.

> Task :sdks:java:io:hadoop-file-system:testJar
Caching disabled for task ':sdks:java:io:hadoop-file-system:testJar' because:
  Caching has not been enabled for the task
Task ':sdks:java:io:hadoop-file-system:testJar' is not up-to-date because:
  No history is available.
file or directory '<https://ci-beam.apache.org/job/beam_PerformanceTests_AvroIOIT_HDFS/ws/src/sdks/java/io/hadoop-file-system/build/resources/test',>
not found
:sdks:java:io:hadoop-file-system:testJar (Thread[Execution **** for ':' Thread 8,5,main])
completed. Took 0.013 secs.

> Task :sdks:java:io:file-based-io-tests:compileTestJava
Invalidating in-memory cache of /home/jenkins/.gradle/caches/6.8.3/fileHashes/fileHashes.bin
Invalidating in-memory cache of /home/jenkins/.gradle/caches/6.8.3/fileHashes/resourceHashesCache.bin
Custom actions are attached to task ':sdks:java:io:file-based-io-tests:compileTestJava'.
Build cache key for task ':sdks:java:io:file-based-io-tests:compileTestJava' is fe8a072a305f6985a8986c898b6aa381
Task ':sdks:java:io:file-based-io-tests:compileTestJava' is not up-to-date because:
  No history is available.
The input changes require a full rebuild for incremental task ':sdks:java:io:file-based-io-tests:compileTestJava'.
Full recompilation is required because no incremental change information is available. This
is usually caused by clean builds or changing compiler arguments.
Compiling with JDK Java compiler API.
Note: <https://ci-beam.apache.org/job/beam_PerformanceTests_AvroIOIT_HDFS/ws/src/sdks/java/io/file-based-io-tests/src/test/java/org/apache/beam/sdk/io/tfrecord/TFRecordIOIT.java>
uses or overrides a deprecated API.
Note: Recompile with -Xlint:deprecation for details.
Created classpath snapshot for incremental compilation in 0.033 secs. 1583 duplicate classes
found in classpath (see all with --debug).
Invalidating in-memory cache of /home/jenkins/.gradle/caches/journal-1/file-access.bin
Stored cache entry for task ':sdks:java:io:file-based-io-tests:compileTestJava' with cache
key fe8a072a305f6985a8986c898b6aa381
:sdks:java:io:file-based-io-tests:compileTestJava (Thread[Execution **** for ':' Thread 7,5,main])
completed. Took 2.802 secs.
:sdks:java:io:file-based-io-tests:testClasses (Thread[Execution **** for ':' Thread 7,5,main])
started.

> Task :sdks:java:io:file-based-io-tests:testClasses
Skipping task ':sdks:java:io:file-based-io-tests:testClasses' as it has no actions.
:sdks:java:io:file-based-io-tests:testClasses (Thread[Execution **** for ':' Thread 7,5,main])
completed. Took 0.0 secs.

> Task :sdks:java:harness:shadowJar
*******************
GRADLE SHADOW STATS

Total Jars: 80 (includes project)
Total Time: 20.771s [20771ms]
Average Time/Jar: 0.25963749999999997s [259.6375ms]
*******************

> Task :sdks:java:harness:shadowJar FAILED
:sdks:java:harness:shadowJar (Thread[Daemon ****,5,main]) completed. Took 24.279 secs.

FAILURE: Build failed with an exception.

* What went wrong:
Execution failed for task ':sdks:java:harness:shadowJar'.
> Failed to store cache entry for task ':sdks:java:harness:shadowJar'

* Try:
Run with --stacktrace option to get the stack trace. Run with --debug option to get more log
output. Run with --scan to get full insights.

* Get more help at https://help.gradle.org

Deprecated Gradle features were used in this build, making it incompatible with Gradle 7.0.
Use '--warning-mode all' to show the individual deprecation warnings.
See https://docs.gradle.org/6.8.3/userguide/command_line_interface.html#sec:command_line_warnings

BUILD FAILED in 55s
112 actionable tasks: 83 executed, 29 from cache

Publishing build scan...
https://gradle.com/s/vy5czycd3xyui

Stopped 5 **** daemon(s).
Build step 'Invoke Gradle script' changed build result to FAILURE
Build step 'Invoke Gradle script' marked build as failure

---------------------------------------------------------------------
To unsubscribe, e-mail: builds-unsubscribe@beam.apache.org
For additional commands, e-mail: builds-help@beam.apache.org


Mime
View raw message