beam-builds mailing list archives

Site index · List index
Message view « Date » · « Thread »
Top « Date » · « Thread »
From Apache Jenkins Server <jenk...@builds.apache.org>
Subject Build failed in Jenkins: beam_PerformanceTests_InfluxDbIO_IT #657
Date Wed, 21 Jul 2021 06:17:43 GMT
See <https://ci-beam.apache.org/job/beam_PerformanceTests_InfluxDbIO_IT/657/display/redirect>

Changes:


------------------------------------------
[...truncated 153.42 KB...]
> Task :sdks:java:core:compileTestJava FROM-CACHE
Custom actions are attached to task ':sdks:java:core:compileTestJava'.
Build cache key for task ':sdks:java:core:compileTestJava' is a32a2d6602295fec5aa7a5c54f422be9
Task ':sdks:java:core:compileTestJava' is not up-to-date because:
  No history is available.
Loaded cache entry for task ':sdks:java:core:compileTestJava' with cache key a32a2d6602295fec5aa7a5c54f422be9
:sdks:java:core:compileTestJava (Thread[Execution worker for ':' Thread 3,5,main]) completed.
Took 1.2 secs.
:sdks:java:core:testClasses (Thread[Execution worker for ':' Thread 3,5,main]) started.

> Task :sdks:java:core:testClasses
Skipping task ':sdks:java:core:testClasses' as it has no actions.
:sdks:java:core:testClasses (Thread[Execution worker for ':' Thread 3,5,main]) completed.
Took 0.0 secs.
:sdks:java:core:shadowTestJar (Thread[Execution worker for ':' Thread 3,5,main]) started.

> Task :sdks:java:extensions:google-cloud-platform-core:compileJava FROM-CACHE
Custom actions are attached to task ':sdks:java:extensions:google-cloud-platform-core:compileJava'.
Build cache key for task ':sdks:java:extensions:google-cloud-platform-core:compileJava' is
61994e59f4f90d82722affd40de24aa1
Task ':sdks:java:extensions:google-cloud-platform-core:compileJava' is not up-to-date because:
  No history is available.
Loaded cache entry for task ':sdks:java:extensions:google-cloud-platform-core:compileJava'
with cache key 61994e59f4f90d82722affd40de24aa1
:sdks:java:extensions:google-cloud-platform-core:compileJava (Thread[Execution worker for
':' Thread 9,5,main]) completed. Took 0.101 secs.
:sdks:java:extensions:google-cloud-platform-core:classes (Thread[Execution worker for ':'
Thread 9,5,main]) started.

> Task :sdks:java:extensions:google-cloud-platform-core:classes UP-TO-DATE
Skipping task ':sdks:java:extensions:google-cloud-platform-core:classes' as it has no actions.
:sdks:java:extensions:google-cloud-platform-core:classes (Thread[Execution worker for ':'
Thread 9,5,main]) completed. Took 0.0 secs.
:sdks:java:extensions:google-cloud-platform-core:jar (Thread[Execution worker for ':' Thread
9,5,main]) started.

> Task :sdks:java:core:shadowTestJar FROM-CACHE
Build cache key for task ':sdks:java:core:shadowTestJar' is 0796ab769a6695dd7de770595d7dd47d
Task ':sdks:java:core:shadowTestJar' is not up-to-date because:
  No history is available.
Loaded cache entry for task ':sdks:java:core:shadowTestJar' with cache key 0796ab769a6695dd7de770595d7dd47d
:sdks:java:core:shadowTestJar (Thread[Execution worker for ':' Thread 3,5,main]) completed.
Took 0.106 secs.
:runners:core-java:compileTestJava (Thread[Execution worker for ':' Thread 3,5,main]) started.

> Task :sdks:java:extensions:google-cloud-platform-core:jar
Caching disabled for task ':sdks:java:extensions:google-cloud-platform-core:jar' because:
  Caching has not been enabled for the task
Task ':sdks:java:extensions:google-cloud-platform-core:jar' is not up-to-date because:
  No history is available.
file or directory '<https://ci-beam.apache.org/job/beam_PerformanceTests_InfluxDbIO_IT/ws/src/sdks/java/extensions/google-cloud-platform-core/build/resources/main',>
not found
:sdks:java:extensions:google-cloud-platform-core:jar (Thread[Execution worker for ':' Thread
9,5,main]) completed. Took 0.034 secs.
:sdks:java:harness:compileJava (Thread[Execution worker for ':' Thread 9,5,main]) started.

> Task :sdks:java:harness:compileJava FROM-CACHE
Custom actions are attached to task ':sdks:java:harness:compileJava'.
Build cache key for task ':sdks:java:harness:compileJava' is 6d67bcd27dd91243fed2abb8590d3176
Task ':sdks:java:harness:compileJava' is not up-to-date because:
  No history is available.
Loaded cache entry for task ':sdks:java:harness:compileJava' with cache key 6d67bcd27dd91243fed2abb8590d3176
:sdks:java:harness:compileJava (Thread[Execution worker for ':' Thread 9,5,main]) completed.
Took 0.076 secs.
:sdks:java:harness:classes (Thread[Execution worker for ':' Thread 9,5,main]) started.

> Task :sdks:java:harness:classes UP-TO-DATE
Skipping task ':sdks:java:harness:classes' as it has no actions.
:sdks:java:harness:classes (Thread[Execution worker for ':' Thread 9,5,main]) completed. Took
0.0 secs.
:sdks:java:harness:jar (Thread[Execution worker for ':' Thread 9,5,main]) started.

> Task :sdks:java:harness:jar
Caching disabled for task ':sdks:java:harness:jar' because:
  Caching has not been enabled for the task
Task ':sdks:java:harness:jar' is not up-to-date because:
  No history is available.
file or directory '<https://ci-beam.apache.org/job/beam_PerformanceTests_InfluxDbIO_IT/ws/src/sdks/java/harness/build/resources/main',>
not found
:sdks:java:harness:jar (Thread[Execution worker for ':' Thread 9,5,main]) completed. Took
0.059 secs.
:sdks:java:harness:shadowJar (Thread[Execution worker for ':' Thread 9,5,main]) started.

> Task :runners:core-java:compileTestJava FROM-CACHE
Custom actions are attached to task ':runners:core-java:compileTestJava'.
Build cache key for task ':runners:core-java:compileTestJava' is cf34a85465130170b9cd763cc15c6482
Task ':runners:core-java:compileTestJava' is not up-to-date because:
  No history is available.
Loaded cache entry for task ':runners:core-java:compileTestJava' with cache key cf34a85465130170b9cd763cc15c6482
:runners:core-java:compileTestJava (Thread[Execution worker for ':' Thread 3,5,main]) completed.
Took 0.329 secs.
:runners:core-java:testClasses (Thread[Execution worker for ':' Thread 3,5,main]) started.

> Task :runners:core-java:testClasses UP-TO-DATE
Skipping task ':runners:core-java:testClasses' as it has no actions.
:runners:core-java:testClasses (Thread[Execution worker for ':' Thread 3,5,main]) completed.
Took 0.0 secs.
:runners:core-java:testJar (Thread[Execution worker for ':' Thread 3,5,main]) started.

> Task :runners:core-java:testJar
Caching disabled for task ':runners:core-java:testJar' because:
  Caching has not been enabled for the task
Task ':runners:core-java:testJar' is not up-to-date because:
  No history is available.
file or directory '<https://ci-beam.apache.org/job/beam_PerformanceTests_InfluxDbIO_IT/ws/src/runners/core-java/build/resources/test',>
not found
:runners:core-java:testJar (Thread[Execution worker for ':' Thread 3,5,main]) completed. Took
0.046 secs.

> Task :sdks:java:harness:shadowJar FROM-CACHE
Custom actions are attached to task ':sdks:java:harness:shadowJar'.
Build cache key for task ':sdks:java:harness:shadowJar' is f69b4761016a1257e5d6fff575c3e0fd
Task ':sdks:java:harness:shadowJar' is not up-to-date because:
  No history is available.
Loaded cache entry for task ':sdks:java:harness:shadowJar' with cache key f69b4761016a1257e5d6fff575c3e0fd
:sdks:java:harness:shadowJar (Thread[Execution worker for ':' Thread 9,5,main]) completed.
Took 1.326 secs.
:runners:java-fn-execution:compileJava (Thread[Execution worker for ':' Thread 9,5,main])
started.

> Task :runners:java-fn-execution:compileJava FROM-CACHE
Custom actions are attached to task ':runners:java-fn-execution:compileJava'.
Build cache key for task ':runners:java-fn-execution:compileJava' is a63905ca71e64da81af8824598657cb6
Task ':runners:java-fn-execution:compileJava' is not up-to-date because:
  No history is available.
Loaded cache entry for task ':runners:java-fn-execution:compileJava' with cache key a63905ca71e64da81af8824598657cb6
:runners:java-fn-execution:compileJava (Thread[Execution worker for ':' Thread 9,5,main])
completed. Took 3.262 secs.
:runners:java-fn-execution:classes (Thread[Execution worker for ':' Thread 9,5,main]) started.

> Task :runners:java-fn-execution:classes UP-TO-DATE
Skipping task ':runners:java-fn-execution:classes' as it has no actions.
:runners:java-fn-execution:classes (Thread[Execution worker for ':' Thread 9,5,main]) completed.
Took 0.0 secs.
:runners:java-fn-execution:jar (Thread[Execution worker for ':' Thread 9,5,main]) started.

> Task :runners:java-fn-execution:jar
Caching disabled for task ':runners:java-fn-execution:jar' because:
  Caching has not been enabled for the task
Task ':runners:java-fn-execution:jar' is not up-to-date because:
  No history is available.
file or directory '<https://ci-beam.apache.org/job/beam_PerformanceTests_InfluxDbIO_IT/ws/src/runners/java-fn-execution/build/resources/main',>
not found
:runners:java-fn-execution:jar (Thread[Execution worker for ':' Thread 9,5,main]) completed.
Took 0.048 secs.
:runners:direct-java:compileJava (Thread[Execution worker for ':' Thread 9,5,main]) started.

> Task :runners:direct-java:compileJava FROM-CACHE
Custom actions are attached to task ':runners:direct-java:compileJava'.
Build cache key for task ':runners:direct-java:compileJava' is fd6c961db30298bd5db6725d824c553c
Task ':runners:direct-java:compileJava' is not up-to-date because:
  No history is available.
Loaded cache entry for task ':runners:direct-java:compileJava' with cache key fd6c961db30298bd5db6725d824c553c
:runners:direct-java:compileJava (Thread[Execution worker for ':' Thread 9,5,main]) completed.
Took 0.095 secs.
:runners:direct-java:classes (Thread[Execution worker for ':' Thread 9,5,main]) started.

> Task :runners:direct-java:classes UP-TO-DATE
Skipping task ':runners:direct-java:classes' as it has no actions.
:runners:direct-java:classes (Thread[Execution worker for ':' Thread 9,5,main]) completed.
Took 0.0 secs.
:runners:direct-java:shadowJar (Thread[Execution worker for ':' Thread 9,5,main]) started.

> Task :runners:direct-java:shadowJar FROM-CACHE
Custom actions are attached to task ':runners:direct-java:shadowJar'.
Build cache key for task ':runners:direct-java:shadowJar' is 20931dde5845c98ad296d98afaccdfd1
Task ':runners:direct-java:shadowJar' is not up-to-date because:
  No history is available.
Loaded cache entry for task ':runners:direct-java:shadowJar' with cache key 20931dde5845c98ad296d98afaccdfd1
:runners:direct-java:shadowJar (Thread[Execution worker for ':' Thread 9,5,main]) completed.
Took 0.058 secs.
:runners:direct-java:compileTestJava (Thread[Execution worker for ':' Thread 9,5,main]) started.

> Task :runners:direct-java:compileTestJava FROM-CACHE
Custom actions are attached to task ':runners:direct-java:compileTestJava'.
Build cache key for task ':runners:direct-java:compileTestJava' is 41108bb66e9023632af1d245850cddd7
Task ':runners:direct-java:compileTestJava' is not up-to-date because:
  No history is available.
Loaded cache entry for task ':runners:direct-java:compileTestJava' with cache key 41108bb66e9023632af1d245850cddd7
:runners:direct-java:compileTestJava (Thread[Execution worker for ':' Thread 9,5,main]) completed.
Took 0.102 secs.
:runners:direct-java:testClasses (Thread[Execution worker for ':' Thread 9,5,main]) started.

> Task :runners:direct-java:testClasses UP-TO-DATE
Skipping task ':runners:direct-java:testClasses' as it has no actions.
:runners:direct-java:testClasses (Thread[Execution worker for ':' Thread 9,5,main]) completed.
Took 0.0 secs.
:runners:direct-java:shadowTestJar (Thread[Execution worker for ':' Thread 9,5,main]) started.

> Task :runners:direct-java:shadowTestJar FROM-CACHE
Build cache key for task ':runners:direct-java:shadowTestJar' is f6911a747f4182d11e40d4fdfbbaccbc
Task ':runners:direct-java:shadowTestJar' is not up-to-date because:
  No history is available.
Loaded cache entry for task ':runners:direct-java:shadowTestJar' with cache key f6911a747f4182d11e40d4fdfbbaccbc
:runners:direct-java:shadowTestJar (Thread[Execution worker for ':' Thread 9,5,main]) completed.
Took 0.196 secs.
:sdks:java:io:influxdb:integrationTest (Thread[Execution worker for ':' Thread 9,5,main])
started.
Gradle Test Executor 1 started executing tests.

> Task :sdks:java:io:influxdb:integrationTest
Custom actions are attached to task ':sdks:java:io:influxdb:integrationTest'.
Build cache key for task ':sdks:java:io:influxdb:integrationTest' is e3d5ebb35580d2a2110c85aaa21c78d8
Task ':sdks:java:io:influxdb:integrationTest' is not up-to-date because:
  Task.upToDateWhen is false.
Starting process 'Gradle Test Executor 1'. Working directory: <https://ci-beam.apache.org/job/beam_PerformanceTests_InfluxDbIO_IT/ws/src/sdks/java/io/influxdb>
Command: /usr/lib/jvm/java-8-openjdk-amd64/bin/java -DbeamTestPipelineOptions=["--influxDBURL=http://34.67.188.39:8086","--influxDBUserName=superadmin","--influxDBPassword=supersecretpassword","--databaseName=db1"]
-Djava.security.manager=worker.org.gradle.process.internal.worker.child.BootstrapSecurityManager
-Dorg.gradle.native=false -Xmx2g -Dfile.encoding=UTF-8 -Duser.country=US -Duser.language=en
-Duser.variant -ea -cp /home/jenkins/.gradle/caches/6.8.3/workerMain/gradle-worker.jar worker.org.gradle.process.internal.worker.GradleWorkerMain
'Gradle Test Executor 1'
Successfully started process 'Gradle Test Executor 1'

org.apache.beam.sdk.io.influxdb.InfluxDbIOIT STANDARD_ERROR
    SLF4J: Failed to load class "org.slf4j.impl.StaticLoggerBinder".
    SLF4J: Defaulting to no-operation (NOP) logger implementation
    SLF4J: See http://www.slf4j.org/codes.html#StaticLoggerBinder for further details.

org.apache.beam.sdk.io.influxdb.InfluxDbIOIT > testWriteAndReadWithMultipleMetric FAILED
    java.lang.AssertionError: Count All/Flatten.PCollections.out: 
    Expected: <4000L>
         but: was <3999L>
        at org.apache.beam.sdk.testing.PAssert$PAssertionSite.capture(PAssert.java:175)
        at org.apache.beam.sdk.testing.PAssert.thatSingleton(PAssert.java:455)
        at org.apache.beam.sdk.testing.PAssert.thatSingleton(PAssert.java:447)
        at org.apache.beam.sdk.io.influxdb.InfluxDbIOIT.testWriteAndReadWithMultipleMetric(InfluxDbIOIT.java:246)

        Caused by:
        java.lang.AssertionError: 
        Expected: <4000L>
             but: was <3999L>
            at org.hamcrest.MatcherAssert.assertThat(MatcherAssert.java:18)
            at org.hamcrest.MatcherAssert.assertThat(MatcherAssert.java:6)
            at org.apache.beam.sdk.testing.PAssert$AssertIsEqualTo.apply(PAssert.java:1570)
            at org.apache.beam.sdk.testing.PAssert$AssertIsEqualTo.apply(PAssert.java:1561)
            at org.apache.beam.sdk.testing.PAssert$CheckRelationAgainstExpected.apply(PAssert.java:1226)
            at org.apache.beam.sdk.testing.PAssert$CheckRelationAgainstExpected.apply(PAssert.java:1206)
            at org.apache.beam.sdk.testing.PAssert.doChecks(PAssert.java:1548)
            at org.apache.beam.sdk.testing.PAssert$SingletonCheckerDoFn.processElement(PAssert.java:1541)
            at org.apache.beam.sdk.testing.PAssert$SingletonCheckerDoFn$DoFnInvoker.invokeProcessElement(Unknown
Source)
            at org.apache.beam.repackaged.direct_java.runners.core.SimpleDoFnRunner.invokeProcessElement(SimpleDoFnRunner.java:232)
            at org.apache.beam.repackaged.direct_java.runners.core.SimpleDoFnRunner.processElement(SimpleDoFnRunner.java:191)
            at org.apache.beam.repackaged.direct_java.runners.core.SimplePushbackSideInputDoFnRunner.processElementInReadyWindows(SimplePushbackSideInputDoFnRunner.java:79)
            at org.apache.beam.runners.direct.ParDoEvaluator.processElement(ParDoEvaluator.java:244)
            at org.apache.beam.runners.direct.DoFnLifecycleManagerRemovingTransformEvaluator.processElement(DoFnLifecycleManagerRemovingTransformEvaluator.java:54)
            at org.apache.beam.runners.direct.DirectTransformExecutor.processElements(DirectTransformExecutor.java:165)
            at org.apache.beam.runners.direct.DirectTransformExecutor.run(DirectTransformExecutor.java:129)
            at java.util.concurrent.Executors$RunnableAdapter.call(Executors.java:511)
            at java.util.concurrent.FutureTask.run(FutureTask.java:266)
            at java.util.concurrent.ThreadPoolExecutor.runWorker(ThreadPoolExecutor.java:1149)
            at java.util.concurrent.ThreadPoolExecutor$Worker.run(ThreadPoolExecutor.java:624)
            at java.lang.Thread.run(Thread.java:748)

Gradle Test Executor 1 finished executing tests.

> Task :sdks:java:io:influxdb:integrationTest FAILED

6 tests completed, 1 failed
Finished generating test XML results (0.018 secs) into: <https://ci-beam.apache.org/job/beam_PerformanceTests_InfluxDbIO_IT/ws/src/sdks/java/io/influxdb/build/test-results/integrationTest>
Generating HTML test report...
Finished generating test html results (0.026 secs) into: <https://ci-beam.apache.org/job/beam_PerformanceTests_InfluxDbIO_IT/ws/src/sdks/java/io/influxdb/build/reports/tests/integrationTest>
:sdks:java:io:influxdb:integrationTest (Thread[Execution worker for ':' Thread 9,5,main])
completed. Took 7.944 secs.

FAILURE: Build failed with an exception.

* What went wrong:
Execution failed for task ':sdks:java:io:influxdb:integrationTest'.
> There were failing tests. See the report at: file://<https://ci-beam.apache.org/job/beam_PerformanceTests_InfluxDbIO_IT/ws/src/sdks/java/io/influxdb/build/reports/tests/integrationTest/index.html>

* Try:
Run with --stacktrace option to get the stack trace. Run with --debug option to get more log
output. Run with --scan to get full insights.

* Get more help at https://help.gradle.org

Deprecated Gradle features were used in this build, making it incompatible with Gradle 7.0.
Use '--warning-mode all' to show the individual deprecation warnings.
See https://docs.gradle.org/6.8.3/userguide/command_line_interface.html#sec:command_line_warnings

BUILD FAILED in 32s
68 actionable tasks: 38 executed, 30 from cache

Publishing build scan...
https://gradle.com/s/6ilmjpekhrqoa

Build step 'Invoke Gradle script' changed build result to FAILURE
Build step 'Invoke Gradle script' marked build as failure

---------------------------------------------------------------------
To unsubscribe, e-mail: builds-unsubscribe@beam.apache.org
For additional commands, e-mail: builds-help@beam.apache.org


Mime
View raw message