beam-builds mailing list archives

Site index · List index
Message view « Date » · « Thread »
Top « Date » · « Thread »
From Apache Jenkins Server <jenk...@builds.apache.org>
Subject Build failed in Jenkins: beam_PostCommit_XVR_Spark3 #387
Date Thu, 01 Jul 2021 12:05:40 GMT
See <https://ci-beam.apache.org/job/beam_PostCommit_XVR_Spark3/387/display/redirect>

Changes:


------------------------------------------
[...truncated 258.93 KB...]
	at org.gradle.cache.internal.CacheAccessWorker.run(CacheAccessWorker.java:145)
	at org.gradle.internal.concurrent.ExecutorPolicy$CatchAndRecordFailures.onExecute(ExecutorPolicy.java:64)
	at org.gradle.internal.concurrent.ManagedExecutorImpl$1.run(ManagedExecutorImpl.java:48)
	at java.util.concurrent.ThreadPoolExecutor.runWorker(ThreadPoolExecutor.java:1149)
	at java.util.concurrent.ThreadPoolExecutor$Worker.run(ThreadPoolExecutor.java:624)
	at org.gradle.internal.concurrent.ThreadFactoryImpl$ManagedThreadRunnable.run(ThreadFactoryImpl.java:56)
	at java.lang.Thread.run(Thread.java:748)
Caused by: org.gradle.api.UncheckedIOException: java.io.IOException: No space left on device
	at org.gradle.cache.internal.btree.FileBackedBlockStore.write(FileBackedBlockStore.java:140)
	at org.gradle.cache.internal.btree.CachingBlockStore.flush(CachingBlockStore.java:64)
	at org.gradle.cache.internal.btree.FreeListBlockStore.flush(FreeListBlockStore.java:103)
	at org.gradle.cache.internal.btree.StateCheckBlockStore.flush(StateCheckBlockStore.java:85)
	at org.gradle.cache.internal.btree.BTreePersistentIndexedCache.put(BTreePersistentIndexedCache.java:160)
	... 19 more
Caused by: java.io.IOException: No space left on device
	at java.io.RandomAccessFile.writeBytes(Native Method)
	at java.io.RandomAccessFile.write(RandomAccessFile.java:525)
	at org.gradle.internal.io.RandomAccessFileOutputStream.write(RandomAccessFileOutputStream.java:46)
	at java.io.BufferedOutputStream.flushBuffer(BufferedOutputStream.java:82)
	at java.io.BufferedOutputStream.flush(BufferedOutputStream.java:140)
	at java.io.FilterOutputStream.flush(FilterOutputStream.java:140)
	at org.gradle.cache.internal.btree.ByteOutput.done(ByteOutput.java:62)
	at org.gradle.cache.internal.btree.FileBackedBlockStore$BlockImpl.write(FileBackedBlockStore.java:223)
	at org.gradle.cache.internal.btree.FileBackedBlockStore.write(FileBackedBlockStore.java:136)
	... 23 more

> Task :sdks:go:resolveBuildDependencies FAILED
> Task :sdks:go:installDependencies FAILED
> Task :sdks:java:container:installDependencies FAILED
> Task :sdks:python:container:installDependencies FAILED

FAILURE: Build completed with 14 failures.

1: Task failed with an exception.
-----------
* What went wrong:
Execution failed for task ':sdks:java:extensions:sql:copyFmppTemplatesFromCalciteCore'.
> Could not copy zip entry /home/jenkins/.gradle/caches/modules-2/files-2.1/org.apache.beam/beam-vendor-calcite-1_20_0/0.1/6d16a59dc771784789116607a04acd9a0ef91d16/beam-vendor-calcite-1_20_0-0.1.jar!codegen/
to '<https://ci-beam.apache.org/job/beam_PostCommit_XVR_Spark3/ws/src/sdks/java/extensions/sql/build/templates-fmpp/codegen'.>
   > Failed to create directory '<https://ci-beam.apache.org/job/beam_PostCommit_XVR_Spark3/ws/src/sdks/java/extensions/sql/build/templates-fmpp/codegen'>

* Try:
Run with --stacktrace option to get the stack trace. Run with --info or --debug option to
get more log output. Run with --scan to get full insights.
==============================================================================

2: Task failed with an exception.
-----------
* What went wrong:
Execution failed for task ':sdks:java:extensions:sql:copyFmppTemplatesFromSrc'.
> Failed to create directory '<https://ci-beam.apache.org/job/beam_PostCommit_XVR_Spark3/ws/src/sdks/java/extensions/sql/build/templates-fmpp/codegen'>

* Try:
Run with --stacktrace option to get the stack trace. Run with --info or --debug option to
get more log output. Run with --scan to get full insights.
==============================================================================

3: Task failed with an exception.
-----------
* What went wrong:
Execution failed for task ':sdks:java:extensions:sql:createCheckerFrameworkManifest'.
> Failed to create parent directory '<https://ci-beam.apache.org/job/beam_PostCommit_XVR_Spark3/ws/src/sdks/java/extensions/sql/build/checkerframework'>
when creating directory '<https://ci-beam.apache.org/job/beam_PostCommit_XVR_Spark3/ws/src/sdks/java/extensions/sql/build/checkerframework/META-INF/services'>

* Try:
Run with --stacktrace option to get the stack trace. Run with --info or --debug option to
get more log output. Run with --scan to get full insights.
==============================================================================

4: Task failed with an exception.
-----------
* What went wrong:
Execution failed for task ':sdks:java:extensions:sql:processResources'.
> Failed to create parent directory '<https://ci-beam.apache.org/job/beam_PostCommit_XVR_Spark3/ws/src/sdks/java/extensions/sql/build/resources'>
when creating directory '<https://ci-beam.apache.org/job/beam_PostCommit_XVR_Spark3/ws/src/sdks/java/extensions/sql/build/resources/main'>

* Try:
Run with --stacktrace option to get the stack trace. Run with --info or --debug option to
get more log output. Run with --scan to get full insights.
==============================================================================

5: Task failed with an exception.
-----------
* What went wrong:
Execution failed for task ':model:pipeline:extractIncludeProto'.
> Could not copy zip entry /home/jenkins/.gradle/caches/modules-2/files-2.1/org.apache.beam/beam-vendor-grpc-1_36_0/0.1/776a788d8f3c70a047beca24401f20ff6abaa6e0/beam-vendor-grpc-1_36_0-0.1.jar!google/api/consumer.proto
to '<https://ci-beam.apache.org/job/beam_PostCommit_XVR_Spark3/ws/src/model/pipeline/build/extracted-include-protos/main/google/api/consumer.proto'.>
   > java.io.IOException: No space left on device

* Try:
Run with --stacktrace option to get the stack trace. Run with --info or --debug option to
get more log output. Run with --scan to get full insights.
==============================================================================

6: Task failed with an exception.
-----------
* What went wrong:
Execution failed for task ':model:pipeline:extractProto'.
> Failed to create parent directory '<https://ci-beam.apache.org/job/beam_PostCommit_XVR_Spark3/ws/src/model/pipeline/build/extracted-protos'>
when creating directory '<https://ci-beam.apache.org/job/beam_PostCommit_XVR_Spark3/ws/src/model/pipeline/build/extracted-protos/main'>

* Try:
Run with --stacktrace option to get the stack trace. Run with --info or --debug option to
get more log output. Run with --scan to get full insights.
==============================================================================

7: Task failed with an exception.
-----------
* What went wrong:
Execution failed for task ':sdks:java:core:generateTestAvroJava'.
> Failed to compile schema definition file src/test/avro/org/apache/beam/sdk/schemas/test.avsc

* Try:
Run with --stacktrace option to get the stack trace. Run with --info or --debug option to
get more log output. Run with --scan to get full insights.
==============================================================================

8: Task failed with an exception.
-----------
* What went wrong:
Execution failed for task ':release:go-licenses:java:dockerRun'.
> Process 'command 'docker'' finished with non-zero exit value 1

* Try:
Run with --stacktrace option to get the stack trace. Run with --info or --debug option to
get more log output. Run with --scan to get full insights.
==============================================================================

9: Task failed with an exception.
-----------
* What went wrong:
Execution failed for task ':release:go-licenses:py:dockerRun'.
> Process 'command 'docker'' finished with non-zero exit value 1

* Try:
Run with --stacktrace option to get the stack trace. Run with --info or --debug option to
get more log output. Run with --scan to get full insights.
==============================================================================

10: Task failed with an exception.
-----------
* What went wrong:
Execution failed for task ':sdks:python:installGcpTest'.
> Process 'command 'sh'' finished with non-zero exit value 1

* Try:
Run with --stacktrace option to get the stack trace. Run with --info or --debug option to
get more log output. Run with --scan to get full insights.
==============================================================================

11: Task failed with an exception.
-----------
* What went wrong:
Execution failed for task ':sdks:go:resolveBuildDependencies'.
> java.io.IOException: No space left on device

* Try:
Run with --stacktrace option to get the stack trace. Run with --info or --debug option to
get more log output. Run with --scan to get full insights.
==============================================================================

12: Task failed with an exception.
-----------
* What went wrong:
Execution failed for task ':sdks:go:installDependencies'.
> java.io.IOException: Unable to create directory <https://ci-beam.apache.org/job/beam_PostCommit_XVR_Spark3/ws/src/sdks/go/vendor>

* Try:
Run with --stacktrace option to get the stack trace. Run with --info or --debug option to
get more log output. Run with --scan to get full insights.
==============================================================================

13: Task failed with an exception.
-----------
* What went wrong:
Execution failed for task ':sdks:java:container:installDependencies'.
> java.io.IOException: Unable to create directory <https://ci-beam.apache.org/job/beam_PostCommit_XVR_Spark3/ws/src/sdks/java/container/vendor>

* Try:
Run with --stacktrace option to get the stack trace. Run with --info or --debug option to
get more log output. Run with --scan to get full insights.
==============================================================================

14: Task failed with an exception.
-----------
* What went wrong:
Execution failed for task ':sdks:python:container:installDependencies'.
> java.io.IOException: Unable to create directory <https://ci-beam.apache.org/job/beam_PostCommit_XVR_Spark3/ws/src/sdks/python/container/vendor>

* Try:
Run with --stacktrace option to get the stack trace. Run with --info or --debug option to
get more log output. Run with --scan to get full insights.
==============================================================================

* Get more help at https://help.gradle.org

Deprecated Gradle features were used in this build, making it incompatible with Gradle 7.0.
Use '--warning-mode all' to show the individual deprecation warnings.
See https://docs.gradle.org/6.8.3/userguide/command_line_interface.html#sec:command_line_warnings

BUILD FAILED in 4m 13s
76 actionable tasks: 70 executed, 2 from cache, 4 up-to-date

Publishing build scan...
https://gradle.com/s/jspqzmojrn4uu

Could not stop Service ExecutionHistoryCacheAccess at ExecutionGradleServices.createCacheAccess().
org.gradle.api.UncheckedIOException: Could not add entry ':model:pipeline:extractIncludeProto'
to cache executionHistory.bin (<https://ci-beam.apache.org/job/beam_PostCommit_XVR_Spark3/ws/src/.gradle/6.8.3/executionHistory/executionHistory.bin).>
	at org.gradle.cache.internal.btree.BTreePersistentIndexedCache.put(BTreePersistentIndexedCache.java:162)
	at org.gradle.cache.internal.DefaultMultiProcessSafePersistentIndexedCache.lambda$put$1(DefaultMultiProcessSafePersistentIndexedCache.java:67)
	at org.gradle.cache.internal.DefaultFileLockManager$DefaultFileLock.doWriteAction(DefaultFileLockManager.java:215)
	at org.gradle.cache.internal.DefaultFileLockManager$DefaultFileLock.writeFile(DefaultFileLockManager.java:205)
	at org.gradle.cache.internal.DefaultCacheAccess$UnitOfWorkFileAccess.writeFile(DefaultCacheAccess.java:449)
	at org.gradle.cache.internal.DefaultMultiProcessSafePersistentIndexedCache.put(DefaultMultiProcessSafePersistentIndexedCache.java:67)
	at org.gradle.cache.internal.AsyncCacheAccessDecoratedCache.lambda$putLater$1(AsyncCacheAccessDecoratedCache.java:56)
	at org.gradle.internal.concurrent.ExecutorPolicy$CatchAndRecordFailures.onExecute(ExecutorPolicy.java:64)
	at org.gradle.cache.internal.CacheAccessWorker$2.run(CacheAccessWorker.java:180)
	at org.gradle.internal.Factories$1.create(Factories.java:31)
	at org.gradle.cache.internal.DefaultCacheAccess.useCache(DefaultCacheAccess.java:220)
	at org.gradle.cache.internal.DefaultCacheAccess.useCache(DefaultCacheAccess.java:201)
	at org.gradle.cache.internal.CacheAccessWorker.flushOperations(CacheAccessWorker.java:175)
	at org.gradle.cache.internal.CacheAccessWorker.run(CacheAccessWorker.java:145)
	at org.gradle.internal.concurrent.ExecutorPolicy$CatchAndRecordFailures.onExecute(ExecutorPolicy.java:64)
	at org.gradle.internal.concurrent.ManagedExecutorImpl$1.run(ManagedExecutorImpl.java:48)
	at java.util.concurrent.ThreadPoolExecutor.runWorker(ThreadPoolExecutor.java:1149)
	at java.util.concurrent.ThreadPoolExecutor$Worker.run(ThreadPoolExecutor.java:624)
	at org.gradle.internal.concurrent.ThreadFactoryImpl$ManagedThreadRunnable.run(ThreadFactoryImpl.java:56)
	at java.lang.Thread.run(Thread.java:748)
Caused by: org.gradle.api.UncheckedIOException: java.io.IOException: No space left on device
	at org.gradle.cache.internal.btree.FileBackedBlockStore.write(FileBackedBlockStore.java:140)
	at org.gradle.cache.internal.btree.CachingBlockStore.flush(CachingBlockStore.java:64)
	at org.gradle.cache.internal.btree.FreeListBlockStore.flush(FreeListBlockStore.java:103)
	at org.gradle.cache.internal.btree.StateCheckBlockStore.flush(StateCheckBlockStore.java:85)
	at org.gradle.cache.internal.btree.BTreePersistentIndexedCache.put(BTreePersistentIndexedCache.java:160)
	... 19 more
Caused by: java.io.IOException: No space left on device
	at java.io.RandomAccessFile.writeBytes(Native Method)
	at java.io.RandomAccessFile.write(RandomAccessFile.java:525)
	at org.gradle.internal.io.RandomAccessFileOutputStream.write(RandomAccessFileOutputStream.java:46)
	at java.io.BufferedOutputStream.flushBuffer(BufferedOutputStream.java:82)
	at java.io.BufferedOutputStream.write(BufferedOutputStream.java:126)
	at com.google.common.io.CountingOutputStream.write(CountingOutputStream.java:53)
	at java.io.DataOutputStream.write(DataOutputStream.java:107)
	at org.gradle.internal.io.StreamByteBuffer$StreamByteBufferChunk.writeTo(StreamByteBuffer.java:356)
	at org.gradle.internal.io.StreamByteBuffer.writeTo(StreamByteBuffer.java:104)
	at org.gradle.cache.internal.btree.BTreePersistentIndexedCache$DataBlock.write(BTreePersistentIndexedCache.java:713)
	at org.gradle.cache.internal.btree.FileBackedBlockStore$BlockImpl.write(FileBackedBlockStore.java:215)
	at org.gradle.cache.internal.btree.FileBackedBlockStore.write(FileBackedBlockStore.java:136)
	... 23 more

FAILURE: Build failed with an exception.

* What went wrong:
Could not add entry '<https://ci-beam.apache.org/job/beam_PostCommit_XVR_Spark3/ws/src/sdks/go/.gogradle/cache/build-0.10.bin'>
to cache outputFiles.bin (<https://ci-beam.apache.org/job/beam_PostCommit_XVR_Spark3/ws/src/.gradle/buildOutputCleanup/outputFiles.bin).>
> java.io.IOException: No space left on device

* Try:
Run with --stacktrace option to get the stack trace. Run with --info or --debug option to
get more log output. Run with --scan to get full insights.

* Get more help at https://help.gradle.org

Deprecated Gradle features were used in this build, making it incompatible with Gradle 7.0.
Use '--warning-mode all' to show the individual deprecation warnings.
See https://docs.gradle.org/6.8.3/userguide/command_line_interface.html#sec:command_line_warnings

BUILD FAILED in 4m 14s
Build step 'Invoke Gradle script' changed build result to FAILURE
Build step 'Invoke Gradle script' marked build as failure

---------------------------------------------------------------------
To unsubscribe, e-mail: builds-unsubscribe@beam.apache.org
For additional commands, e-mail: builds-help@beam.apache.org


Mime
View raw message