beam-builds mailing list archives

Site index · List index
Message view « Date » · « Thread »
Top « Date » · « Thread »
From Apache Jenkins Server <jenk...@builds.apache.org>
Subject Build failed in Jenkins: beam_PreCommit_PythonLint_Cron #2506
Date Thu, 01 Jul 2021 06:02:38 GMT
See <https://ci-beam.apache.org/job/beam_PreCommit_PythonLint_Cron/2506/display/redirect>

Changes:


------------------------------------------
Started by timer
Running as SYSTEM
[EnvInject] - Loading node environment variables.
Building remotely on apache-beam-jenkins-3 (beam) in workspace <https://ci-beam.apache.org/job/beam_PreCommit_PythonLint_Cron/ws/>
The recommended git tool is: NONE
No credentials specified
Wiping out workspace first.
Cloning the remote Git repository
Cloning repository https://github.com/apache/beam.git
 > git init <https://ci-beam.apache.org/job/beam_PreCommit_PythonLint_Cron/ws/src>
# timeout=10
Fetching upstream changes from https://github.com/apache/beam.git
 > git --version # timeout=10
 > git --version # 'git version 2.7.4'
 > git fetch --tags --progress https://github.com/apache/beam.git +refs/heads/*:refs/remotes/origin/*
# timeout=10
 > git config remote.origin.url https://github.com/apache/beam.git # timeout=10
 > git config --add remote.origin.fetch +refs/heads/*:refs/remotes/origin/* # timeout=10
 > git config remote.origin.url https://github.com/apache/beam.git # timeout=10
Fetching upstream changes from https://github.com/apache/beam.git
 > git fetch --tags --progress https://github.com/apache/beam.git +refs/heads/*:refs/remotes/origin/*
+refs/pull/${ghprbPullId}/*:refs/remotes/origin/pr/${ghprbPullId}/* # timeout=10
 > git rev-parse origin/master^{commit} # timeout=10
Checking out Revision 7b30339a64949bcb7c1bc11305b8c9ab49e12942 (origin/master)
 > git config core.sparsecheckout # timeout=10
 > git checkout -f 7b30339a64949bcb7c1bc11305b8c9ab49e12942 # timeout=10
Commit message: "[BEAM-12548] Add EqualsList functionality to PAssert (#15110)"
 > git rev-list --no-walk 7b30339a64949bcb7c1bc11305b8c9ab49e12942 # timeout=10
No emails were triggered.
[EnvInject] - Executing scripts and injecting environment variables after the SCM step.
[EnvInject] - Injecting as environment variables the properties content 
SPARK_LOCAL_IP=127.0.0.1
SETUPTOOLS_USE_DISTUTILS=stdlib

[EnvInject] - Variables injected successfully.
[Gradle] - Launching build.
[src] $ <https://ci-beam.apache.org/job/beam_PreCommit_PythonLint_Cron/ws/src/gradlew>
--continue --max-workers=12 -Dorg.gradle.jvmargs=-Xms2g -Dorg.gradle.jvmargs=-Xmx4g -Dorg.gradle.vfs.watch=false
-Pdocker-pull-licenses :pythonLintPreCommit
Starting a Gradle Daemon, 1 busy Daemon could not be reused, use --status for details
> Task :buildSrc:compileJava NO-SOURCE
> Task :buildSrc:compileGroovy FROM-CACHE
> Task :buildSrc:pluginDescriptors
> Task :buildSrc:processResources
> Task :buildSrc:classes
> Task :buildSrc:jar
> Task :buildSrc:assemble
> Task :buildSrc:spotlessGroovy FROM-CACHE
> Task :buildSrc:spotlessGroovyCheck UP-TO-DATE
> Task :buildSrc:spotlessGroovyGradle FROM-CACHE
> Task :buildSrc:spotlessGroovyGradleCheck UP-TO-DATE
> Task :buildSrc:spotlessCheck UP-TO-DATE
> Task :buildSrc:pluginUnderTestMetadata
> Task :buildSrc:compileTestJava NO-SOURCE
> Task :buildSrc:compileTestGroovy NO-SOURCE
> Task :buildSrc:processTestResources NO-SOURCE
> Task :buildSrc:testClasses UP-TO-DATE
> Task :buildSrc:test NO-SOURCE
> Task :buildSrc:validatePlugins FROM-CACHE
> Task :buildSrc:check UP-TO-DATE
> Task :buildSrc:build
Configuration on demand is an incubating feature.

> Task :sdks:python:setupVirtualenv
Using base prefix '/usr'
New python executable in <https://ci-beam.apache.org/job/beam_PreCommit_PythonLint_Cron/ws/src/build/gradleenv/1922375555/bin/python3.8>
Also creating executable in <https://ci-beam.apache.org/job/beam_PreCommit_PythonLint_Cron/ws/src/build/gradleenv/1922375555/bin/python>
Installing setuptools, pip, wheel...

  Complete output from command /home/jenkins/jenkin...375555/bin/python3.8 - setuptools pip
wheel:
  Looking in links: /usr/local/lib/python3.5/dist-packages/virtualenv_support
Collecting setuptools
  Using cached https://files.pythonhosted.org/packages/4e/78/56aa1b5f4d8ac548755ae767d84f0be54fdd9d404197a3d9e4659d272348/setuptools-57.0.0-py3-none-any.whl
Collecting pip
  Using cached https://files.pythonhosted.org/packages/47/ca/f0d790b6e18b3a6f3bd5e80c2ee4edbb5807286c21cdd0862ca933f751dd/pip-21.1.3-py3-none-any.whl
Collecting wheel
  Using cached https://files.pythonhosted.org/packages/65/63/39d04c74222770ed1589c0eaba06c05891801219272420b40311cd60c880/wheel-0.36.2-py2.py3-none-any.whl
Installing collected packages: setuptools, pip, wheel
Could not install packages due to an EnvironmentError: [Errno 28] No space left on device:
'/tmp/pip-install-jjcbk0ea/setuptools/setuptools/_distutils/__pycache__/_msvccompiler.cpython-38.pyc'
-> '<https://ci-beam.apache.org/job/beam_PreCommit_PythonLint_Cron/ws/src/build/gradleenv/1922375555/lib/python3.8/site-packages/setuptools/_distutils/__pycache__/_msvccompiler.cpython-38.pyc'>

----------------------------------------
...Installing setuptools, pip, wheel...done.
Traceback (most recent call last):
  File "/usr/local/lib/python3.5/dist-packages/virtualenv.py", line 2567, in <module>
    main()
  File "/usr/local/lib/python3.5/dist-packages/virtualenv.py", line 783, in main
    create_environment(
  File "/usr/local/lib/python3.5/dist-packages/virtualenv.py", line 1088, in create_environment
    install_wheel(to_install, py_executable, search_dirs, download=download)
  File "/usr/local/lib/python3.5/dist-packages/virtualenv.py", line 935, in install_wheel
    _install_wheel_with_search_dir(download, project_names, py_executable, search_dirs)
  File "/usr/local/lib/python3.5/dist-packages/virtualenv.py", line 1025, in _install_wheel_with_search_dir
    call_subprocess(cmd, show_stdout=False, extra_env=env, stdin=script)
  File "/usr/local/lib/python3.5/dist-packages/virtualenv.py", line 886, in call_subprocess
    raise OSError("Command {} failed with error code {}".format(cmd_desc, proc.returncode))
OSError: Command /home/jenkins/jenkin...375555/bin/python3.8 - setuptools pip wheel failed
with error code 1
Running virtualenv with interpreter /usr/bin/python3.8

> Task :sdks:python:setupVirtualenv FAILED

> Task :sdks:python:test-suites:tox:py37:setupVirtualenv
Using base prefix '/usr'
New python executable in <https://ci-beam.apache.org/job/beam_PreCommit_PythonLint_Cron/ws/src/build/gradleenv/-1227304283/bin/python3.7>
Also creating executable in <https://ci-beam.apache.org/job/beam_PreCommit_PythonLint_Cron/ws/src/build/gradleenv/-1227304283/bin/python>
Installing setuptools, pip, wheel...
Traceback (most recent call last):
  File "/usr/local/lib/python3.5/dist-packages/virtualenv.py", line 2567, in <module>
    main()
  File "/usr/local/lib/python3.5/dist-packages/virtualenv.py", line 793, in main
    symlink=options.symlink,
  File "/usr/local/lib/python3.5/dist-packages/virtualenv.py", line 1088, in create_environment
    install_wheel(to_install, py_executable, search_dirs, download=download)
  File "/usr/local/lib/python3.5/dist-packages/virtualenv.py", line 935, in install_wheel
    _install_wheel_with_search_dir(download, project_names, py_executable, search_dirs)
  File "/usr/local/lib/python3.5/dist-packages/virtualenv.py", line 1025, in _install_wheel_with_search_dir
    call_subprocess(cmd, show_stdout=False, extra_env=env, stdin=script)
  File "/usr/local/lib/python3.5/dist-packages/virtualenv.py", line 886, in call_subprocess
    raise OSError("Command {} failed with error code {}".format(cmd_desc, proc.returncode))
OSError: Command /home/jenkins/jenkin...304283/bin/python3.7 - setuptools pip wheel failed
with error code 1

  Complete output from command /home/jenkins/jenkin...304283/bin/python3.7 - setuptools pip
wheel:
  Looking in links: /usr/local/lib/python3.5/dist-packages/virtualenv_support
Collecting setuptools
  Using cached https://files.pythonhosted.org/packages/4e/78/56aa1b5f4d8ac548755ae767d84f0be54fdd9d404197a3d9e4659d272348/setuptools-57.0.0-py3-none-any.whl
Collecting pip
  Using cached https://files.pythonhosted.org/packages/47/ca/f0d790b6e18b3a6f3bd5e80c2ee4edbb5807286c21cdd0862ca933f751dd/pip-21.1.3-py3-none-any.whl
Collecting wheel
  Using cached https://files.pythonhosted.org/packages/65/63/39d04c74222770ed1589c0eaba06c05891801219272420b40311cd60c880/wheel-0.36.2-py2.py3-none-any.whl
Installing collected packages: setuptools, pip, wheel
Could not install packages due to an EnvironmentError: [Errno 28] No space left on device

----------------------------------------
...Installing setuptools, pip, wheel...done.
Running virtualenv with interpreter /usr/bin/python3.7

> Task :sdks:python:test-suites:tox:py37:setupVirtualenv FAILED

FAILURE: Build completed with 2 failures.

1: Task failed with an exception.
-----------
* What went wrong:
Execution failed for task ':sdks:python:setupVirtualenv'.
> Process 'command 'virtualenv'' finished with non-zero exit value 1

* Try:
Run with --stacktrace option to get the stack trace. Run with --info or --debug option to
get more log output. Run with --scan to get full insights.
==============================================================================

2: Task failed with an exception.
-----------
* What went wrong:
Execution failed for task ':sdks:python:test-suites:tox:py37:setupVirtualenv'.
> Process 'command 'virtualenv'' finished with non-zero exit value 1

* Try:
Run with --stacktrace option to get the stack trace. Run with --info or --debug option to
get more log output. Run with --scan to get full insights.
==============================================================================

* Get more help at https://help.gradle.org

Deprecated Gradle features were used in this build, making it incompatible with Gradle 7.0.
Use '--warning-mode all' to show the individual deprecation warnings.
See https://docs.gradle.org/6.8.3/userguide/command_line_interface.html#sec:command_line_warnings

BUILD FAILED in 46s
2 actionable tasks: 2 executed

Publishing build scan...
https://gradle.com/s/wh62b4aybn26g

Build step 'Invoke Gradle script' changed build result to FAILURE
Build step 'Invoke Gradle script' marked build as failure

---------------------------------------------------------------------
To unsubscribe, e-mail: builds-unsubscribe@beam.apache.org
For additional commands, e-mail: builds-help@beam.apache.org


Mime
View raw message