beam-builds mailing list archives

Site index · List index
Message view « Date » · « Thread »
Top « Date » · « Thread »
From Apache Jenkins Server <jenk...@builds.apache.org>
Subject Build failed in Jenkins: beam_PostCommit_Py_VR_Dataflow #8165
Date Wed, 21 Jul 2021 01:29:21 GMT
See <https://ci-beam.apache.org/job/beam_PostCommit_Py_VR_Dataflow/8165/display/redirect?page=changes>

Changes:

[dhuntsperger] fixed broken tabs for runner and shell in java quickstart

[noreply] [BEAM-10955] Revert f077ba51cb0790c403297833d5378b399b7248df (#15119)

[noreply] [BEAM-12596] Ensure that SDF restriction size is always greater then

[noreply] [BEAM-12639] Allow for zero splits in SplitAndSizeRestriction (#15191)

[noreply] [BEAM-12559] Enable CrossLanguageValidateRunner test for Samza (#15195)

[dhuntsperger] fix remaining runner and shell snippets


------------------------------------------
[...truncated 207.24 KB...]
apache_beam/runners/dataflow/internal/apiclient.py:688: in create_job
    return self.submit_job_description(job)
apache_beam/utils/retry.py:253: in wrapper
    return fun(*args, **kwargs)
apache_beam/runners/dataflow/internal/apiclient.py:789: in submit_job_description
    response = self._client.projects_locations_jobs.Create(request)
apache_beam/runners/dataflow/internal/clients/dataflow/dataflow_v1b3_client.py:903:
in Create
    config, request, global_params=global_params)
../../build/gradleenv/-1734967053/lib/python3.6/site-packages/apitools/base/py/base_api.py:731:
in _RunMethod
    return self.ProcessHttpResponse(method_config, http_response, request)
../../build/gradleenv/-1734967053/lib/python3.6/site-packages/apitools/base/py/base_api.py:737:
in ProcessHttpResponse
    self.__ProcessHttpResponse(method_config, http_response, request))
_ _ _ _ _ _ _ _ _ _ _ _ _ _ _ _ _ _ _ _ _ _ _ _ _ _ _ _ _ _ _ _ _ _ _ _ _ _ _ _ 

self = <apache_beam.runners.dataflow.internal.clients.dataflow.dataflow_v1b3_client.DataflowV1b3.ProjectsLocationsJobsService
object at 0x7f13ef172470>
method_config = <ApiMethodInfo
 relative_path: 'v1b3/projects/{projectId}/locations/{location}/jobs'
 method_id: 'dataflow.projects.lo...DataflowProjectsLocationsJobsCreateRequest'
 response_type_name: 'Job'
 request_field: 'job'
 supports_download: False>
http_response = Response(info={'vary': 'Origin, X-Origin, Referer', 'content-type': 'application/json;
charset=UTF-8', 'date': 'Wed, 2...', request_url='https://dataflow.googleapis.com/v1b3/projects/apache-beam-testing/locations/us-central1/jobs?alt=json')
request = <DataflowProjectsLocationsJobsCreateRequest
 job: <Job
 environment: <Environment
 clusterManagerApiService: 'compute....iles: []
 type: TypeValueValuesEnum(JOB_TYPE_STREAMING, 2)>
 location: 'us-central1'
 projectId: 'apache-beam-testing'>

    def __ProcessHttpResponse(self, method_config, http_response, request):
        """Process the given http response."""
        if http_response.status_code not in (http_client.OK,
                                             http_client.CREATED,
                                             http_client.NO_CONTENT):
            raise exceptions.HttpError.FromResponse(
>               http_response, method_config=method_config, request=request)
E           apitools.base.py.exceptions.HttpConflictError: HttpError accessing <https://dataflow.googleapis.com/v1b3/projects/apache-beam-testing/locations/us-central1/jobs?alt=json>:
response: <{'vary': 'Origin, X-Origin, Referer', 'content-type': 'application/json; charset=UTF-8',
'date': 'Wed, 21 Jul 2021 01:01:09 GMT', 'server': 'ESF', 'cache-control': 'private', 'x-xss-protection':
'0', 'x-frame-options': 'SAMEORIGIN', 'x-content-type-options': 'nosniff', 'transfer-encoding':
'chunked', 'status': '409', 'content-length': '317', '-content-encoding': 'gzip'}>, content
<{
E             "error": {
E               "code": 409,
E               "message": "(700d6a85a2cfc1e): The workflow could not be created.
Causes: (3d5344febc156e00): There is already an active job named beamapp-jenkins-0721010029-322221.
If you want to  submit a second job, try again by setting a different name.",
E               "status": "ALREADY_EXISTS"
E             }
E           }
E           >

../../build/gradleenv/-1734967053/lib/python3.6/site-packages/apitools/base/py/base_api.py:604:
HttpConflictError
------------------------------ Captured log call -------------------------------
INFO     apache_beam.runners.portability.stager:stager.py:644 Executing command:
['<https://ci-beam.apache.org/job/beam_PostCommit_Py_VR_Dataflow/ws/src/build/gradleenv/-1734967053/bin/python3.6',>
'-m', 'pip', 'download', '--dest', '/tmp/dataflow-requirements-cache', '-r', 'postcommit_requirements.txt',
'--exists-action', 'i', '--no-binary', ':all:']
INFO     apache_beam.runners.portability.stager:stager.py:300 Copying Beam SDK "<https://ci-beam.apache.org/job/beam_PostCommit_Py_VR_Dataflow/ws/src/sdks/python/build/apache-beam.tar.gz">
to staging location.
WARNING  root:environments.py:374 Make sure that locally built Python SDK docker
image has Python 3.6 interpreter.
INFO     root:environments.py:380 Default Python SDK image for environment is apache/beam_python3.6_sdk:2.32.0.dev
INFO     root:environments.py:296 Using provided Python SDK container image: gcr.io/cloud-dataflow/v1beta3/python36-fnapi:beam-master-20210702
INFO     root:environments.py:304 Python SDK container image set to "gcr.io/cloud-dataflow/v1beta3/python36-fnapi:beam-master-20210702"
for Docker environment
INFO     apache_beam.runners.dataflow.internal.apiclient:apiclient.py:632 Starting
GCS upload to gs://temp-storage-for-end-to-end-tests/staging-it/beamapp-jenkins-0721010029-322221.1626829229.322418/requirements.txt...
INFO     apache_beam.runners.dataflow.internal.apiclient:apiclient.py:651 Completed
GCS upload to gs://temp-storage-for-end-to-end-tests/staging-it/beamapp-jenkins-0721010029-322221.1626829229.322418/requirements.txt
in 0 seconds.
INFO     apache_beam.runners.dataflow.internal.apiclient:apiclient.py:632 Starting
GCS upload to gs://temp-storage-for-end-to-end-tests/staging-it/beamapp-jenkins-0721010029-322221.1626829229.322418/pbr-5.6.0.tar.gz...
INFO     apache_beam.runners.dataflow.internal.apiclient:apiclient.py:651 Completed
GCS upload to gs://temp-storage-for-end-to-end-tests/staging-it/beamapp-jenkins-0721010029-322221.1626829229.322418/pbr-5.6.0.tar.gz
in 0 seconds.
INFO     apache_beam.runners.dataflow.internal.apiclient:apiclient.py:632 Starting
GCS upload to gs://temp-storage-for-end-to-end-tests/staging-it/beamapp-jenkins-0721010029-322221.1626829229.322418/mock-2.0.0.tar.gz...
INFO     apache_beam.runners.dataflow.internal.apiclient:apiclient.py:651 Completed
GCS upload to gs://temp-storage-for-end-to-end-tests/staging-it/beamapp-jenkins-0721010029-322221.1626829229.322418/mock-2.0.0.tar.gz
in 0 seconds.
INFO     apache_beam.runners.dataflow.internal.apiclient:apiclient.py:632 Starting
GCS upload to gs://temp-storage-for-end-to-end-tests/staging-it/beamapp-jenkins-0721010029-322221.1626829229.322418/six-1.16.0.tar.gz...
INFO     apache_beam.runners.dataflow.internal.apiclient:apiclient.py:651 Completed
GCS upload to gs://temp-storage-for-end-to-end-tests/staging-it/beamapp-jenkins-0721010029-322221.1626829229.322418/six-1.16.0.tar.gz
in 0 seconds.
INFO     apache_beam.runners.dataflow.internal.apiclient:apiclient.py:632 Starting
GCS upload to gs://temp-storage-for-end-to-end-tests/staging-it/beamapp-jenkins-0721010029-322221.1626829229.322418/soupsieve-2.2.1.tar.gz...
INFO     apache_beam.runners.dataflow.internal.apiclient:apiclient.py:651 Completed
GCS upload to gs://temp-storage-for-end-to-end-tests/staging-it/beamapp-jenkins-0721010029-322221.1626829229.322418/soupsieve-2.2.1.tar.gz
in 0 seconds.
INFO     apache_beam.runners.dataflow.internal.apiclient:apiclient.py:632 Starting
GCS upload to gs://temp-storage-for-end-to-end-tests/staging-it/beamapp-jenkins-0721010029-322221.1626829229.322418/PyHamcrest-1.10.1.tar.gz...
INFO     apache_beam.runners.dataflow.internal.apiclient:apiclient.py:651 Completed
GCS upload to gs://temp-storage-for-end-to-end-tests/staging-it/beamapp-jenkins-0721010029-322221.1626829229.322418/PyHamcrest-1.10.1.tar.gz
in 0 seconds.
INFO     apache_beam.runners.dataflow.internal.apiclient:apiclient.py:632 Starting
GCS upload to gs://temp-storage-for-end-to-end-tests/staging-it/beamapp-jenkins-0721010029-322221.1626829229.322418/parameterized-0.7.5.tar.gz...
INFO     apache_beam.runners.dataflow.internal.apiclient:apiclient.py:651 Completed
GCS upload to gs://temp-storage-for-end-to-end-tests/staging-it/beamapp-jenkins-0721010029-322221.1626829229.322418/parameterized-0.7.5.tar.gz
in 0 seconds.
INFO     apache_beam.runners.dataflow.internal.apiclient:apiclient.py:632 Starting
GCS upload to gs://temp-storage-for-end-to-end-tests/staging-it/beamapp-jenkins-0721010029-322221.1626829229.322418/beautifulsoup4-4.9.3.tar.gz...
INFO     apache_beam.runners.dataflow.internal.apiclient:apiclient.py:651 Completed
GCS upload to gs://temp-storage-for-end-to-end-tests/staging-it/beamapp-jenkins-0721010029-322221.1626829229.322418/beautifulsoup4-4.9.3.tar.gz
in 0 seconds.
INFO     apache_beam.runners.dataflow.internal.apiclient:apiclient.py:632 Starting
GCS upload to gs://temp-storage-for-end-to-end-tests/staging-it/beamapp-jenkins-0721010029-322221.1626829229.322418/dataflow_python_sdk.tar...
INFO     apache_beam.runners.dataflow.internal.apiclient:apiclient.py:651 Completed
GCS upload to gs://temp-storage-for-end-to-end-tests/staging-it/beamapp-jenkins-0721010029-322221.1626829229.322418/dataflow_python_sdk.tar
in 0 seconds.
INFO     apache_beam.runners.dataflow.internal.apiclient:apiclient.py:632 Starting
GCS upload to gs://temp-storage-for-end-to-end-tests/staging-it/beamapp-jenkins-0721010029-322221.1626829229.322418/dataflow-worker.jar...
INFO     apache_beam.runners.dataflow.internal.apiclient:apiclient.py:651 Completed
GCS upload to gs://temp-storage-for-end-to-end-tests/staging-it/beamapp-jenkins-0721010029-322221.1626829229.322418/dataflow-worker.jar
in 5 seconds.
INFO     apache_beam.runners.dataflow.internal.apiclient:apiclient.py:632 Starting
GCS upload to gs://temp-storage-for-end-to-end-tests/staging-it/beamapp-jenkins-0721010029-322221.1626829229.322418/pipeline.pb...
INFO     apache_beam.runners.dataflow.internal.apiclient:apiclient.py:651 Completed
GCS upload to gs://temp-storage-for-end-to-end-tests/staging-it/beamapp-jenkins-0721010029-322221.1626829229.322418/pipeline.pb
in 0 seconds.
WARNING  apache_beam.options.pipeline_options:pipeline_options.py:309 Discarding
unparseable args: ['--sleep_secs=20', '--kms_key_name=projects/apache-beam-testing/locations/global/keyRings/beam-it/cryptoKeys/test']
WARNING  apache_beam.options.pipeline_options:pipeline_options.py:309 Discarding
unparseable args: ['--sleep_secs=20', '--kms_key_name=projects/apache-beam-testing/locations/global/keyRings/beam-it/cryptoKeys/test']
- generated xml file: <https://ci-beam.apache.org/job/beam_PostCommit_Py_VR_Dataflow/ws/src/sdks/python/pytest_validatesRunnerStreamingTests-df-py36-xdist.xml>
-
============== 1 failed, 28 passed, 3 skipped in 2469.01 seconds ===============

> Task :sdks:python:test-suites:dataflow:py36:validatesRunnerStreamingTests FAILED

> Task :sdks:python:test-suites:dataflow:py38:validatesRunnerStreamingTests


=============================== warnings summary ===============================
<https://ci-beam.apache.org/job/beam_PostCommit_Py_VR_Dataflow/ws/src/build/gradleenv/-1734967051/lib/python3.8/site-packages/tenacity/_asyncio.py>:42
<https://ci-beam.apache.org/job/beam_PostCommit_Py_VR_Dataflow/ws/src/build/gradleenv/-1734967051/lib/python3.8/site-packages/tenacity/_asyncio.py>:42
<https://ci-beam.apache.org/job/beam_PostCommit_Py_VR_Dataflow/ws/src/build/gradleenv/-1734967051/lib/python3.8/site-packages/tenacity/_asyncio.py>:42
<https://ci-beam.apache.org/job/beam_PostCommit_Py_VR_Dataflow/ws/src/build/gradleenv/-1734967051/lib/python3.8/site-packages/tenacity/_asyncio.py>:42
<https://ci-beam.apache.org/job/beam_PostCommit_Py_VR_Dataflow/ws/src/build/gradleenv/-1734967051/lib/python3.8/site-packages/tenacity/_asyncio.py>:42
<https://ci-beam.apache.org/job/beam_PostCommit_Py_VR_Dataflow/ws/src/build/gradleenv/-1734967051/lib/python3.8/site-packages/tenacity/_asyncio.py>:42
<https://ci-beam.apache.org/job/beam_PostCommit_Py_VR_Dataflow/ws/src/build/gradleenv/-1734967051/lib/python3.8/site-packages/tenacity/_asyncio.py>:42
<https://ci-beam.apache.org/job/beam_PostCommit_Py_VR_Dataflow/ws/src/build/gradleenv/-1734967051/lib/python3.8/site-packages/tenacity/_asyncio.py>:42
  <https://ci-beam.apache.org/job/beam_PostCommit_Py_VR_Dataflow/ws/src/build/gradleenv/-1734967051/lib/python3.8/site-packages/tenacity/_asyncio.py>:42:
DeprecationWarning: "@coroutine" decorator is deprecated since Python 3.8, use "async def"
instead
    def call(self, fn, *args, **kwargs):

-- Docs: https://docs.pytest.org/en/latest/warnings.html
- generated xml file: <https://ci-beam.apache.org/job/beam_PostCommit_Py_VR_Dataflow/ws/src/sdks/python/pytest_validatesRunnerStreamingTests-df-py38-xdist.xml>
-
============= 29 passed, 3 skipped, 8 warnings in 2460.00 seconds ==============
>>> RUNNING integration tests with pipeline options: --runner=TestDataflowRunner
--project=apache-beam-testing --region=us-central1 --staging_location=gs://temp-storage-for-end-to-end-tests/staging-it
--temp_location=gs://temp-storage-for-end-to-end-tests/temp-it --output=gs://temp-storage-for-end-to-end-tests/py-it-cloud/output
--sdk_location=<https://ci-beam.apache.org/job/beam_PostCommit_Py_VR_Dataflow/ws/src/sdks/python/build/apache-beam.tar.gz>
--requirements_file=postcommit_requirements.txt --num_workers=1 --sleep_secs=20 --streaming
--dataflow_worker_jar=<https://ci-beam.apache.org/job/beam_PostCommit_Py_VR_Dataflow/ws/src/runners/google-cloud-dataflow-java/worker/build/libs/beam-runners-google-cloud-dataflow-java-fn-api-worker-2.32.0-SNAPSHOT.jar>
--kms_key_name=projects/apache-beam-testing/locations/global/keyRings/beam-it/cryptoKeys/test
--dataflow_kms_key=projects/apache-beam-testing/locations/global/keyRings/beam-it/cryptoKeys/test
>>>   pytest options: --capture=no --timeout=4500 --color=yes --log-cli-level=INFO
>>>   collect markers: -m=it_validatesrunner and not no_sickbay_streaming and no_xdist
============================= test session starts ==============================
platform linux -- Python 3.8.5, pytest-4.6.11, py-1.10.0, pluggy-0.13.1
rootdir: <https://ci-beam.apache.org/job/beam_PostCommit_Py_VR_Dataflow/ws/src/sdks/python,>
inifile: pytest.ini
plugins: xdist-1.34.0, timeout-1.4.2, forked-1.3.0, requests-mock-1.9.3
timeout: 4500.0s
timeout method: signal
timeout func_only: False

----------------------------- live log collection ------------------------------
WARNING  root:avroio_test.py:56 python-snappy is not installed; some tests will be
skipped.
WARNING  root:tfrecordio_test.py:55 Tensorflow is not installed, so skipping some
tests.
WARNING  apache_beam.runners.interactive.interactive_environment:interactive_environment.py:180
Dependencies required for Interactive Beam PCollection visualization are not available, please
use: `pip install apache-beam[interactive]` to install necessary dependencies to enable all
data visualization features.
WARNING  apache_beam.runners.interactive.interactive_environment:interactive_environment.py:189
You cannot use Interactive Beam features when you are not in an interactive environment such
as a Jupyter notebook or ipython terminal.
WARNING  root:environments.py:371 Make sure that locally built Python SDK docker
image has Python 3.8 interpreter.
INFO     root:environments.py:380 Default Python SDK image for environment is apache/beam_python3.8_sdk:2.32.0.dev
collected 4968 items / 4967 deselected / 1 selected

apache_beam/runners/dataflow/dataflow_exercise_streaming_metrics_pipeline_test.py::ExerciseStreamingMetricsPipelineTest::test_streaming_pipeline_returns_expected_user_metrics_fnapi_it

> Task :sdks:python:test-suites:dataflow:py37:validatesRunnerStreamingTests
INFO     apache_beam.runners.dataflow.dataflow_runner:dataflow_runner.py:236 2021-07-21T01:20:00.945Z:
JOB_MESSAGE_DETAILED: Autoscaling: Raised the number of workers to 1 so that the pipeline
can catch up with its backlog and keep up with its input rate.
WARNING  apache_beam.runners.dataflow.dataflow_runner:dataflow_runner.py:250 Timing
out on waiting for job 2021-07-20_18_19_00-7500757770926058071 after 61 seconds

> Task :sdks:python:test-suites:dataflow:py38:validatesRunnerStreamingTests

-------------------------------- live log call ---------------------------------
INFO     apache_beam.runners.portability.stager:stager.py:644 Executing command:
['<https://ci-beam.apache.org/job/beam_PostCommit_Py_VR_Dataflow/ws/src/build/gradleenv/-1734967051/bin/python3.8',>
'-m', 'pip', 'download', '--dest', '/tmp/dataflow-requirements-cache', '-r', 'postcommit_requirements.txt',
'--exists-action', 'i', '--no-binary', ':all:']
INFO     apache_beam.runners.portability.stager:stager.py:300 Copying Beam SDK "<https://ci-beam.apache.org/job/beam_PostCommit_Py_VR_Dataflow/ws/src/sdks/python/build/apache-beam.tar.gz">
to staging location.
WARNING  root:environments.py:371 Make sure that locally built Python SDK docker
image has Python 3.8 interpreter.
INFO     root:environments.py:380 Default Python SDK image for environment is apache/beam_python3.8_sdk:2.32.0.dev
INFO     root:environments.py:295 Using provided Python SDK container image: gcr.io/cloud-dataflow/v1beta3/python38-fnapi:beam-master-20210702
INFO     root:environments.py:302 Python SDK container image set to "gcr.io/cloud-dataflow/v1beta3/python38-fnapi:beam-master-20210702"
for Docker environment
INFO     apache_beam.internal.gcp.auth:auth.py:106 Setting socket default timeout
to 60 seconds.
INFO     apache_beam.internal.gcp.auth:auth.py:108 socket default timeout is 60.0
seconds.
INFO     apache_beam.runners.dataflow.internal.apiclient:apiclient.py:632 Starting
GCS upload to gs://temp-storage-for-end-to-end-tests/staging-it/beamapp-jenkins-0721012006-482006.1626830406.482174/requirements.txt...
INFO     oauth2client.transport:transport.py:157 Attempting refresh to obtain initial
access_token
INFO     oauth2client.transport:transport.py:157 Attempting refresh to obtain initial
access_token
INFO     apache_beam.runners.dataflow.internal.apiclient:apiclient.py:648 Completed
GCS upload to gs://temp-storage-for-end-to-end-tests/staging-it/beamapp-jenkins-0721012006-482006.1626830406.482174/requirements.txt
in 0 seconds.
INFO     apache_beam.runners.dataflow.internal.apiclient:apiclient.py:632 Starting
GCS upload to gs://temp-storage-for-end-to-end-tests/staging-it/beamapp-jenkins-0721012006-482006.1626830406.482174/pickled_main_session...
INFO     apache_beam.runners.dataflow.internal.apiclient:apiclient.py:648 Completed
GCS upload to gs://temp-storage-for-end-to-end-tests/staging-it/beamapp-jenkins-0721012006-482006.1626830406.482174/pickled_main_session
in 0 seconds.
INFO     apache_beam.runners.dataflow.internal.apiclient:apiclient.py:632 Starting
GCS upload to gs://temp-storage-for-end-to-end-tests/staging-it/beamapp-jenkins-0721012006-482006.1626830406.482174/pbr-5.6.0.tar.gz...
INFO     apache_beam.runners.dataflow.internal.apiclient:apiclient.py:648 Completed
GCS upload to gs://temp-storage-for-end-to-end-tests/staging-it/beamapp-jenkins-0721012006-482006.1626830406.482174/pbr-5.6.0.tar.gz
in 0 seconds.
INFO     apache_beam.runners.dataflow.internal.apiclient:apiclient.py:632 Starting
GCS upload to gs://temp-storage-for-end-to-end-tests/staging-it/beamapp-jenkins-0721012006-482006.1626830406.482174/mock-2.0.0.tar.gz...
INFO     apache_beam.runners.dataflow.internal.apiclient:apiclient.py:648 Completed
GCS upload to gs://temp-storage-for-end-to-end-tests/staging-it/beamapp-jenkins-0721012006-482006.1626830406.482174/mock-2.0.0.tar.gz
in 0 seconds.
INFO     apache_beam.runners.dataflow.internal.apiclient:apiclient.py:632 Starting
GCS upload to gs://temp-storage-for-end-to-end-tests/staging-it/beamapp-jenkins-0721012006-482006.1626830406.482174/six-1.16.0.tar.gz...
INFO     apache_beam.runners.dataflow.internal.apiclient:apiclient.py:648 Completed
GCS upload to gs://temp-storage-for-end-to-end-tests/staging-it/beamapp-jenkins-0721012006-482006.1626830406.482174/six-1.16.0.tar.gz
in 0 seconds.
INFO     apache_beam.runners.dataflow.internal.apiclient:apiclient.py:632 Starting
GCS upload to gs://temp-storage-for-end-to-end-tests/staging-it/beamapp-jenkins-0721012006-482006.1626830406.482174/soupsieve-2.2.1.tar.gz...
INFO     apache_beam.runners.dataflow.internal.apiclient:apiclient.py:648 Completed
GCS upload to gs://temp-storage-for-end-to-end-tests/staging-it/beamapp-jenkins-0721012006-482006.1626830406.482174/soupsieve-2.2.1.tar.gz
in 0 seconds.
INFO     apache_beam.runners.dataflow.internal.apiclient:apiclient.py:632 Starting
GCS upload to gs://temp-storage-for-end-to-end-tests/staging-it/beamapp-jenkins-0721012006-482006.1626830406.482174/PyHamcrest-1.10.1.tar.gz...
INFO     apache_beam.runners.dataflow.internal.apiclient:apiclient.py:648 Completed
GCS upload to gs://temp-storage-for-end-to-end-tests/staging-it/beamapp-jenkins-0721012006-482006.1626830406.482174/PyHamcrest-1.10.1.tar.gz
in 0 seconds.
INFO     apache_beam.runners.dataflow.internal.apiclient:apiclient.py:632 Starting
GCS upload to gs://temp-storage-for-end-to-end-tests/staging-it/beamapp-jenkins-0721012006-482006.1626830406.482174/parameterized-0.7.5.tar.gz...
INFO     apache_beam.runners.dataflow.internal.apiclient:apiclient.py:648 Completed
GCS upload to gs://temp-storage-for-end-to-end-tests/staging-it/beamapp-jenkins-0721012006-482006.1626830406.482174/parameterized-0.7.5.tar.gz
in 0 seconds.
INFO     apache_beam.runners.dataflow.internal.apiclient:apiclient.py:632 Starting
GCS upload to gs://temp-storage-for-end-to-end-tests/staging-it/beamapp-jenkins-0721012006-482006.1626830406.482174/beautifulsoup4-4.9.3.tar.gz...
INFO     apache_beam.runners.dataflow.internal.apiclient:apiclient.py:648 Completed
GCS upload to gs://temp-storage-for-end-to-end-tests/staging-it/beamapp-jenkins-0721012006-482006.1626830406.482174/beautifulsoup4-4.9.3.tar.gz
in 0 seconds.
INFO     apache_beam.runners.dataflow.internal.apiclient:apiclient.py:632 Starting
GCS upload to gs://temp-storage-for-end-to-end-tests/staging-it/beamapp-jenkins-0721012006-482006.1626830406.482174/dataflow_python_sdk.tar...
INFO     apache_beam.runners.dataflow.internal.apiclient:apiclient.py:648 Completed
GCS upload to gs://temp-storage-for-end-to-end-tests/staging-it/beamapp-jenkins-0721012006-482006.1626830406.482174/dataflow_python_sdk.tar
in 0 seconds.
INFO     apache_beam.runners.dataflow.internal.apiclient:apiclient.py:632 Starting
GCS upload to gs://temp-storage-for-end-to-end-tests/staging-it/beamapp-jenkins-0721012006-482006.1626830406.482174/dataflow-worker.jar...
INFO     apache_beam.runners.dataflow.internal.apiclient:apiclient.py:648 Completed
GCS upload to gs://temp-storage-for-end-to-end-tests/staging-it/beamapp-jenkins-0721012006-482006.1626830406.482174/dataflow-worker.jar
in 5 seconds.
INFO     apache_beam.runners.dataflow.internal.apiclient:apiclient.py:632 Starting
GCS upload to gs://temp-storage-for-end-to-end-tests/staging-it/beamapp-jenkins-0721012006-482006.1626830406.482174/pipeline.pb...
INFO     apache_beam.runners.dataflow.internal.apiclient:apiclient.py:648 Completed
GCS upload to gs://temp-storage-for-end-to-end-tests/staging-it/beamapp-jenkins-0721012006-482006.1626830406.482174/pipeline.pb
in 0 seconds.
WARNING  apache_beam.options.pipeline_options:pipeline_options.py:309 Discarding
unparseable args: ['--sleep_secs=20', '--kms_key_name=projects/apache-beam-testing/locations/global/keyRings/beam-it/cryptoKeys/test']
WARNING  apache_beam.options.pipeline_options:pipeline_options.py:309 Discarding
unparseable args: ['--sleep_secs=20', '--kms_key_name=projects/apache-beam-testing/locations/global/keyRings/beam-it/cryptoKeys/test']
INFO     apache_beam.runners.dataflow.internal.apiclient:apiclient.py:798 Create
job: <Job
                                                                           createTime: '2021-07-21T01:20:14.407981Z'
                                                                           currentStateTime:
'1970-01-01T00:00:00Z'
                                                                           id: '2021-07-20_18_20_13-2916384679036244295'
                                                                           location: 'us-central1'
                                                                           name: 'beamapp-jenkins-0721012006-482006'
                                                                           projectId: 'apache-beam-testing'
                                                                           stageStates: []
                                                                           startTime: '2021-07-21T01:20:14.407981Z'
                                                                           steps: []
                                                                           tempFiles: []
                                                                           type: TypeValueValuesEnum(JOB_TYPE_STREAMING,
2)>
INFO     apache_beam.runners.dataflow.internal.apiclient:apiclient.py:800 Created
job with id: [2021-07-20_18_20_13-2916384679036244295]
INFO     apache_beam.runners.dataflow.internal.apiclient:apiclient.py:801 Submitted
job: 2021-07-20_18_20_13-2916384679036244295
INFO     apache_beam.runners.dataflow.internal.apiclient:apiclient.py:802 To access
the Dataflow monitoring console, please navigate to https://console.cloud.google.com/dataflow/jobs/us-central1/2021-07-20_18_20_13-2916384679036244295?project=apache-beam-testing
Worker logs: https://console.cloud.google.com/dataflow/jobs/us-central1/2021-07-20_18_20_13-2916384679036244295?project=apache-beam-testing
INFO     apache_beam.runners.dataflow.dataflow_runner:dataflow_runner.py:191 Job
2021-07-20_18_20_13-2916384679036244295 is in state JOB_STATE_RUNNING
INFO     apache_beam.runners.dataflow.dataflow_runner:dataflow_runner.py:236 2021-07-21T01:20:20.293Z:
JOB_MESSAGE_BASIC: Worker configuration: e2-standard-4 in us-central1-a.
INFO     apache_beam.runners.dataflow.dataflow_runner:dataflow_runner.py:236 2021-07-21T01:20:22.092Z:
JOB_MESSAGE_DETAILED: Expanding SplittableParDo operations into optimizable parts.
INFO     apache_beam.runners.dataflow.dataflow_runner:dataflow_runner.py:236 2021-07-21T01:20:22.147Z:
JOB_MESSAGE_DETAILED: Expanding CollectionToSingleton operations into optimizable parts.
INFO     apache_beam.runners.dataflow.dataflow_runner:dataflow_runner.py:236 2021-07-21T01:20:22.223Z:
JOB_MESSAGE_DETAILED: Expanding CoGroupByKey operations into optimizable parts.
INFO     apache_beam.runners.dataflow.dataflow_runner:dataflow_runner.py:236 2021-07-21T01:20:22.298Z:
JOB_MESSAGE_DETAILED: Expanding SplittableProcessKeyed operations into optimizable parts.
INFO     apache_beam.runners.dataflow.dataflow_runner:dataflow_runner.py:236 2021-07-21T01:20:22.360Z:
JOB_MESSAGE_DETAILED: Expanding GroupByKey operations into streaming Read/Write steps
INFO     apache_beam.runners.dataflow.dataflow_runner:dataflow_runner.py:236 2021-07-21T01:20:22.406Z:
JOB_MESSAGE_DEBUG: Annotating graph with Autotuner information.
INFO     apache_beam.runners.dataflow.dataflow_runner:dataflow_runner.py:236 2021-07-21T01:20:22.478Z:
JOB_MESSAGE_DETAILED: Fusing adjacent ParDo, Read, Write, and Flatten operations
INFO     apache_beam.runners.dataflow.dataflow_runner:dataflow_runner.py:236 2021-07-21T01:20:22.520Z:
JOB_MESSAGE_DETAILED: Fusing consumer generate_metrics into ReadFromPubSub/Read
INFO     apache_beam.runners.dataflow.dataflow_runner:dataflow_runner.py:236 2021-07-21T01:20:22.553Z:
JOB_MESSAGE_DETAILED: Fusing consumer dump_to_pub/ToProtobuf into generate_metrics
INFO     apache_beam.runners.dataflow.dataflow_runner:dataflow_runner.py:236 2021-07-21T01:20:22.633Z:
JOB_MESSAGE_DETAILED: Fusing consumer dump_to_pub/Write/NativeWrite into dump_to_pub/ToProtobuf
INFO     apache_beam.runners.dataflow.dataflow_runner:dataflow_runner.py:236 2021-07-21T01:20:22.704Z:
JOB_MESSAGE_DEBUG: Workflow config is missing a default resource spec.
INFO     apache_beam.runners.dataflow.dataflow_runner:dataflow_runner.py:236 2021-07-21T01:20:22.763Z:
JOB_MESSAGE_DEBUG: Adding StepResource setup and teardown to workflow graph.
INFO     apache_beam.runners.dataflow.dataflow_runner:dataflow_runner.py:236 2021-07-21T01:20:22.800Z:
JOB_MESSAGE_DEBUG: Adding workflow start and stop steps.
INFO     apache_beam.runners.dataflow.dataflow_runner:dataflow_runner.py:236 2021-07-21T01:20:22.841Z:
JOB_MESSAGE_DEBUG: Assigning stage ids.
INFO     apache_beam.runners.dataflow.dataflow_runner:dataflow_runner.py:236 2021-07-21T01:20:23.042Z:
JOB_MESSAGE_DEBUG: Executing wait step start17
INFO     apache_beam.runners.dataflow.dataflow_runner:dataflow_runner.py:236 2021-07-21T01:20:23.133Z:
JOB_MESSAGE_BASIC: Executing operation ReadFromPubSub/Read+generate_metrics+dump_to_pub/ToProtobuf+dump_to_pub/Write/NativeWrite
INFO     apache_beam.runners.dataflow.dataflow_runner:dataflow_runner.py:236 2021-07-21T01:20:23.190Z:
JOB_MESSAGE_DEBUG: Starting worker pool setup.
INFO     apache_beam.runners.dataflow.dataflow_runner:dataflow_runner.py:236 2021-07-21T01:20:23.234Z:
JOB_MESSAGE_BASIC: Starting 1 workers in us-central1-a...
INFO     apache_beam.runners.dataflow.dataflow_runner:dataflow_runner.py:236 2021-07-21T01:20:32.837Z:
JOB_MESSAGE_BASIC: Your project already contains 100 Dataflow-created metric descriptors,
so new user metrics of the form custom.googleapis.com/* will not be created. However, all
user metrics are also available in the metric dataflow.googleapis.com/job/user_counter. If
you rely on the custom metrics, you can delete old / unused metric descriptors. See https://developers.google.com/apis-explorer/#p/monitoring/v3/monitoring.projects.metricDescriptors.list
and https://developers.google.com/apis-explorer/#p/monitoring/v3/monitoring.projects.metricDescriptors.delete
INFO     apache_beam.runners.dataflow.dataflow_runner:dataflow_runner.py:236 2021-07-21T01:21:05.137Z:
JOB_MESSAGE_DETAILED: Autoscaling: Raised the number of workers to 1 so that the pipeline
can catch up with its backlog and keep up with its input rate.
WARNING  apache_beam.runners.dataflow.dataflow_runner:dataflow_runner.py:247 Timing
out on waiting for job 2021-07-20_18_20_13-2916384679036244295 after 60 seconds

> Task :sdks:python:test-suites:dataflow:py37:validatesRunnerStreamingTests
PASSED

- generated xml file: <https://ci-beam.apache.org/job/beam_PostCommit_Py_VR_Dataflow/ws/src/sdks/python/pytest_validatesRunnerStreamingTests-df-py37-noxdist.xml>
-
================= 1 passed, 4967 deselected in 562.07 seconds ==================

> Task :sdks:python:test-suites:dataflow:py38:validatesRunnerStreamingTests
PASSED

=============================== warnings summary ===============================
<https://ci-beam.apache.org/job/beam_PostCommit_Py_VR_Dataflow/ws/src/build/gradleenv/-1734967051/lib/python3.8/site-packages/tenacity/_asyncio.py>:42
  <https://ci-beam.apache.org/job/beam_PostCommit_Py_VR_Dataflow/ws/src/build/gradleenv/-1734967051/lib/python3.8/site-packages/tenacity/_asyncio.py>:42:
DeprecationWarning: "@coroutine" decorator is deprecated since Python 3.8, use "async def"
instead
    def call(self, fn, *args, **kwargs):

-- Docs: https://docs.pytest.org/en/latest/warnings.html
- generated xml file: <https://ci-beam.apache.org/job/beam_PostCommit_Py_VR_Dataflow/ws/src/sdks/python/pytest_validatesRunnerStreamingTests-df-py38-noxdist.xml>
-
=========== 1 passed, 4967 deselected, 1 warnings in 567.73 seconds ============

FAILURE: Build failed with an exception.

* Where:
Script '<https://ci-beam.apache.org/job/beam_PostCommit_Py_VR_Dataflow/ws/src/sdks/python/test-suites/dataflow/common.gradle'>
line: 189

* What went wrong:
Execution failed for task ':sdks:python:test-suites:dataflow:py36:validatesRunnerStreamingTests'.
> Process 'command 'sh'' finished with non-zero exit value 1

* Try:
Run with --stacktrace option to get the stack trace. Run with --info or --debug option to
get more log output. Run with --scan to get full insights.

* Get more help at https://help.gradle.org

Deprecated Gradle features were used in this build, making it incompatible with Gradle 7.0.
Use '--warning-mode all' to show the individual deprecation warnings.
See https://docs.gradle.org/6.8.3/userguide/command_line_interface.html#sec:command_line_warnings

BUILD FAILED in 1h 28m 49s
92 actionable tasks: 62 executed, 30 from cache

Publishing build scan...
https://gradle.com/s/oucspms7hwyfk

Build step 'Invoke Gradle script' changed build result to FAILURE
Build step 'Invoke Gradle script' marked build as failure

---------------------------------------------------------------------
To unsubscribe, e-mail: builds-unsubscribe@beam.apache.org
For additional commands, e-mail: builds-help@beam.apache.org


Mime
View raw message