beam-builds mailing list archives

Site index · List index
Message view « Date » · « Thread »
Top « Date » · « Thread »
From Apache Jenkins Server <jenk...@builds.apache.org>
Subject Build failed in Jenkins: beam_PostCommit_Go_VR_Flink #4983
Date Wed, 21 Jul 2021 06:12:29 GMT
See <https://ci-beam.apache.org/job/beam_PostCommit_Go_VR_Flink/4983/display/redirect?page=changes>

Changes:

[noreply] Update Container beam-master-20210720 (#15197)


------------------------------------------
[...truncated 3.80 MB...]
    key: "n6"
    value: <
      unique_name: "n6"
      coder_id: "c4"
      is_bounded: BOUNDED
      windowing_strategy_id: "w0"
    >
  >
  pcollections: <
    key: "n7"
    value: <
      unique_name: "n7"
      coder_id: "c3"
      is_bounded: BOUNDED
      windowing_strategy_id: "w0"
    >
  >
  pcollections: <
    key: "n7_keyede11_1"
    value: <
      unique_name: "n7_keyede11_1"
      coder_id: "c7"
      is_bounded: BOUNDED
      windowing_strategy_id: "w0"
    >
  >
  pcollections: <
    key: "n8"
    value: <
      unique_name: "n8"
      coder_id: "c0"
      is_bounded: BOUNDED
      windowing_strategy_id: "w0"
    >
  >
  pcollections: <
    key: "n9"
    value: <
      unique_name: "n9"
      coder_id: "c3"
      is_bounded: BOUNDED
      windowing_strategy_id: "w0"
    >
  >
  pcollections: <
    key: "n9_keyede11_2"
    value: <
      unique_name: "n9_keyede11_2"
      coder_id: "c7"
      is_bounded: BOUNDED
      windowing_strategy_id: "w0"
    >
  >
  windowing_strategies: <
    key: "w0"
    value: <
      window_fn: <
        urn: "beam:window_fn:global_windows:v1"
      >
      merge_status: NON_MERGING
      window_coder_id: "c1"
      trigger: <
        default: <
        >
      >
      accumulation_mode: DISCARDING
      output_time: END_OF_WINDOW
      closing_behavior: EMIT_IF_NONEMPTY
      OnTimeBehavior: FIRE_ALWAYS
      environment_id: "go"
    >
  >
  coders: <
    key: "c0"
    value: <
      spec: <
        urn: "beam:coder:bytes:v1"
      >
    >
  >
  coders: <
    key: "c1"
    value: <
      spec: <
        urn: "beam:coder:global_window:v1"
      >
    >
  >
  coders: <
    key: "c2"
    value: <
      spec: <
        urn: "beam:go:coder:custom:v1"
        payload: "Cgd2YXJpbnR6EgIIAhqFAQpxZ2l0aHViLmNvbS9hcGFjaGUvYmVhbS9zZGtzL2dvL3Rlc3QvdmVuZG9yL2dpdGh1Yi5jb20vYXBhY2hlL2JlYW0vc2Rrcy9nby9wa2cvYmVhbS9jb3JlL3J1bnRpbWUvY29kZXJ4LmVuY1ZhckludFoSEAgWIgQIGUAPKgYIFBICCAgikQEKcWdpdGh1Yi5jb20vYXBhY2hlL2JlYW0vc2Rrcy9nby90ZXN0L3ZlbmRvci9naXRodWIuY29tL2FwYWNoZS9iZWFtL3Nka3MvZ28vcGtnL2JlYW0vY29yZS9ydW50aW1lL2NvZGVyeC5kZWNWYXJJbnRaEhwIFiIECBlAAyIGCBQSAggIKgQIGUAPKgQIGUAB"
      >
    >
  >
  coders: <
    key: "c3"
    value: <
      spec: <
        urn: "beam:coder:length_prefix:v1"
      >
      component_coder_ids: "c2"
    >
  >
  coders: <
    key: "c4"
    value: <
      spec: <
        urn: "beam:coder:kv:v1"
      >
      component_coder_ids: "c3"
      component_coder_ids: "c3"
    >
  >
  coders: <
    key: "c5"
    value: <
      spec: <
        urn: "beam:coder:iterable:v1"
      >
      component_coder_ids: "c3"
    >
  >
  coders: <
    key: "c6"
    value: <
      spec: <
        urn: "beam:coder:kv:v1"
      >
      component_coder_ids: "c3"
      component_coder_ids: "c5"
    >
  >
  coders: <
    key: "c7"
    value: <
      spec: <
        urn: "beam:coder:kv:v1"
      >
      component_coder_ids: "c0"
      component_coder_ids: "c3"
    >
  >
  environments: <
    key: "go"
    value: <
      urn: "beam:env:docker:v1"
      payload: "\n\026apache/beam_go_sdk:dev"
      capabilities: "beam:protocol:progress_reporting:v0"
      capabilities: "beam:protocol:multi_core_bundle_processing:v1"
      capabilities: "beam:version:sdk_base:go"
      capabilities: "beam:coder:bytes:v1"
      capabilities: "beam:coder:bool:v1"
      capabilities: "beam:coder:varint:v1"
      capabilities: "beam:coder:double:v1"
      capabilities: "beam:coder:string_utf8:v1"
      capabilities: "beam:coder:length_prefix:v1"
      capabilities: "beam:coder:kv:v1"
      capabilities: "beam:coder:iterable:v1"
      capabilities: "beam:coder:state_backed_iterable:v1"
      capabilities: "beam:coder:windowed_value:v1"
      capabilities: "beam:coder:global_window:v1"
      capabilities: "beam:coder:interval_window:v1"
      dependencies: <
        type_urn: "beam:artifact:type:go_worker_binary:v1"
        role_urn: "beam:artifact:role:staging_to:v1"
        role_payload: "\n\006worker"
      >
    >
  >
>
root_transform_ids: "e1"
root_transform_ids: "e2"
root_transform_ids: "e3"
root_transform_ids: "e4"
root_transform_ids: "e5"
root_transform_ids: "e6"
root_transform_ids: "e7"
root_transform_ids: "s1"
2021/07/21 06:12:08 Prepared job with id: go-job-7-1626847928546187208_e4838ab8-c894-44ef-8964-1bb320dee1c4
and staging token: go-job-7-1626847928546187208_e4838ab8-c894-44ef-8964-1bb320dee1c4
2021/07/21 06:12:08 Cross-compiling <https://ci-beam.apache.org/job/beam_PostCommit_Go_VR_Flink/ws/temp_gopath/src/github.com/apache/beam/sdks/go/test/regression/pardo_test.go>
as /tmp/worker-7-1626847928549655977
2021/07/21 06:12:11 Staged binary artifact with token: 
2021/07/21 06:12:11 Submitted job: go0job0701626847928546187208-jenkins-0721061211-2fafd71_a3860bce-63f1-457a-9c85-ae235d353899
2021/07/21 06:12:11 Job state: STOPPED
2021/07/21 06:12:11 Job state: STARTING
2021/07/21 06:12:11 Job state: RUNNING
2021/07/21 06:12:19 Job state: DONE
2021/07/21 06:12:19 Failed to deduce Step from MonitoringInfo: urn:"beam:metric:element_count:v1"
type:"beam:metrics:sum_int64:v1" payload:"\x01" labels:{key:"PCOLLECTION" value:"n4"}
2021/07/21 06:12:19 Failed to deduce Step from MonitoringInfo: urn:"beam:metric:element_count:v1"
type:"beam:metrics:sum_int64:v1" payload:"\x01" labels:{key:"PCOLLECTION" value:"n8"}
2021/07/21 06:12:19 Failed to deduce Step from MonitoringInfo: urn:"beam:metric:element_count:v1"
type:"beam:metrics:sum_int64:v1" payload:"\x01" labels:{key:"PCOLLECTION" value:"n10"}
2021/07/21 06:12:19 Failed to deduce Step from MonitoringInfo: urn:"beam:metric:element_count:v1"
type:"beam:metrics:sum_int64:v1" payload:"\x01" labels:{key:"PCOLLECTION" value:"n14"}
2021/07/21 06:12:19 Failed to deduce Step from MonitoringInfo: urn:"beam:metric:element_count:v1"
type:"beam:metrics:sum_int64:v1" payload:"\x01" labels:{key:"PCOLLECTION" value:"n1"}
2021/07/21 06:12:19 Failed to deduce Step from MonitoringInfo: urn:"beam:metric:element_count:v1"
type:"beam:metrics:sum_int64:v1" payload:"\x01" labels:{key:"PCOLLECTION" value:"n4"}
2021/07/21 06:12:19 Failed to deduce Step from MonitoringInfo: urn:"beam:metric:element_count:v1"
type:"beam:metrics:sum_int64:v1" payload:"\x01" labels:{key:"PCOLLECTION" value:"n8"}
2021/07/21 06:12:19 Failed to deduce Step from MonitoringInfo: urn:"beam:metric:element_count:v1"
type:"beam:metrics:sum_int64:v1" payload:"\x01" labels:{key:"PCOLLECTION" value:"n10"}
2021/07/21 06:12:19 Failed to deduce Step from MonitoringInfo: urn:"beam:metric:element_count:v1"
type:"beam:metrics:sum_int64:v1" payload:"\x01" labels:{key:"PCOLLECTION" value:"n14"}
2021/07/21 06:12:19 Failed to deduce Step from MonitoringInfo: urn:"beam:metric:element_count:v1"
type:"beam:metrics:sum_int64:v1" payload:"\x01" labels:{key:"PCOLLECTION" value:"n1"}
--- PASS: TestEmitParDoAfterGBK (10.72s)
PASS
ok  	github.com/apache/beam/sdks/go/test/regression	155.858s

if [[ "$RUNNER" == "dataflow" ]]; then
  # Delete the container locally and remotely
  docker rmi $CONTAINER:$TAG || echo "Failed to remove container"
  gcloud --quiet container images delete $CONTAINER:$TAG || echo "Failed to delete container"

  if [[ -n "$TEST_EXPANSION_ADDR" || -n "$IO_EXPANSION_ADDR" ]]; then
    # Delete the java cross-language container locally and remotely
    docker rmi $JAVA_CONTAINER:$JAVA_TAG || echo "Failed to remove container"
    gcloud --quiet container images delete $JAVA_CONTAINER:$JAVA_TAG || echo "Failed to delete
container"
  fi

  # Clean up tempdir
  rm -rf $TMPDIR
fi

exit $TEST_EXIT_CODE
exit_background_processes

> Task :sdks:go:test:flinkValidatesRunner FAILED

FAILURE: Build failed with an exception.

* Where:
Build file '<https://ci-beam.apache.org/job/beam_PostCommit_Go_VR_Flink/ws/src/sdks/go/test/build.gradle'>
line: 92

* What went wrong:
Execution failed for task ':sdks:go:test:flinkValidatesRunner'.
> Process 'command 'sh'' finished with non-zero exit value 1

* Try:
Run with --stacktrace option to get the stack trace. Run with --info or --debug option to
get more log output. Run with --scan to get full insights.

* Get more help at https://help.gradle.org

Deprecated Gradle features were used in this build, making it incompatible with Gradle 7.0.
Use '--warning-mode all' to show the individual deprecation warnings.
See https://docs.gradle.org/6.8.3/userguide/command_line_interface.html#sec:command_line_warnings

BUILD FAILED in 12m 3s
142 actionable tasks: 98 executed, 42 from cache, 2 up-to-date

Publishing build scan...
https://gradle.com/s/gah7huhhwxs6q

Build step 'Invoke Gradle script' changed build result to FAILURE
Build step 'Invoke Gradle script' marked build as failure

---------------------------------------------------------------------
To unsubscribe, e-mail: builds-unsubscribe@beam.apache.org
For additional commands, e-mail: builds-help@beam.apache.org


Mime
View raw message