beam-builds mailing list archives

Site index · List index
Message view « Date » · « Thread »
Top « Date » · « Thread »
From Apache Jenkins Server <jenk...@builds.apache.org>
Subject Build failed in Jenkins: beam_PerformanceTests_InfluxDbIO_IT #576
Date Thu, 01 Jul 2021 00:17:56 GMT
See <https://ci-beam.apache.org/job/beam_PerformanceTests_InfluxDbIO_IT/576/display/redirect?page=changes>

Changes:

[noreply] Update README to mention modules and Go versions. (#15109)

[noreply] [BEAM-12548] Add EqualsList functionality to PAssert (#15110)


------------------------------------------
[...truncated 158.78 KB...]
Task ':sdks:java:io:influxdb:compileJava' is not up-to-date because:
  No history is available.
The input changes require a full rebuild for incremental task ':sdks:java:io:influxdb:compileJava'.
Full recompilation is required because no incremental change information is available. This
is usually caused by clean builds or changing compiler arguments.
Starting process 'Gradle Worker Daemon 1'. Working directory: /home/jenkins/.gradle/workers
Command: /usr/lib/jvm/java-8-openjdk-amd64/bin/java -Djava.security.manager=worker.org.gradle.process.internal.worker.child.BootstrapSecurityManager
-Xbootclasspath/p:/home/jenkins/.gradle/caches/modules-2/files-2.1/com.google.errorprone/javac/9+181-r4173-1/bdf4c0aa7d540ee1f7bf14d47447aea4bbf450c5/javac-9+181-r4173-1.jar
-Xbootclasspath/p:/home/jenkins/.gradle/caches/modules-2/files-2.1/com.google.errorprone/javac/9+181-r4173-1/bdf4c0aa7d540ee1f7bf14d47447aea4bbf450c5/javac-9+181-r4173-1.jar
-Xmx512m -Dfile.encoding=UTF-8 -Duser.country=US -Duser.language=en -Duser.variant -cp /home/jenkins/.gradle/caches/6.8.3/workerMain/gradle-worker.jar
worker.org.gradle.process.internal.worker.GradleWorkerMain 'Gradle Worker Daemon 1'
Successfully started process 'Gradle Worker Daemon 1'
Started Gradle worker daemon (0.531 secs) with fork options DaemonForkOptions{executable=/usr/lib/jvm/java-8-openjdk-amd64/bin/java,
minHeapSize=null, maxHeapSize=null, jvmArgs=[-Xbootclasspath/p:/home/jenkins/.gradle/caches/modules-2/files-2.1/com.google.errorprone/javac/9+181-r4173-1/bdf4c0aa7d540ee1f7bf14d47447aea4bbf450c5/javac-9+181-r4173-1.jar,
-Xbootclasspath/p:/home/jenkins/.gradle/caches/modules-2/files-2.1/com.google.errorprone/javac/9+181-r4173-1/bdf4c0aa7d540ee1f7bf14d47447aea4bbf450c5/javac-9+181-r4173-1.jar],
keepAliveMode=SESSION}.
Compiling with JDK Java compiler API.

> Task :runners:core-java:compileTestJava FROM-CACHE
Custom actions are attached to task ':runners:core-java:compileTestJava'.
Build cache key for task ':runners:core-java:compileTestJava' is e8f7f01009c9387d68a5b387cb58d421
Task ':runners:core-java:compileTestJava' is not up-to-date because:
  No history is available.
Loaded cache entry for task ':runners:core-java:compileTestJava' with cache key e8f7f01009c9387d68a5b387cb58d421
:runners:core-java:compileTestJava (Thread[Execution worker for ':' Thread 3,5,main]) completed.
Took 0.392 secs.
:runners:core-java:testClasses (Thread[Execution worker for ':' Thread 3,5,main]) started.

> Task :runners:core-java:testClasses UP-TO-DATE
Skipping task ':runners:core-java:testClasses' as it has no actions.
:runners:core-java:testClasses (Thread[Execution worker for ':' Thread 3,5,main]) completed.
Took 0.0 secs.
:runners:core-java:testJar (Thread[Execution worker for ':' Thread 3,5,main]) started.

> Task :runners:core-java:testJar
Caching disabled for task ':runners:core-java:testJar' because:
  Caching has not been enabled for the task
Task ':runners:core-java:testJar' is not up-to-date because:
  No history is available.
file or directory '<https://ci-beam.apache.org/job/beam_PerformanceTests_InfluxDbIO_IT/ws/src/runners/core-java/build/resources/test',>
not found
:runners:core-java:testJar (Thread[Execution worker for ':' Thread 3,5,main]) completed. Took
0.062 secs.

> Task :sdks:java:harness:shadowJar FROM-CACHE
Custom actions are attached to task ':sdks:java:harness:shadowJar'.
Build cache key for task ':sdks:java:harness:shadowJar' is d483a320fb461f0e246f24604e66017d
Task ':sdks:java:harness:shadowJar' is not up-to-date because:
  No history is available.
Loaded cache entry for task ':sdks:java:harness:shadowJar' with cache key d483a320fb461f0e246f24604e66017d
:sdks:java:harness:shadowJar (Thread[Execution worker for ':' Thread 6,5,main]) completed.
Took 1.473 secs.
:runners:java-fn-execution:compileJava (Thread[Execution worker for ':' Thread 6,5,main])
started.

> Task :runners:java-fn-execution:compileJava
Custom actions are attached to task ':runners:java-fn-execution:compileJava'.
Build cache key for task ':runners:java-fn-execution:compileJava' is 19dce353d241c594ae49874dafbc2909
Task ':runners:java-fn-execution:compileJava' is not up-to-date because:
  No history is available.
Loaded cache entry for task ':runners:java-fn-execution:compileJava' with cache key 19dce353d241c594ae49874dafbc2909

> Task :runners:java-fn-execution:compileJava FROM-CACHE
:runners:java-fn-execution:compileJava (Thread[Execution worker for ':' Thread 6,5,main])
completed. Took 3.926 secs.
:runners:java-fn-execution:classes (Thread[Execution worker for ':' Thread 6,5,main]) started.

> Task :runners:java-fn-execution:classes UP-TO-DATE
Skipping task ':runners:java-fn-execution:classes' as it has no actions.
:runners:java-fn-execution:classes (Thread[Execution worker for ':' Thread 6,5,main]) completed.
Took 0.0 secs.
:runners:java-fn-execution:jar (Thread[Execution worker for ':' Thread 6,5,main]) started.

> Task :runners:java-fn-execution:jar
Caching disabled for task ':runners:java-fn-execution:jar' because:
  Caching has not been enabled for the task
Task ':runners:java-fn-execution:jar' is not up-to-date because:
  No history is available.
file or directory '<https://ci-beam.apache.org/job/beam_PerformanceTests_InfluxDbIO_IT/ws/src/runners/java-fn-execution/build/resources/main',>
not found
:runners:java-fn-execution:jar (Thread[Execution worker for ':' Thread 6,5,main]) completed.
Took 0.075 secs.
:runners:direct-java:compileJava (Thread[Execution worker for ':' Thread 6,5,main]) started.

> Task :runners:direct-java:compileJava FROM-CACHE
Custom actions are attached to task ':runners:direct-java:compileJava'.
Build cache key for task ':runners:direct-java:compileJava' is 6dec744e66ff9fca2a841d4de9d093c7
Task ':runners:direct-java:compileJava' is not up-to-date because:
  No history is available.
Loaded cache entry for task ':runners:direct-java:compileJava' with cache key 6dec744e66ff9fca2a841d4de9d093c7
:runners:direct-java:compileJava (Thread[Execution worker for ':' Thread 6,5,main]) completed.
Took 0.114 secs.
:runners:direct-java:classes (Thread[Execution worker for ':' Thread 6,5,main]) started.

> Task :runners:direct-java:classes UP-TO-DATE
Skipping task ':runners:direct-java:classes' as it has no actions.
:runners:direct-java:classes (Thread[Execution worker for ':' Thread 6,5,main]) completed.
Took 0.0 secs.
:runners:direct-java:shadowJar (Thread[Execution worker for ':' Thread 6,5,main]) started.

> Task :runners:direct-java:shadowJar FROM-CACHE
Custom actions are attached to task ':runners:direct-java:shadowJar'.
Build cache key for task ':runners:direct-java:shadowJar' is 2ec72d195f83721e1ad6115642f03858
Task ':runners:direct-java:shadowJar' is not up-to-date because:
  No history is available.
Loaded cache entry for task ':runners:direct-java:shadowJar' with cache key 2ec72d195f83721e1ad6115642f03858
:runners:direct-java:shadowJar (Thread[Execution worker for ':' Thread 6,5,main]) completed.
Took 0.075 secs.
:runners:direct-java:compileTestJava (Thread[Execution worker for ':' Thread 6,5,main]) started.
This JVM does not support getting OS memory, so no OS memory status updates will be broadcast

> Task :runners:direct-java:compileTestJava
Custom actions are attached to task ':runners:direct-java:compileTestJava'.
Build cache key for task ':runners:direct-java:compileTestJava' is f2583109bacac5942999ac8c61fc3016
Task ':runners:direct-java:compileTestJava' is not up-to-date because:
  No history is available.
The input changes require a full rebuild for incremental task ':runners:direct-java:compileTestJava'.
Full recompilation is required because no incremental change information is available. This
is usually caused by clean builds or changing compiler arguments.
Starting process 'Gradle Worker Daemon 2'. Working directory: /home/jenkins/.gradle/workers
Command: /usr/lib/jvm/java-8-openjdk-amd64/bin/java -Djava.security.manager=worker.org.gradle.process.internal.worker.child.BootstrapSecurityManager
-Xbootclasspath/p:/home/jenkins/.gradle/caches/modules-2/files-2.1/com.google.errorprone/javac/9+181-r4173-1/bdf4c0aa7d540ee1f7bf14d47447aea4bbf450c5/javac-9+181-r4173-1.jar
-Xmx512m -Dfile.encoding=UTF-8 -Duser.country=US -Duser.language=en -Duser.variant -cp /home/jenkins/.gradle/caches/6.8.3/workerMain/gradle-worker.jar
worker.org.gradle.process.internal.worker.GradleWorkerMain 'Gradle Worker Daemon 2'
Successfully started process 'Gradle Worker Daemon 2'
Started Gradle worker daemon (0.473 secs) with fork options DaemonForkOptions{executable=/usr/lib/jvm/java-8-openjdk-amd64/bin/java,
minHeapSize=null, maxHeapSize=null, jvmArgs=[-Xbootclasspath/p:/home/jenkins/.gradle/caches/modules-2/files-2.1/com.google.errorprone/javac/9+181-r4173-1/bdf4c0aa7d540ee1f7bf14d47447aea4bbf450c5/javac-9+181-r4173-1.jar],
keepAliveMode=SESSION}.
Compiling with JDK Java compiler API.

> Task :sdks:java:io:influxdb:compileJava
Note: <https://ci-beam.apache.org/job/beam_PerformanceTests_InfluxDbIO_IT/ws/src/sdks/java/io/influxdb/src/main/java/org/apache/beam/sdk/io/influxdb/InfluxDbIO.java>
uses unchecked or unsafe operations.
Note: Recompile with -Xlint:unchecked for details.
Created classpath snapshot for incremental compilation in 2.102 secs. 1 duplicate classes
found in classpath (see all with --debug).
Stored cache entry for task ':sdks:java:io:influxdb:compileJava' with cache key 018d65fb9a06036d2e2c7114ea88acf4
:sdks:java:io:influxdb:compileJava (Thread[Execution worker for ':',5,main]) completed. Took
12.4 secs.
:sdks:java:io:influxdb:classes (Thread[Execution worker for ':' Thread 5,5,main]) started.

> Task :sdks:java:io:influxdb:classes
Skipping task ':sdks:java:io:influxdb:classes' as it has no actions.
:sdks:java:io:influxdb:classes (Thread[Execution worker for ':' Thread 5,5,main]) completed.
Took 0.0 secs.
:sdks:java:io:influxdb:compileTestJava (Thread[Execution worker for ':' Thread 5,5,main])
started.

> Task :sdks:java:io:influxdb:compileTestJava
Custom actions are attached to task ':sdks:java:io:influxdb:compileTestJava'.
Build cache key for task ':sdks:java:io:influxdb:compileTestJava' is c50eb6228c3fee82312d8fce6f65ac16
Task ':sdks:java:io:influxdb:compileTestJava' is not up-to-date because:
  No history is available.
The input changes require a full rebuild for incremental task ':sdks:java:io:influxdb:compileTestJava'.
Full recompilation is required because no incremental change information is available. This
is usually caused by clean builds or changing compiler arguments.
Compiling with JDK Java compiler API.
Note: <https://ci-beam.apache.org/job/beam_PerformanceTests_InfluxDbIO_IT/ws/src/sdks/java/io/influxdb/src/test/java/org/apache/beam/sdk/io/influxdb/InfluxDbIOTest.java>
uses unchecked or unsafe operations.
Note: Recompile with -Xlint:unchecked for details.
Created classpath snapshot for incremental compilation in 0.038 secs. 1 duplicate classes
found in classpath (see all with --debug).
Stored cache entry for task ':sdks:java:io:influxdb:compileTestJava' with cache key c50eb6228c3fee82312d8fce6f65ac16
:sdks:java:io:influxdb:compileTestJava (Thread[Execution worker for ':' Thread 5,5,main])
completed. Took 2.35 secs.
:sdks:java:io:influxdb:testClasses (Thread[Execution worker for ':' Thread 5,5,main]) started.

> Task :sdks:java:io:influxdb:testClasses
Skipping task ':sdks:java:io:influxdb:testClasses' as it has no actions.
:sdks:java:io:influxdb:testClasses (Thread[Execution worker for ':' Thread 5,5,main]) completed.
Took 0.0 secs.

> Task :runners:direct-java:compileTestJava
Note: Some input files use or override a deprecated API.
Note: Recompile with -Xlint:deprecation for details.
Note: Some input files use unchecked or unsafe operations.
Note: Recompile with -Xlint:unchecked for details.
Created classpath snapshot for incremental compilation in 1.095 secs. 910 duplicate classes
found in classpath (see all with --debug).
Stored cache entry for task ':runners:direct-java:compileTestJava' with cache key f2583109bacac5942999ac8c61fc3016
:runners:direct-java:compileTestJava (Thread[Execution worker for ':' Thread 6,5,main]) completed.
Took 11.797 secs.
:runners:direct-java:testClasses (Thread[Execution worker for ':' Thread 6,5,main]) started.

> Task :runners:direct-java:testClasses
Skipping task ':runners:direct-java:testClasses' as it has no actions.
:runners:direct-java:testClasses (Thread[Execution worker for ':' Thread 6,5,main]) completed.
Took 0.0 secs.
:runners:direct-java:shadowTestJar (Thread[Execution worker for ':' Thread 6,5,main]) started.

> Task :runners:direct-java:shadowTestJar
Build cache key for task ':runners:direct-java:shadowTestJar' is 756083c461b352a3e35ce7a6e796ef21
Task ':runners:direct-java:shadowTestJar' is not up-to-date because:
  No history is available.
file or directory '<https://ci-beam.apache.org/job/beam_PerformanceTests_InfluxDbIO_IT/ws/src/runners/direct-java/build/resources/test',>
not found
*******************
GRADLE SHADOW STATS

Total Jars: 7 (includes project)
Total Time: 1.159s [1159ms]
Average Time/Jar: 0.1655714285714s [165.5714285714ms]
*******************
Stored cache entry for task ':runners:direct-java:shadowTestJar' with cache key 756083c461b352a3e35ce7a6e796ef21
:runners:direct-java:shadowTestJar (Thread[Execution worker for ':' Thread 6,5,main]) completed.
Took 2.113 secs.
:sdks:java:io:influxdb:integrationTest (Thread[Execution worker for ':' Thread 6,5,main])
started.
Gradle Test Executor 3 started executing tests.

> Task :sdks:java:io:influxdb:integrationTest
Custom actions are attached to task ':sdks:java:io:influxdb:integrationTest'.
Build cache key for task ':sdks:java:io:influxdb:integrationTest' is 3fd51f85691ac4aede04d2bf0785aa83
Task ':sdks:java:io:influxdb:integrationTest' is not up-to-date because:
  Task.upToDateWhen is false.
Starting process 'Gradle Test Executor 3'. Working directory: <https://ci-beam.apache.org/job/beam_PerformanceTests_InfluxDbIO_IT/ws/src/sdks/java/io/influxdb>
Command: /usr/lib/jvm/java-8-openjdk-amd64/bin/java -DbeamTestPipelineOptions=["--influxDBURL=http://35.239.138.89:8086","--influxDBUserName=superadmin","--influxDBPassword=supersecretpassword","--databaseName=db1"]
-Djava.security.manager=worker.org.gradle.process.internal.worker.child.BootstrapSecurityManager
-Dorg.gradle.native=false -Xmx2g -Dfile.encoding=UTF-8 -Duser.country=US -Duser.language=en
-Duser.variant -ea -cp /home/jenkins/.gradle/caches/6.8.3/workerMain/gradle-worker.jar worker.org.gradle.process.internal.worker.GradleWorkerMain
'Gradle Test Executor 3'
Successfully started process 'Gradle Test Executor 3'

org.apache.beam.sdk.io.influxdb.InfluxDbIOIT STANDARD_ERROR
    SLF4J: Failed to load class "org.slf4j.impl.StaticLoggerBinder".
    SLF4J: Defaulting to no-operation (NOP) logger implementation
    SLF4J: See http://www.slf4j.org/codes.html#StaticLoggerBinder for further details.

org.apache.beam.sdk.io.influxdb.InfluxDbIOIT > testWriteAndReadWithMultipleMetric FAILED
    java.lang.AssertionError: Count All/Flatten.PCollections.out: 
    Expected: <4000L>
         but: was <3999L>
        at org.apache.beam.sdk.testing.PAssert$PAssertionSite.capture(PAssert.java:175)
        at org.apache.beam.sdk.testing.PAssert.thatSingleton(PAssert.java:455)
        at org.apache.beam.sdk.testing.PAssert.thatSingleton(PAssert.java:447)
        at org.apache.beam.sdk.io.influxdb.InfluxDbIOIT.testWriteAndReadWithMultipleMetric(InfluxDbIOIT.java:246)

        Caused by:
        java.lang.AssertionError: 
        Expected: <4000L>
             but: was <3999L>
            at org.hamcrest.MatcherAssert.assertThat(MatcherAssert.java:18)
            at org.hamcrest.MatcherAssert.assertThat(MatcherAssert.java:6)
            at org.apache.beam.sdk.testing.PAssert$AssertIsEqualTo.apply(PAssert.java:1570)
            at org.apache.beam.sdk.testing.PAssert$AssertIsEqualTo.apply(PAssert.java:1561)
            at org.apache.beam.sdk.testing.PAssert$CheckRelationAgainstExpected.apply(PAssert.java:1226)
            at org.apache.beam.sdk.testing.PAssert$CheckRelationAgainstExpected.apply(PAssert.java:1206)
            at org.apache.beam.sdk.testing.PAssert.doChecks(PAssert.java:1548)
            at org.apache.beam.sdk.testing.PAssert$SingletonCheckerDoFn.processElement(PAssert.java:1541)
            at org.apache.beam.sdk.testing.PAssert$SingletonCheckerDoFn$DoFnInvoker.invokeProcessElement(Unknown
Source)
            at org.apache.beam.repackaged.direct_java.runners.core.SimpleDoFnRunner.invokeProcessElement(SimpleDoFnRunner.java:232)
            at org.apache.beam.repackaged.direct_java.runners.core.SimpleDoFnRunner.processElement(SimpleDoFnRunner.java:191)
            at org.apache.beam.repackaged.direct_java.runners.core.SimplePushbackSideInputDoFnRunner.processElementInReadyWindows(SimplePushbackSideInputDoFnRunner.java:79)
            at org.apache.beam.runners.direct.ParDoEvaluator.processElement(ParDoEvaluator.java:244)
            at org.apache.beam.runners.direct.DoFnLifecycleManagerRemovingTransformEvaluator.processElement(DoFnLifecycleManagerRemovingTransformEvaluator.java:54)
            at org.apache.beam.runners.direct.DirectTransformExecutor.processElements(DirectTransformExecutor.java:165)
            at org.apache.beam.runners.direct.DirectTransformExecutor.run(DirectTransformExecutor.java:129)
            at java.util.concurrent.Executors$RunnableAdapter.call(Executors.java:511)
            at java.util.concurrent.FutureTask.run(FutureTask.java:266)
            at java.util.concurrent.ThreadPoolExecutor.runWorker(ThreadPoolExecutor.java:1149)
            at java.util.concurrent.ThreadPoolExecutor$Worker.run(ThreadPoolExecutor.java:624)
            at java.lang.Thread.run(Thread.java:748)

Gradle Test Executor 3 finished executing tests.

> Task :sdks:java:io:influxdb:integrationTest

6 tests completed, 1 failed
Finished generating test XML results (0.019 secs) into: <https://ci-beam.apache.org/job/beam_PerformanceTests_InfluxDbIO_IT/ws/src/sdks/java/io/influxdb/build/test-results/integrationTest>
Generating HTML test report...
Finished generating test html results (0.025 secs) into: <https://ci-beam.apache.org/job/beam_PerformanceTests_InfluxDbIO_IT/ws/src/sdks/java/io/influxdb/build/reports/tests/integrationTest>

> Task :sdks:java:io:influxdb:integrationTest FAILED
:sdks:java:io:influxdb:integrationTest (Thread[Execution worker for ':' Thread 6,5,main])
completed. Took 8.736 secs.

FAILURE: Build failed with an exception.

* What went wrong:
Execution failed for task ':sdks:java:io:influxdb:integrationTest'.
> There were failing tests. See the report at: file://<https://ci-beam.apache.org/job/beam_PerformanceTests_InfluxDbIO_IT/ws/src/sdks/java/io/influxdb/build/reports/tests/integrationTest/index.html>

* Try:
Run with --stacktrace option to get the stack trace. Run with --debug option to get more log
output. Run with --scan to get full insights.

* Get more help at https://help.gradle.org

Deprecated Gradle features were used in this build, making it incompatible with Gradle 7.0.
Use '--warning-mode all' to show the individual deprecation warnings.
See https://docs.gradle.org/6.8.3/userguide/command_line_interface.html#sec:command_line_warnings

BUILD FAILED in 49s
68 actionable tasks: 42 executed, 26 from cache

Publishing build scan...
https://gradle.com/s/gdpyiem6vdtoe

Stopped 2 worker daemon(s).
Build step 'Invoke Gradle script' changed build result to FAILURE
Build step 'Invoke Gradle script' marked build as failure

---------------------------------------------------------------------
To unsubscribe, e-mail: builds-unsubscribe@beam.apache.org
For additional commands, e-mail: builds-help@beam.apache.org


Mime
View raw message