beam-builds mailing list archives

Site index · List index
Message view « Date » · « Thread »
Top « Date » · « Thread »
From Apache Jenkins Server <jenk...@builds.apache.org>
Subject Build failed in Jenkins: beam_PostCommit_Python_MongoDBIO_IT #4541
Date Thu, 01 Jul 2021 06:00:56 GMT
See <https://ci-beam.apache.org/job/beam_PostCommit_Python_MongoDBIO_IT/4541/display/redirect>

Changes:


------------------------------------------
Started by timer
Running as SYSTEM
[EnvInject] - Loading node environment variables.
Building remotely on apache-beam-jenkins-15 (beam) in workspace <https://ci-beam.apache.org/job/beam_PostCommit_Python_MongoDBIO_IT/ws/>
The recommended git tool is: NONE
No credentials specified
Wiping out workspace first.
Cloning the remote Git repository
Cloning repository https://github.com/apache/beam.git
 > git init <https://ci-beam.apache.org/job/beam_PostCommit_Python_MongoDBIO_IT/ws/src>
# timeout=10
Fetching upstream changes from https://github.com/apache/beam.git
 > git --version # timeout=10
 > git --version # 'git version 2.7.4'
 > git fetch --tags --progress https://github.com/apache/beam.git +refs/heads/*:refs/remotes/origin/*
# timeout=10
 > git config remote.origin.url https://github.com/apache/beam.git # timeout=10
 > git config --add remote.origin.fetch +refs/heads/*:refs/remotes/origin/* # timeout=10
 > git config remote.origin.url https://github.com/apache/beam.git # timeout=10
Fetching upstream changes from https://github.com/apache/beam.git
 > git fetch --tags --progress https://github.com/apache/beam.git +refs/heads/*:refs/remotes/origin/*
+refs/pull/${ghprbPullId}/*:refs/remotes/origin/pr/${ghprbPullId}/* # timeout=10
 > git rev-parse origin/master^{commit} # timeout=10
Checking out Revision 7b30339a64949bcb7c1bc11305b8c9ab49e12942 (origin/master)
 > git config core.sparsecheckout # timeout=10
 > git checkout -f 7b30339a64949bcb7c1bc11305b8c9ab49e12942 # timeout=10
Commit message: "[BEAM-12548] Add EqualsList functionality to PAssert (#15110)"
 > git rev-list --no-walk 7b30339a64949bcb7c1bc11305b8c9ab49e12942 # timeout=10
No emails were triggered.
[EnvInject] - Executing scripts and injecting environment variables after the SCM step.
[EnvInject] - Injecting as environment variables the properties content 
SPARK_LOCAL_IP=127.0.0.1
SETUPTOOLS_USE_DISTUTILS=stdlib

[EnvInject] - Variables injected successfully.
[Gradle] - Launching build.
[src] $ <https://ci-beam.apache.org/job/beam_PostCommit_Python_MongoDBIO_IT/ws/src/gradlew>
--continue --max-workers=12 -Dorg.gradle.jvmargs=-Xms2g -Dorg.gradle.jvmargs=-Xmx4g -Dorg.gradle.vfs.watch=false
-Pdocker-pull-licenses :sdks:python:test-suites:direct:mongodbioIT
Starting a Gradle Daemon (subsequent builds will be faster)
> Task :buildSrc:compileJava NO-SOURCE
> Task :buildSrc:compileGroovy FROM-CACHE
> Task :buildSrc:pluginDescriptors
> Task :buildSrc:processResources
> Task :buildSrc:classes
> Task :buildSrc:jar
> Task :buildSrc:assemble
> Task :buildSrc:spotlessGroovy FROM-CACHE
> Task :buildSrc:spotlessGroovyCheck UP-TO-DATE
> Task :buildSrc:spotlessGroovyGradle FROM-CACHE
> Task :buildSrc:spotlessGroovyGradleCheck UP-TO-DATE
> Task :buildSrc:spotlessCheck UP-TO-DATE
> Task :buildSrc:pluginUnderTestMetadata
> Task :buildSrc:compileTestJava NO-SOURCE
> Task :buildSrc:compileTestGroovy NO-SOURCE
> Task :buildSrc:processTestResources NO-SOURCE
> Task :buildSrc:testClasses UP-TO-DATE
> Task :buildSrc:test NO-SOURCE
> Task :buildSrc:validatePlugins FROM-CACHE
> Task :buildSrc:check UP-TO-DATE
> Task :buildSrc:build
Configuration on demand is an incubating feature.

> Task :sdks:python:test-suites:direct:py36:setupVirtualenv
Using base prefix '/usr'
New python executable in <https://ci-beam.apache.org/job/beam_PostCommit_Python_MongoDBIO_IT/ws/src/build/gradleenv/1398941890/bin/python3.6>
Also creating executable in <https://ci-beam.apache.org/job/beam_PostCommit_Python_MongoDBIO_IT/ws/src/build/gradleenv/1398941890/bin/python>
Installing setuptools, pip, wheel...
done.
Running virtualenv with interpreter /usr/bin/python3.6
Collecting tox==3.20.1
  Using cached tox-3.20.1-py2.py3-none-any.whl (83 kB)
Collecting grpcio-tools==1.37.0
  Using cached grpcio_tools-1.37.0-cp36-cp36m-manylinux2014_x86_64.whl (2.5 MB)
Collecting future==0.18.2
  Using cached future-0.18.2-py3-none-any.whl
Collecting mypy-protobuf==1.18
  Using cached mypy_protobuf-1.18-py3-none-any.whl (7.3 kB)
Collecting distlib==0.3.1
  Using cached distlib-0.3.1-py2.py3-none-any.whl (335 kB)
Collecting six>=1.14.0
  Using cached six-1.16.0-py2.py3-none-any.whl (11 kB)
Collecting packaging>=14
  Using cached packaging-20.9-py2.py3-none-any.whl (40 kB)
Collecting filelock>=3.0.0
  Using cached filelock-3.0.12-py3-none-any.whl (7.6 kB)
Collecting importlib-metadata<3,>=0.12
  Using cached importlib_metadata-2.1.1-py2.py3-none-any.whl (10 kB)
Collecting py>=1.4.17
  Using cached py-1.10.0-py2.py3-none-any.whl (97 kB)
Collecting virtualenv!=20.0.0,!=20.0.1,!=20.0.2,!=20.0.3,!=20.0.4,!=20.0.5,!=20.0.6,!=20.0.7,>=16.0.0
  Using cached virtualenv-20.4.7-py2.py3-none-any.whl (7.2 MB)
Collecting toml>=0.9.4
  Using cached toml-0.10.2-py2.py3-none-any.whl (16 kB)
Collecting pluggy>=0.12.0
  Using cached pluggy-0.13.1-py2.py3-none-any.whl (18 kB)
Requirement already satisfied: setuptools in <https://ci-beam.apache.org/job/beam_PostCommit_Python_MongoDBIO_IT/ws/src/build/gradleenv/1398941890/lib/python3.6/site-packages>
(from grpcio-tools==1.37.0->-r <https://ci-beam.apache.org/job/beam_PostCommit_Python_MongoDBIO_IT/ws/src/sdks/python/build-requirements.txt>
(line 17)) (57.0.0)
Collecting protobuf<4.0dev,>=3.5.0.post1
  Using cached protobuf-3.17.3-cp36-cp36m-manylinux_2_5_x86_64.manylinux1_x86_64.whl (1.0
MB)
Collecting grpcio>=1.37.0
  Using cached grpcio-1.38.1-cp36-cp36m-manylinux2014_x86_64.whl (4.2 MB)
Collecting zipp>=0.5
  Using cached zipp-3.4.1-py3-none-any.whl (5.2 kB)
Collecting pyparsing>=2.0.2
  Using cached pyparsing-2.4.7-py2.py3-none-any.whl (67 kB)
Collecting importlib-resources>=1.0
  Using cached importlib_resources-5.2.0-py3-none-any.whl (27 kB)
Collecting appdirs<2,>=1.4.3
  Using cached appdirs-1.4.4-py2.py3-none-any.whl (9.6 kB)
Installing collected packages: zipp, six, pyparsing, importlib-resources, importlib-metadata,
filelock, distlib, appdirs, virtualenv, toml, py, protobuf, pluggy, packaging, grpcio, tox,
mypy-protobuf, grpcio-tools, future
ERROR: Could not install packages due to an OSError: [Errno 28] No space left on device


> Task :sdks:python:test-suites:direct:py36:setupVirtualenv FAILED

FAILURE: Build failed with an exception.

* What went wrong:
Execution failed for task ':sdks:python:test-suites:direct:py36:setupVirtualenv'.
> Process 'command 'sh'' finished with non-zero exit value 1

* Try:
Run with --stacktrace option to get the stack trace. Run with --info or --debug option to
get more log output. Run with --scan to get full insights.

* Get more help at https://help.gradle.org

Deprecated Gradle features were used in this build, making it incompatible with Gradle 7.0.
Use '--warning-mode all' to show the individual deprecation warnings.
See https://docs.gradle.org/6.8.3/userguide/command_line_interface.html#sec:command_line_warnings

BUILD FAILED in 32s
1 actionable task: 1 executed

A build scan cannot be produced as an error occurred spooling the build data.
Please report this problem via https://gradle.com/help/plugin and include the following via
copy/paste:

----------
Gradle version: 6.8.3
Plugin version: 3.4.1

java.lang.IllegalStateException: Could not close the event spooler due to previous errors.
	at com.gradle.scan.plugin.internal.f.c.c.a(SourceFile:128)
	at com.gradle.scan.plugin.internal.q.a$a.a(SourceFile:31)
	at com.gradle.scan.plugin.internal.q.a$a.a(SourceFile:20)
	at com.gradle.scan.plugin.internal.q.a.c(SourceFile:67)
----------

Build step 'Invoke Gradle script' changed build result to FAILURE
Build step 'Invoke Gradle script' marked build as failure

---------------------------------------------------------------------
To unsubscribe, e-mail: builds-unsubscribe@beam.apache.org
For additional commands, e-mail: builds-help@beam.apache.org


Mime
View raw message