beam-builds mailing list archives

Site index · List index
Message view « Date » · « Thread »
Top « Date » · « Thread »
From Apache Jenkins Server <jenk...@builds.apache.org>
Subject Build failed in Jenkins: beam_BiqQueryIO_Streaming_Performance_Test_Java #2514
Date Thu, 01 Jul 2021 00:33:44 GMT
See <https://ci-beam.apache.org/job/beam_BiqQueryIO_Streaming_Performance_Test_Java/2514/display/redirect?page=changes>

Changes:

[noreply] [BEAM-12548] Add EqualsList functionality to PAssert (#15110)


------------------------------------------
[...truncated 200.15 KB...]
:sdks:java:core:compileTestJava (Thread[Execution **** for ':' Thread 10,5,main]) started.

> Task :runners:core-construction-java:compileJava FROM-CACHE
Custom actions are attached to task ':runners:core-construction-java:compileJava'.
Build cache key for task ':runners:core-construction-java:compileJava' is a7c218d08e12bddb307e73a3809c12e9
Task ':runners:core-construction-java:compileJava' is not up-to-date because:
  No history is available.
Loaded cache entry for task ':runners:core-construction-java:compileJava' with cache key a7c218d08e12bddb307e73a3809c12e9
:runners:core-construction-java:compileJava (Thread[Execution **** for ':' Thread 9,5,main])
completed. Took 0.102 secs.
:runners:core-construction-java:classes (Thread[Execution **** for ':' Thread 9,5,main]) started.

> Task :runners:core-construction-java:classes UP-TO-DATE
Skipping task ':runners:core-construction-java:classes' as it has no actions.
:runners:core-construction-java:classes (Thread[Execution **** for ':' Thread 9,5,main]) completed.
Took 0.0 secs.
:runners:core-construction-java:jar (Thread[Execution **** for ':' Thread 9,5,main]) started.

> Task :runners:core-construction-java:jar
Caching disabled for task ':runners:core-construction-java:jar' because:
  Caching has not been enabled for the task
Task ':runners:core-construction-java:jar' is not up-to-date because:
  No history is available.
file or directory '<https://ci-beam.apache.org/job/beam_BiqQueryIO_Streaming_Performance_Test_Java/ws/src/runners/core-construction-java/build/resources/main',>
not found
:runners:core-construction-java:jar (Thread[Execution **** for ':' Thread 9,5,main]) completed.
Took 0.081 secs.
:runners:core-java:compileJava (Thread[Execution **** for ':' Thread 9,5,main]) started.

> Task :runners:core-java:compileJava FROM-CACHE
Custom actions are attached to task ':runners:core-java:compileJava'.
Build cache key for task ':runners:core-java:compileJava' is 67d546383b3ad1e824c8d2d2420dcc4b
Task ':runners:core-java:compileJava' is not up-to-date because:
  No history is available.
Loaded cache entry for task ':runners:core-java:compileJava' with cache key 67d546383b3ad1e824c8d2d2420dcc4b
:runners:core-java:compileJava (Thread[Execution **** for ':' Thread 9,5,main]) completed.
Took 0.135 secs.
:runners:core-java:classes (Thread[Execution **** for ':' Thread 9,5,main]) started.

> Task :runners:core-java:classes UP-TO-DATE
Skipping task ':runners:core-java:classes' as it has no actions.
:runners:core-java:classes (Thread[Execution **** for ':' Thread 9,5,main]) completed. Took
0.0 secs.
:runners:core-java:jar (Thread[Execution **** for ':' Thread 9,5,main]) started.

> Task :runners:core-java:jar
Caching disabled for task ':runners:core-java:jar' because:
  Caching has not been enabled for the task
Task ':runners:core-java:jar' is not up-to-date because:
  No history is available.
file or directory '<https://ci-beam.apache.org/job/beam_BiqQueryIO_Streaming_Performance_Test_Java/ws/src/runners/core-java/build/resources/main',>
not found
:runners:core-java:jar (Thread[Execution **** for ':' Thread 9,5,main]) completed. Took 0.075
secs.
:sdks:java:extensions:google-cloud-platform-core:compileJava (Thread[Execution **** for ':'
Thread 9,5,main]) started.

> Task :sdks:java:extensions:google-cloud-platform-core:compileJava FROM-CACHE
Custom actions are attached to task ':sdks:java:extensions:google-cloud-platform-core:compileJava'.
Build cache key for task ':sdks:java:extensions:google-cloud-platform-core:compileJava' is
f26fe197245af8cd4919a0a60abed970
Task ':sdks:java:extensions:google-cloud-platform-core:compileJava' is not up-to-date because:
  No history is available.
Loaded cache entry for task ':sdks:java:extensions:google-cloud-platform-core:compileJava'
with cache key f26fe197245af8cd4919a0a60abed970
:sdks:java:extensions:google-cloud-platform-core:compileJava (Thread[Execution **** for ':'
Thread 9,5,main]) completed. Took 0.086 secs.
:sdks:java:extensions:google-cloud-platform-core:classes (Thread[Execution **** for ':' Thread
9,5,main]) started.

> Task :sdks:java:extensions:google-cloud-platform-core:classes UP-TO-DATE
Skipping task ':sdks:java:extensions:google-cloud-platform-core:classes' as it has no actions.
:sdks:java:extensions:google-cloud-platform-core:classes (Thread[Execution **** for ':' Thread
9,5,main]) completed. Took 0.0 secs.
:sdks:java:extensions:google-cloud-platform-core:jar (Thread[Execution **** for ':' Thread
9,5,main]) started.

> Task :sdks:java:extensions:google-cloud-platform-core:jar
Caching disabled for task ':sdks:java:extensions:google-cloud-platform-core:jar' because:
  Caching has not been enabled for the task
Task ':sdks:java:extensions:google-cloud-platform-core:jar' is not up-to-date because:
  No history is available.
file or directory '<https://ci-beam.apache.org/job/beam_BiqQueryIO_Streaming_Performance_Test_Java/ws/src/sdks/java/extensions/google-cloud-platform-core/build/resources/main',>
not found
:sdks:java:extensions:google-cloud-platform-core:jar (Thread[Execution **** for ':' Thread
9,5,main]) completed. Took 0.024 secs.
:sdks:java:harness:compileJava (Thread[Execution **** for ':' Thread 9,5,main]) started.

> Task :sdks:java:harness:compileJava FROM-CACHE
Custom actions are attached to task ':sdks:java:harness:compileJava'.
Build cache key for task ':sdks:java:harness:compileJava' is c5be5aa6ad24aff5b3da0cc5e799670d
Task ':sdks:java:harness:compileJava' is not up-to-date because:
  No history is available.
Loaded cache entry for task ':sdks:java:harness:compileJava' with cache key c5be5aa6ad24aff5b3da0cc5e799670d
:sdks:java:harness:compileJava (Thread[Execution **** for ':' Thread 9,5,main]) completed.
Took 0.083 secs.
:sdks:java:harness:classes (Thread[Execution **** for ':' Thread 9,5,main]) started.

> Task :sdks:java:harness:classes UP-TO-DATE
Skipping task ':sdks:java:harness:classes' as it has no actions.
:sdks:java:harness:classes (Thread[Execution **** for ':' Thread 9,5,main]) completed. Took
0.0 secs.
:sdks:java:harness:jar (Thread[Execution **** for ':' Thread 9,5,main]) started.

> Task :sdks:java:harness:jar
Caching disabled for task ':sdks:java:harness:jar' because:
  Caching has not been enabled for the task
Task ':sdks:java:harness:jar' is not up-to-date because:
  No history is available.
file or directory '<https://ci-beam.apache.org/job/beam_BiqQueryIO_Streaming_Performance_Test_Java/ws/src/sdks/java/harness/build/resources/main',>
not found
:sdks:java:harness:jar (Thread[Execution **** for ':' Thread 9,5,main]) completed. Took 0.077
secs.
:sdks:java:harness:shadowJar (Thread[Execution **** for ':' Thread 9,5,main]) started.

> Task :sdks:java:core:compileTestJava FROM-CACHE
Custom actions are attached to task ':sdks:java:core:compileTestJava'.
Build cache key for task ':sdks:java:core:compileTestJava' is 26813e79020d269e22fa432b25b68578
Task ':sdks:java:core:compileTestJava' is not up-to-date because:
  No history is available.
Loaded cache entry for task ':sdks:java:core:compileTestJava' with cache key 26813e79020d269e22fa432b25b68578
:sdks:java:core:compileTestJava (Thread[Execution **** for ':' Thread 10,5,main]) completed.
Took 0.95 secs.
:sdks:java:core:testClasses (Thread[Execution **** for ':' Thread 10,5,main]) started.

> Task :sdks:java:core:testClasses
Skipping task ':sdks:java:core:testClasses' as it has no actions.
:sdks:java:core:testClasses (Thread[Execution **** for ':' Thread 10,5,main]) completed. Took
0.0 secs.
:sdks:java:core:shadowTestJar (Thread[Execution **** for ':' Thread 10,5,main]) started.

> Task :sdks:java:core:shadowTestJar FROM-CACHE
Build cache key for task ':sdks:java:core:shadowTestJar' is ba1d8542617010bb909c7f08b2a0bc9a
Task ':sdks:java:core:shadowTestJar' is not up-to-date because:
  No history is available.
Loaded cache entry for task ':sdks:java:core:shadowTestJar' with cache key ba1d8542617010bb909c7f08b2a0bc9a
:sdks:java:core:shadowTestJar (Thread[Execution **** for ':' Thread 10,5,main]) completed.
Took 0.101 secs.
:runners:core-construction-java:compileTestJava (Thread[Execution **** for ':' Thread 10,5,main])
started.
:sdks:java:extensions:google-cloud-platform-core:compileTestJava (Thread[Execution **** for
':' Thread 2,5,main]) started.
:sdks:java:extensions:protobuf:extractIncludeTestProto (Thread[Execution **** for ':' Thread
6,5,main]) started.

> Task :sdks:java:harness:shadowJar FROM-CACHE
Custom actions are attached to task ':sdks:java:harness:shadowJar'.
Build cache key for task ':sdks:java:harness:shadowJar' is d483a320fb461f0e246f24604e66017d
Task ':sdks:java:harness:shadowJar' is not up-to-date because:
  No history is available.
Loaded cache entry for task ':sdks:java:harness:shadowJar' with cache key d483a320fb461f0e246f24604e66017d
:sdks:java:harness:shadowJar (Thread[Execution **** for ':' Thread 9,5,main]) completed. Took
0.554 secs.
:runners:java-fn-execution:compileJava (Thread[Execution **** for ':' Thread 9,5,main]) started.

> Task :sdks:java:extensions:google-cloud-platform-core:compileTestJava FROM-CACHE
Custom actions are attached to task ':sdks:java:extensions:google-cloud-platform-core:compileTestJava'.
Build cache key for task ':sdks:java:extensions:google-cloud-platform-core:compileTestJava'
is a444ccc9bb2f659260749e6d6f4c9e4e
Task ':sdks:java:extensions:google-cloud-platform-core:compileTestJava' is not up-to-date
because:
  No history is available.
Loaded cache entry for task ':sdks:java:extensions:google-cloud-platform-core:compileTestJava'
with cache key a444ccc9bb2f659260749e6d6f4c9e4e
:sdks:java:extensions:google-cloud-platform-core:compileTestJava (Thread[Execution **** for
':' Thread 2,5,main]) completed. Took 0.452 secs.
:sdks:java:extensions:google-cloud-platform-core:testClasses (Thread[Execution **** for ':'
Thread 2,5,main]) started.

> Task :sdks:java:extensions:google-cloud-platform-core:testClasses UP-TO-DATE
Skipping task ':sdks:java:extensions:google-cloud-platform-core:testClasses' as it has no
actions.
:sdks:java:extensions:google-cloud-platform-core:testClasses (Thread[Execution **** for ':'
Thread 2,5,main]) completed. Took 0.0 secs.
:sdks:java:extensions:google-cloud-platform-core:testJar (Thread[Execution **** for ':' Thread
2,5,main]) started.

> Task :sdks:java:extensions:google-cloud-platform-core:testJar
Caching disabled for task ':sdks:java:extensions:google-cloud-platform-core:testJar' because:
  Caching has not been enabled for the task
Task ':sdks:java:extensions:google-cloud-platform-core:testJar' is not up-to-date because:
  No history is available.
file or directory '<https://ci-beam.apache.org/job/beam_BiqQueryIO_Streaming_Performance_Test_Java/ws/src/sdks/java/extensions/google-cloud-platform-core/build/resources/test',>
not found
:sdks:java:extensions:google-cloud-platform-core:testJar (Thread[Execution **** for ':' Thread
2,5,main]) completed. Took 0.018 secs.

> Task :runners:core-construction-java:compileTestJava FROM-CACHE
Custom actions are attached to task ':runners:core-construction-java:compileTestJava'.
Build cache key for task ':runners:core-construction-java:compileTestJava' is ac233b39e58d2a36ac9b29ba33fa7372
Task ':runners:core-construction-java:compileTestJava' is not up-to-date because:
  No history is available.
Loaded cache entry for task ':runners:core-construction-java:compileTestJava' with cache key
ac233b39e58d2a36ac9b29ba33fa7372
:runners:core-construction-java:compileTestJava (Thread[Execution **** for ':' Thread 10,5,main])
completed. Took 0.694 secs.
:runners:core-construction-java:testClasses (Thread[Execution **** for ':' Thread 10,5,main])
started.

> Task :runners:core-construction-java:testClasses UP-TO-DATE
Skipping task ':runners:core-construction-java:testClasses' as it has no actions.
:runners:core-construction-java:testClasses (Thread[Execution **** for ':' Thread 10,5,main])
completed. Took 0.0 secs.
:runners:core-construction-java:testJar (Thread[Execution **** for ':' Thread 10,5,main])
started.

> Task :sdks:java:extensions:protobuf:extractIncludeTestProto
Caching disabled for task ':sdks:java:extensions:protobuf:extractIncludeTestProto' because:
  Caching has not been enabled for the task
Task ':sdks:java:extensions:protobuf:extractIncludeTestProto' is not up-to-date because:
  No history is available.
:sdks:java:extensions:protobuf:extractIncludeTestProto (Thread[Execution **** for ':' Thread
6,5,main]) completed. Took 0.732 secs.
:sdks:java:extensions:protobuf:generateTestProto (Thread[Execution **** for ':' Thread 6,5,main])
started.

> Task :runners:core-construction-java:testJar
Caching disabled for task ':runners:core-construction-java:testJar' because:
  Caching has not been enabled for the task
Task ':runners:core-construction-java:testJar' is not up-to-date because:
  No history is available.
file or directory '<https://ci-beam.apache.org/job/beam_BiqQueryIO_Streaming_Performance_Test_Java/ws/src/runners/core-construction-java/build/resources/test',>
not found
:runners:core-construction-java:testJar (Thread[Execution **** for ':' Thread 10,5,main])
completed. Took 0.052 secs.

> Task :sdks:java:extensions:protobuf:generateTestProto FROM-CACHE
Build cache key for task ':sdks:java:extensions:protobuf:generateTestProto' is b391127faf769c60dbbd2555e00c8d21
Task ':sdks:java:extensions:protobuf:generateTestProto' is not up-to-date because:
  No history is available.
Loaded cache entry for task ':sdks:java:extensions:protobuf:generateTestProto' with cache
key b391127faf769c60dbbd2555e00c8d21
:sdks:java:extensions:protobuf:generateTestProto (Thread[Execution **** for ':' Thread 6,5,main])
completed. Took 0.014 secs.
:sdks:java:extensions:protobuf:compileTestJava (Thread[Execution **** for ':' Thread 6,5,main])
started.

> Task :sdks:java:extensions:protobuf:compileTestJava FROM-CACHE
Custom actions are attached to task ':sdks:java:extensions:protobuf:compileTestJava'.
Build cache key for task ':sdks:java:extensions:protobuf:compileTestJava' is e8f4a576e00b2bfeef5817f387b7b4fa
Task ':sdks:java:extensions:protobuf:compileTestJava' is not up-to-date because:
  No history is available.
Loaded cache entry for task ':sdks:java:extensions:protobuf:compileTestJava' with cache key
e8f4a576e00b2bfeef5817f387b7b4fa
:sdks:java:extensions:protobuf:compileTestJava (Thread[Execution **** for ':' Thread 6,5,main])
completed. Took 0.048 secs.
:sdks:java:extensions:protobuf:testClasses (Thread[Execution **** for ':' Thread 6,5,main])
started.

> Task :sdks:java:extensions:protobuf:testClasses
Skipping task ':sdks:java:extensions:protobuf:testClasses' as it has no actions.
:sdks:java:extensions:protobuf:testClasses (Thread[Execution **** for ':' Thread 6,5,main])
completed. Took 0.0 secs.
:sdks:java:extensions:protobuf:testJar (Thread[Execution **** for ':' Thread 6,5,main]) started.

> Task :sdks:java:extensions:protobuf:testJar
Caching disabled for task ':sdks:java:extensions:protobuf:testJar' because:
  Caching has not been enabled for the task
Task ':sdks:java:extensions:protobuf:testJar' is not up-to-date because:
  No history is available.
:sdks:java:extensions:protobuf:testJar (Thread[Execution **** for ':' Thread 6,5,main]) completed.
Took 0.06 secs.
This JVM does not support getting OS memory, so no OS memory status updates will be broadcast

> Task :runners:java-fn-execution:compileJava
Custom actions are attached to task ':runners:java-fn-execution:compileJava'.
Build cache key for task ':runners:java-fn-execution:compileJava' is 518c78065c2080bc174b69713f199682
Task ':runners:java-fn-execution:compileJava' is not up-to-date because:
  No history is available.
The input changes require a full rebuild for incremental task ':runners:java-fn-execution:compileJava'.
Full recompilation is required because no incremental change information is available. This
is usually caused by clean builds or changing compiler arguments.
Starting process 'Gradle Worker Daemon 1'. Working directory: /home/jenkins/.gradle/****s
Command: /usr/lib/jvm/java-8-openjdk-amd64/bin/java -Djava.security.manager=****.org.gradle.process.internal.****.child.BootstrapSecurityManager
-Xbootclasspath/p:/home/jenkins/.gradle/caches/modules-2/files-2.1/com.google.errorprone/javac/9+181-r4173-1/bdf4c0aa7d540ee1f7bf14d47447aea4bbf450c5/javac-9+181-r4173-1.jar
-Xbootclasspath/p:/home/jenkins/.gradle/caches/modules-2/files-2.1/com.google.errorprone/javac/9+181-r4173-1/bdf4c0aa7d540ee1f7bf14d47447aea4bbf450c5/javac-9+181-r4173-1.jar
-Xmx512m -Dfile.encoding=UTF-8 -Duser.country=US -Duser.language=en -Duser.variant -cp /home/jenkins/.gradle/caches/6.8.3/****Main/gradle-****.jar
****.org.gradle.process.internal.****.GradleWorkerMain 'Gradle Worker Daemon 1'
Successfully started process 'Gradle Worker Daemon 1'
Started Gradle **** daemon (0.391 secs) with fork options DaemonForkOptions{executable=/usr/lib/jvm/java-8-openjdk-amd64/bin/java,
minHeapSize=null, maxHeapSize=null, jvmArgs=[-Xbootclasspath/p:/home/jenkins/.gradle/caches/modules-2/files-2.1/com.google.errorprone/javac/9+181-r4173-1/bdf4c0aa7d540ee1f7bf14d47447aea4bbf450c5/javac-9+181-r4173-1.jar,
-Xbootclasspath/p:/home/jenkins/.gradle/caches/modules-2/files-2.1/com.google.errorprone/javac/9+181-r4173-1/bdf4c0aa7d540ee1f7bf14d47447aea4bbf450c5/javac-9+181-r4173-1.jar],
keepAliveMode=SESSION}.
Compiling with JDK Java compiler API.
error: error reading <https://ci-beam.apache.org/job/beam_BiqQueryIO_Streaming_Performance_Test_Java/ws/src/sdks/java/harness/build/libs/beam-sdks-java-harness-2.32.0-SNAPSHOT.jar;>
error in opening zip file

> Task :runners:java-fn-execution:compileJava FAILED
:runners:java-fn-execution:compileJava (Thread[Execution **** for ':' Thread 9,5,main]) completed.
Took 2.485 secs.

FAILURE: Build failed with an exception.

* What went wrong:
Execution failed for task ':runners:java-fn-execution:compileJava'.
> java.util.zip.ZipError: zip END header not found

* Try:
Run with --stacktrace option to get the stack trace. Run with --debug option to get more log
output. Run with --scan to get full insights.

* Get more help at https://help.gradle.org

Deprecated Gradle features were used in this build, making it incompatible with Gradle 7.0.
Use '--warning-mode all' to show the individual deprecation warnings.
See https://docs.gradle.org/6.8.3/userguide/command_line_interface.html#sec:command_line_warnings

BUILD FAILED in 23s
96 actionable tasks: 63 executed, 33 from cache

Publishing build scan...
https://gradle.com/s/q7gfddl2gme7a

Stopped 1 **** daemon(s).
Build step 'Invoke Gradle script' changed build result to FAILURE
Build step 'Invoke Gradle script' marked build as failure

---------------------------------------------------------------------
To unsubscribe, e-mail: builds-unsubscribe@beam.apache.org
For additional commands, e-mail: builds-help@beam.apache.org


Mime
View raw message