beam-builds mailing list archives

Site index · List index
Message view « Date » · « Thread »
Top « Date » · « Thread »
From Apache Jenkins Server <jenk...@builds.apache.org>
Subject Build failed in Jenkins: beam_LoadTests_Java_GBK_Dataflow_V2_Streaming_Java11 #33
Date Tue, 20 Jul 2021 16:03:20 GMT
See <https://ci-beam.apache.org/job/beam_LoadTests_Java_GBK_Dataflow_V2_Streaming_Java11/33/display/redirect?page=changes>

Changes:

[zhoufek] [BEAM-12474] Write PubsubIO parsing errors to dead-letter topic

[noreply] [BEAM-4152] Disable window tests on Dataflow (#15188)

[noreply] [BEAM-12548] Implement EqualsFloat test helper (#15175)

[noreply] Fix formatting using go fmt (#15189)

[noreply] [BEAM-4152] Add merging strategy for sessions to WindowingStrategy proto

[noreply] [BEAM-12613] Enable Python build tests for Samza (#15169)

[noreply] Fix spelling.


------------------------------------------
[...truncated 116.13 KB...]
SEVERE: 2021-07-20T15:04:18.696Z: generic::aborted: SDK harness sdk-0-0 disconnected.
generic::aborted: SDK harness sdk-0-0 disconnected.
passed through:
==>
    dist_proc/dax/workflow/****/fnapi_service.cc:631
generic::aborted: SDK harness sdk-0-0 disconnected.
generic::aborted: SDK harness sdk-0-0 disconnected.
passed through:
==>
    dist_proc/dax/workflow/****/fnapi_service.cc:631
Jul 20, 2021 3:24:01 PM org.apache.beam.runners.dataflow.util.MonitoringUtil$LoggingHandler
process
SEVERE: 2021-07-20T15:23:59.873Z: generic::aborted: SDK harness sdk-0-0 disconnected.
generic::aborted: SDK harness sdk-0-0 disconnected.
passed through:
==>
    dist_proc/dax/workflow/****/fnapi_service.cc:631
generic::aborted: SDK harness sdk-0-0 disconnected.
generic::aborted: SDK harness sdk-0-0 disconnected.
passed through:
==>
    dist_proc/dax/workflow/****/fnapi_service.cc:631
generic::aborted: SDK harness sdk-0-0 disconnected.
passed through:
==>
    dist_proc/dax/workflow/****/fnapi_service.cc:631
generic::aborted: SDK harness sdk-0-0 disconnected.
generic::aborted: SDK harness sdk-0-0 disconnected.
passed through:
==>
    dist_proc/dax/workflow/****/fnapi_service.cc:631
generic::aborted: SDK harness sdk-0-0 disconnected.
generic::aborted: SDK harness sdk-0-0 disconnected.
passed through:
==>
    dist_proc/dax/workflow/****/fnapi_service.cc:631
generic::aborted: SDK harness sdk-0-0 disconnected.
generic::aborted: SDK harness sdk-0-0 disconnected.
generic::aborted: SDK harness sdk-0-0 disconnected.
passed through:
==>
    dist_proc/dax/workflow/****/fnapi_service.cc:631
generic::aborted: SDK harness sdk-0-0 disconnected.
generic::aborted: SDK harness sdk-0-0 disconnected.
passed through:
==>
    dist_proc/dax/workflow/****/fnapi_service.cc:631
generic::aborted: SDK harness sdk-0-0 disconnected.
generic::aborted: SDK harness sdk-0-0 disconnected.
passed through:
==>
    dist_proc/dax/workflow/****/fnapi_service.cc:631
generic::aborted: SDK harness sdk-0-0 disconnected.
generic::aborted: SDK harness sdk-0-0 disconnected.
passed through:
==>
    dist_proc/dax/workflow/****/fnapi_service.cc:631
generic::aborted: SDK harness sdk-0-0 disconnected.
generic::aborted: SDK harness sdk-0-0 disconnected.
passed through:
==>
    dist_proc/dax/workflow/****/fnapi_service.cc:631
generic::aborted: SDK harness sdk-0-0 disconnected.
passed through:
==>
    dist_proc/dax/workflow/****/fnapi_service.cc:631
generic::aborted: SDK harness sdk-0-0 disconnected.
generic::aborted: SDK harness sdk-0-0 disconnected.
passed through:
==>
    dist_proc/dax/workflow/****/fnapi_service.cc:631
generic::aborted: SDK harness sdk-0-0 disconnected.
generic::aborted: SDK harness sdk-0-0 disconnected.
passed through:
==>
    dist_proc/dax/workflow/****/fnapi_service.cc:631
generic::aborted: SDK harness sdk-0-0 disconnected.
generic::aborted: SDK harness sdk-0-0 disconnected.
generic::aborted: SDK harness sdk-0-0 disconnected.
passed through:
==>
    dist_proc/dax/workflow/****/fnapi_service.cc:631
generic::aborted: SDK harness sdk-0-0 disconnected.
passed through:
==>
    dist_proc/dax/workflow/****/fnapi_service.cc:631
generic::aborted: SDK harness sdk-0-0 disconnected.
generic::aborted: SDK harness sdk-0-0 disconnected.
generic::aborted: SDK harness sdk-0-0 disconnected.
passed through:
==>
    dist_proc/dax/workflow/****/fnapi_service.cc:631
generic::aborted: SDK harness sdk-0-0 disconnected.
generic::aborted: SDK harness sdk-0-0 disconnected.
passed through:
==>
    dist_proc/dax/workflow/****/fnapi_service.cc:631
generic::aborted: SDK harness sdk-0-0 disconnected.
passed through:
==>
    dist_proc/dax/workflow/****/fnapi_service.cc:631
generic::aborted: SDK harness sdk-0-0 disconnected.
generic::aborted: SDK harness sdk-0-0 disconnected.
passed through:
==>
    dist_proc/dax/workflow/****/fnapi_service.cc:631
generic::aborted: SDK harness sdk-0-0 disconnected.
generic::aborted: SDK harness sdk-0-0 disconnected.
passed through:
==>
    dist_proc/dax/workflow/****/fnapi_service.cc:631
generic::aborted: SDK harness sdk-0-0 disconnected.
passed through:
==>
    dist_proc/dax/workflow/****/fnapi_service.cc:631
generic::aborted: SDK harness sdk-0-0 disconnected.
generic::aborted: SDK harness sdk-0-0 disconnected.
generic::aborted: SDK harness sdk-0-0 disconnected.
generic::aborted: SDK harness sdk-0-0 disconnected.
generic::aborted: SDK harness sdk-0-0 disconnected.
generic::aborted: SDK harness sdk-0-0 disconnected.
passed through:
==>
    dist_proc/dax/workflow/****/fnapi_service.cc:631
generic::aborted: SDK harness sdk-0-0 disconnected.
passed through:
==>
    dist_proc/dax/workflow/****/fnapi_service.cc:631
generic::aborted: SDK harness sdk-0-0 disconnected.
passed through:
==>
    dist_proc/dax/workflow/****/fnapi_service.cc:631
generic::aborted: SDK harness sdk-0-0 disconnected.
generic::aborted: SDK harness sdk-0-0 disconnected.
passed through:
==>
    dist_proc/dax/workflow/****/fnapi_service.cc:631
generic::aborted: SDK harness sdk-0-0 disconnected.
generic::aborted: SDK harness sdk-0-0 disconnected.
passed through:
==>
    dist_proc/dax/workflow/****/fnapi_service.cc:631
generic::aborted: SDK harness sdk-0-0 disconnected.
generic::aborted: SDK harness sdk-0-0 disconnected.
passed through:
==>
    dist_proc/dax/workflow/****/fnapi_service.cc:631
generic::aborted: SDK harness sdk-0-0 disconnected.
generic::aborted: SDK harness sdk-0-0 disconnected.
passed through:
==>
    dist_proc/dax/workflow/****/fnapi_service.cc:631
generic::aborted: SDK harness sdk-0-0 disconnected.
generic::aborted: SDK harness sdk-0-0 disconnected.
passed through:
==>
    dist_proc/dax/workflow/****/fnapi_service.cc:631
Jul 20, 2021 3:24:21 PM org.apache.beam.runners.dataflow.util.MonitoringUtil$LoggingHandler
process
SEVERE: 2021-07-20T15:24:20.046Z: generic::aborted: SDK harness sdk-0-0 disconnected.
generic::aborted: SDK harness sdk-0-0 disconnected.
passed through:
==>
    dist_proc/dax/workflow/****/fnapi_service.cc:631
generic::aborted: SDK harness sdk-0-0 disconnected.
generic::aborted: SDK harness sdk-0-0 disconnected.
passed through:
==>
    dist_proc/dax/workflow/****/fnapi_service.cc:631
generic::aborted: SDK harness sdk-0-0 disconnected.
generic::aborted: SDK harness sdk-0-0 disconnected.
passed through:
==>
    dist_proc/dax/workflow/****/fnapi_service.cc:631
Jul 20, 2021 3:27:08 PM org.apache.beam.runners.dataflow.util.MonitoringUtil$LoggingHandler
process
INFO: 2021-07-20T15:27:07.561Z: Autoscaling: Raised the number of ****s to 5 so that the pipeline
can catch up with its backlog and keep up with its input rate.
Jul 20, 2021 3:28:11 PM org.apache.beam.runners.dataflow.util.MonitoringUtil$LoggingHandler
process
INFO: 2021-07-20T15:28:11.258Z: Autoscaling: Raised the number of ****s to 5 so that the pipeline
can catch up with its backlog and keep up with its input rate.
Jul 20, 2021 3:31:17 PM org.apache.beam.runners.dataflow.util.MonitoringUtil$LoggingHandler
process
INFO: 2021-07-20T15:31:15.713Z: Autoscaling: Raised the number of ****s to 5 so that the pipeline
can catch up with its backlog and keep up with its input rate.
Jul 20, 2021 4:00:40 PM org.apache.beam.runners.dataflow.util.MonitoringUtil$LoggingHandler
process
INFO: 2021-07-20T16:00:39.061Z: Cancel request is committed for workflow job: 2021-07-20_05_17_33-13230817735443607211.
Jul 20, 2021 4:00:40 PM org.apache.beam.runners.dataflow.util.MonitoringUtil$LoggingHandler
process
INFO: 2021-07-20T16:00:39.103Z: Cleaning up.
Jul 20, 2021 4:00:40 PM org.apache.beam.runners.dataflow.util.MonitoringUtil$LoggingHandler
process
INFO: 2021-07-20T16:00:39.222Z: Stopping **** pool...
Jul 20, 2021 4:00:40 PM org.apache.beam.runners.dataflow.util.MonitoringUtil$LoggingHandler
process
INFO: 2021-07-20T16:00:39.271Z: Stopping **** pool...
Jul 20, 2021 4:00:48 PM org.apache.beam.runners.dataflow.util.MonitoringUtil$LoggingHandler
process
SEVERE: 2021-07-20T16:00:45.934Z: generic::internal: Current work item is no longer valid
on backend. The work has already completed or will be retried. This is expected during autoscaling
events.
generic::internal: Current work item is no longer valid on backend. The work has already completed
or will be retried. This is expected during autoscaling events.
generic::internal: Current work item is no longer valid on backend. The work has already completed
or will be retried. This is expected during autoscaling events.
generic::internal: Current work item is no longer valid on backend. The work has already completed
or will be retried. This is expected during autoscaling events.
generic::internal: Current work item is no longer valid on backend. The work has already completed
or will be retried. This is expected during autoscaling events.
generic::internal: Current work item is no longer valid on backend. The work has already completed
or will be retried. This is expected during autoscaling events.
Jul 20, 2021 4:00:50 PM org.apache.beam.runners.dataflow.util.MonitoringUtil$LoggingHandler
process
SEVERE: 2021-07-20T16:00:49.179Z: generic::internal: Current work item is no longer valid
on backend. The work has already completed or will be retried. This is expected during autoscaling
events.
generic::internal: Current work item is no longer valid on backend. The work has already completed
or will be retried. This is expected during autoscaling events.
Jul 20, 2021 4:03:06 PM org.apache.beam.runners.dataflow.util.MonitoringUtil$LoggingHandler
process
INFO: 2021-07-20T16:03:05.902Z: Autoscaling: Reduced the number of ****s to 0 based on low
average **** CPU utilization, and the pipeline having sufficiently low backlog and keeping
up with input rate.
Jul 20, 2021 4:03:06 PM org.apache.beam.runners.dataflow.util.MonitoringUtil$LoggingHandler
process
INFO: 2021-07-20T16:03:05.955Z: Worker pool stopped.
Jul 20, 2021 4:03:14 PM org.apache.beam.runners.dataflow.DataflowPipelineJob logTerminalState
INFO: Job 2021-07-20_05_17_33-13230817735443607211 finished with status CANCELLED.
Load test results for test (ID): 4684cb8d-8a01-4d4e-8661-83694c3bf9e4 and timestamp: 2021-07-20T12:17:26.130000000Z:
                 Metric:                    Value:
dataflow_v2_java11_runtime_sec                 13246.346
dataflow_v2_java11_total_bytes_count            3.213708657E10
Exception in thread "main" java.lang.RuntimeException: Invalid job state: CANCELLED.
	at org.apache.beam.sdk.loadtests.JobFailure.handleFailure(JobFailure.java:55)
	at org.apache.beam.sdk.loadtests.LoadTest.run(LoadTest.java:141)
	at org.apache.beam.sdk.loadtests.GroupByKeyLoadTest.run(GroupByKeyLoadTest.java:57)
	at org.apache.beam.sdk.loadtests.GroupByKeyLoadTest.main(GroupByKeyLoadTest.java:131)

> Task :sdks:java:testing:load-tests:run FAILED

> Task :runners:google-cloud-dataflow-java:cleanUpDockerImages
Untagged: us.gcr.io/apache-beam-testing/java-postcommit-it/java:20210720121035
Untagged: us.gcr.io/apache-beam-testing/java-postcommit-it/java@sha256:65539b715f77340be799903fdf44423037b7191691ab279e5d161d430ac8b8f7
Digests:
- us.gcr.io/apache-beam-testing/java-postcommit-it/java@sha256:65539b715f77340be799903fdf44423037b7191691ab279e5d161d430ac8b8f7
  Associated tags:
 - 20210720121035
Tags:
- us.gcr.io/apache-beam-testing/java-postcommit-it/java:20210720121035
Deleted [us.gcr.io/apache-beam-testing/java-postcommit-it/java:20210720121035].
Deleted [us.gcr.io/apache-beam-testing/java-postcommit-it/java@sha256:65539b715f77340be799903fdf44423037b7191691ab279e5d161d430ac8b8f7].

FAILURE: Build failed with an exception.

* What went wrong:
Execution failed for task ':sdks:java:testing:load-tests:run'.
> Process 'command '/usr/lib/jvm/java-8-openjdk-amd64/bin/java'' finished with non-zero
exit value 1

* Try:
Run with --stacktrace option to get the stack trace. Run with --info or --debug option to
get more log output. Run with --scan to get full insights.

* Get more help at https://help.gradle.org

Deprecated Gradle features were used in this build, making it incompatible with Gradle 7.0.
Use '--warning-mode all' to show the individual deprecation warnings.
See https://docs.gradle.org/6.8.3/userguide/command_line_interface.html#sec:command_line_warnings

BUILD FAILED in 3h 53m 1s
107 actionable tasks: 78 executed, 27 from cache, 2 up-to-date

Publishing build scan...
https://gradle.com/s/quriw6dlku5yw

Build step 'Invoke Gradle script' changed build result to FAILURE
Build step 'Invoke Gradle script' marked build as failure

---------------------------------------------------------------------
To unsubscribe, e-mail: builds-unsubscribe@beam.apache.org
For additional commands, e-mail: builds-help@beam.apache.org


Mime
View raw message