beam-builds mailing list archives

Site index · List index
Message view « Date » · « Thread »
Top « Date » · « Thread »
From Apache Jenkins Server <jenk...@builds.apache.org>
Subject Build failed in Jenkins: beam_PostCommit_Java_VR_Dataflow_V2_Streaming #928
Date Thu, 01 Jul 2021 07:35:21 GMT
See <https://ci-beam.apache.org/job/beam_PostCommit_Java_VR_Dataflow_V2_Streaming/928/display/redirect>

Changes:


------------------------------------------
[...truncated 55.36 KB...]
> Task :runners:google-cloud-dataflow-java:compileJava FROM-CACHE
> Task :runners:google-cloud-dataflow-java:classes
> Task :sdks:java:container:java8:copyDockerfileDependencies
> Task :runners:google-cloud-dataflow-java:jar
> Task :sdks:java:container:generateLicenseReport

> Task :sdks:java:core:compileTestJava
Note: Some input files use or override a deprecated API.
Note: Recompile with -Xlint:deprecation for details.
Note: Some input files use unchecked or unsafe operations.
Note: Recompile with -Xlint:unchecked for details.

> Task :sdks:java:core:testClasses
> Task :sdks:java:core:shadowTestJar FROM-CACHE
> Task :sdks:java:extensions:google-cloud-platform-core:compileTestJava FROM-CACHE
> Task :sdks:java:extensions:google-cloud-platform-core:testClasses UP-TO-DATE
> Task :sdks:java:extensions:google-cloud-platform-core:testJar
> Task :runners:core-construction-java:compileTestJava FROM-CACHE
> Task :runners:core-construction-java:testClasses UP-TO-DATE
> Task :runners:core-construction-java:testJar
> Task :sdks:java:extensions:protobuf:extractIncludeTestProto
> Task :sdks:java:extensions:protobuf:generateTestProto FROM-CACHE
> Task :sdks:java:extensions:protobuf:compileTestJava FROM-CACHE
> Task :sdks:java:extensions:protobuf:testClasses
> Task :sdks:java:extensions:protobuf:testJar

> Task :sdks:java:container:pullLicenses
Copying already-fetched licenses from <https://ci-beam.apache.org/job/beam_PostCommit_Java_VR_Dataflow_V2_Streaming/ws/src/sdks/java/container/build/reports/dependency-license>
to <https://ci-beam.apache.org/job/beam_PostCommit_Java_VR_Dataflow_V2_Streaming/ws/src/sdks/java/container/build/target/java_third_party_licenses>
Already using interpreter /usr/bin/python3
Using base prefix '/usr'
New python executable in <https://ci-beam.apache.org/job/beam_PostCommit_Java_VR_Dataflow_V2_Streaming/ws/src/sdks/java/container/build/virtualenv/bin/python3>
Also creating executable in <https://ci-beam.apache.org/job/beam_PostCommit_Java_VR_Dataflow_V2_Streaming/ws/src/sdks/java/container/build/virtualenv/bin/python>
Installing setuptools, pip, wheel...
done.
DEPRECATION: Python 3.5 reached the end of its life on September 13th, 2020. Please upgrade
your Python as Python 3.5 is no longer maintained. pip 21.0 will drop support for Python 3.5
in January 2021. pip 21.0 will remove support for this functionality.
Collecting beautifulsoup4<5.0,>=4.9.0
  Using cached beautifulsoup4-4.9.3-py3-none-any.whl (115 kB)
Collecting future<1.0.0,>=0.16.0
  Using cached future-0.18.2-py3-none-any.whl
Collecting pyyaml<6.0.0,>=3.12
  Using cached PyYAML-5.3.1-cp35-cp35m-linux_x86_64.whl
Collecting tenacity<6.0,>=5.0.2
  Using cached tenacity-5.1.5-py2.py3-none-any.whl (34 kB)
Collecting soupsieve>1.2
  Using cached soupsieve-2.1-py3-none-any.whl (32 kB)
Collecting six>=1.9.0
  Using cached six-1.16.0-py2.py3-none-any.whl (11 kB)
Installing collected packages: soupsieve, six, tenacity, pyyaml, future, beautifulsoup4
Successfully installed beautifulsoup4-4.9.3 future-0.18.2 pyyaml-5.3.1 six-1.16.0 soupsieve-2.1
tenacity-5.1.5
Executing <https://ci-beam.apache.org/job/beam_PostCommit_Java_VR_Dataflow_V2_Streaming/ws/src/sdks/java/container/build/virtualenv/bin/python>
<https://ci-beam.apache.org/job/beam_PostCommit_Java_VR_Dataflow_V2_Streaming/ws/src/sdks/java/container/license_scripts/pull_licenses_java.py>
--license_index=<https://ci-beam.apache.org/job/beam_PostCommit_Java_VR_Dataflow_V2_Streaming/ws/src/sdks/java/container/build/reports/dependency-license/index.json>
       --output_dir=<https://ci-beam.apache.org/job/beam_PostCommit_Java_VR_Dataflow_V2_Streaming/ws/src/sdks/java/container/build/target/java_third_party_licenses>
       --dep_url_yaml=<https://ci-beam.apache.org/job/beam_PostCommit_Java_VR_Dataflow_V2_Streaming/ws/src/sdks/java/container/license_scripts/dep_urls_java.yaml>

INFO:root:Pulling license for 208 dependencies using 16 threads.

> Task :sdks:java:io:google-cloud-platform:compileTestJava
Note: Some input files use or override a deprecated API.
Note: Recompile with -Xlint:deprecation for details.
Note: Some input files use unchecked or unsafe operations.
Note: Recompile with -Xlint:unchecked for details.

> Task :sdks:java:io:google-cloud-platform:testClasses

> Task :sdks:java:container:pullLicenses
Traceback (most recent call last):
  File "<https://ci-beam.apache.org/job/beam_PostCommit_Java_VR_Dataflow_V2_Streaming/ws/src/sdks/java/container/license_scripts/pull_licenses_java.py",>
line 55, in pull_from_url
    shutil.copyfileobj(url_read, temp_write)
  File "<https://ci-beam.apache.org/job/beam_PostCommit_Java_VR_Dataflow_V2_Streaming/ws/src/sdks/java/container/build/virtualenv/lib/python3.5/shutil.py",>
line 76, in copyfileobj
    fdst.write(buf)
OSError: [Errno 28] No space left on device
ERROR:root:Error occurred when pull <https://ci-beam.apache.org/job/beam_PostCommit_Java_VR_Dataflow_V2_Streaming/ws/src/sdks/java/container/build/target/java_third_party_licenses/org.jacoco.report-0.8.6.jar/LICENSE>
from https://www.eclipse.org/legal/epl-2.0/ for org.jacoco.report-0.8.6. Retrying...

> Task :sdks:java:io:google-cloud-platform:testJar FAILED

> Task :release:go-licenses:java:dockerRun
# cd .; git clone -- https://go.googlesource.com/protobuf /go/src/google.golang.org/protobuf
Cloning into '/go/src/google.golang.org/protobuf'...
error: failed to write new configuration file /go/src/google.golang.org/protobuf/.git/config.lock
fatal: could not set 'remote.origin.fetch' to '+refs/heads/*:refs/remotes/origin/*'
package google.golang.org/protobuf/reflect/protoreflect: exit status 128
cannot find package "google.golang.org/protobuf/runtime/protoimpl" in any of:
	/usr/local/go/src/google.golang.org/protobuf/runtime/protoimpl (from $GOROOT)
	/go/src/google.golang.org/protobuf/runtime/protoimpl (from $GOPATH)
cannot find package "google.golang.org/protobuf/types/descriptorpb" in any of:
	/usr/local/go/src/google.golang.org/protobuf/types/descriptorpb (from $GOROOT)
	/go/src/google.golang.org/protobuf/types/descriptorpb (from $GOPATH)
cannot find package "google.golang.org/protobuf/types/known/durationpb" in any of:
	/usr/local/go/src/google.golang.org/protobuf/types/known/durationpb (from $GOROOT)
	/go/src/google.golang.org/protobuf/types/known/durationpb (from $GOPATH)
cannot find package "google.golang.org/protobuf/types/known/timestamppb" in any of:
	/usr/local/go/src/google.golang.org/protobuf/types/known/timestamppb (from $GOROOT)
	/go/src/google.golang.org/protobuf/types/known/timestamppb (from $GOPATH)
# cd .; git clone -- https://github.com/grpc/grpc-go /go/src/google.golang.org/grpc
Cloning into '/go/src/google.golang.org/grpc'...
/go/src/google.golang.org/grpc/.git/info/: No space left on device
package google.golang.org/grpc: exit status 1
cannot find package "google.golang.org/grpc/codes" in any of:
	/usr/local/go/src/google.golang.org/grpc/codes (from $GOROOT)
	/go/src/google.golang.org/grpc/codes (from $GOPATH)
cannot find package "google.golang.org/grpc/status" in any of:
	/usr/local/go/src/google.golang.org/grpc/status (from $GOROOT)
	/go/src/google.golang.org/grpc/status (from $GOPATH)
cannot find package "google.golang.org/protobuf/types/known/structpb" in any of:
	/usr/local/go/src/google.golang.org/protobuf/types/known/structpb (from $GOROOT)
	/go/src/google.golang.org/protobuf/types/known/structpb (from $GOPATH)
cannot find package "google.golang.org/grpc/metadata" in any of:
	/usr/local/go/src/google.golang.org/grpc/metadata (from $GOROOT)
	/go/src/google.golang.org/grpc/metadata (from $GOPATH)
cannot find package "google.golang.org/protobuf/encoding/prototext" in any of:
	/usr/local/go/src/google.golang.org/protobuf/encoding/prototext (from $GOROOT)
	/go/src/google.golang.org/protobuf/encoding/prototext (from $GOPATH)
cannot find package "google.golang.org/protobuf/encoding/protowire" in any of:
	/usr/local/go/src/google.golang.org/protobuf/encoding/protowire (from $GOROOT)
	/go/src/google.golang.org/protobuf/encoding/protowire (from $GOPATH)
cannot find package "google.golang.org/protobuf/proto" in any of:
	/usr/local/go/src/google.golang.org/protobuf/proto (from $GOROOT)
	/go/src/google.golang.org/protobuf/proto (from $GOPATH)
cannot find package "google.golang.org/protobuf/reflect/protodesc" in any of:
	/usr/local/go/src/google.golang.org/protobuf/reflect/protodesc (from $GOROOT)
	/go/src/google.golang.org/protobuf/reflect/protodesc (from $GOPATH)
cannot find package "google.golang.org/protobuf/reflect/protoregistry" in any of:
	/usr/local/go/src/google.golang.org/protobuf/reflect/protoregistry (from $GOROOT)
	/go/src/google.golang.org/protobuf/reflect/protoregistry (from $GOPATH)
cannot find package "google.golang.org/protobuf/runtime/protoiface" in any of:
	/usr/local/go/src/google.golang.org/protobuf/runtime/protoiface (from $GOROOT)
	/go/src/google.golang.org/protobuf/runtime/protoiface (from $GOPATH)
cannot find package "google.golang.org/protobuf/encoding/protojson" in any of:
	/usr/local/go/src/google.golang.org/protobuf/encoding/protojson (from $GOROOT)
	/go/src/google.golang.org/protobuf/encoding/protojson (from $GOPATH)

> Task :release:go-licenses:java:dockerRun FAILED

> Task :sdks:java:container:pullLicenses
Traceback (most recent call last):
  File "<https://ci-beam.apache.org/job/beam_PostCommit_Java_VR_Dataflow_V2_Streaming/ws/src/sdks/java/container/license_scripts/pull_licenses_java.py",>
line 55, in pull_from_url
    shutil.copyfileobj(url_read, temp_write)
OSError: [Errno 28] No space left on device
ERROR:root:Error occurred when pull <https://ci-beam.apache.org/job/beam_PostCommit_Java_VR_Dataflow_V2_Streaming/ws/src/sdks/java/container/build/target/java_third_party_licenses/asm-tree-8.0.1.jar/LICENSE>
from http://www.apache.org/licenses/LICENSE-2.0.txt for asm-tree-8.0.1. Retrying...
Traceback (most recent call last):
  File "<https://ci-beam.apache.org/job/beam_PostCommit_Java_VR_Dataflow_V2_Streaming/ws/src/sdks/java/container/license_scripts/pull_licenses_java.py",>
line 55, in pull_from_url
    shutil.copyfileobj(url_read, temp_write)
OSError: [Errno 28] No space left on device
ERROR:root:Error occurred when pull <https://ci-beam.apache.org/job/beam_PostCommit_Java_VR_Dataflow_V2_Streaming/ws/src/sdks/java/container/build/target/java_third_party_licenses/conscrypt-openjdk-uber-2.5.1.jar/LICENSE>
from https://www.apache.org/licenses/LICENSE-2.0 for conscrypt-openjdk-uber-2.5.1. Retrying...
Traceback (most recent call last):
  File "<https://ci-beam.apache.org/job/beam_PostCommit_Java_VR_Dataflow_V2_Streaming/ws/src/sdks/java/container/license_scripts/pull_licenses_java.py",>
line 55, in pull_from_url
    shutil.copyfileobj(url_read, temp_write)
  File "<https://ci-beam.apache.org/job/beam_PostCommit_Java_VR_Dataflow_V2_Streaming/ws/src/sdks/java/container/build/virtualenv/lib/python3.5/shutil.py",>
line 76, in copyfileobj
    fdst.write(buf)
OSError: [Errno 28] No space left on device
ERROR:root:Error occurred when pull <https://ci-beam.apache.org/job/beam_PostCommit_Java_VR_Dataflow_V2_Streaming/ws/src/sdks/java/container/build/target/java_third_party_licenses/lz4-java-1.4.1.jar/LICENSE>
from http://www.apache.org/licenses/LICENSE-2.0.txt for lz4-java-1.4.1. Retrying...
Traceback (most recent call last):
  File "<https://ci-beam.apache.org/job/beam_PostCommit_Java_VR_Dataflow_V2_Streaming/ws/src/sdks/java/container/license_scripts/pull_licenses_java.py",>
line 55, in pull_from_url
    shutil.copyfileobj(url_read, temp_write)
  File "<https://ci-beam.apache.org/job/beam_PostCommit_Java_VR_Dataflow_V2_Streaming/ws/src/sdks/java/container/build/virtualenv/lib/python3.5/shutil.py",>
line 76, in copyfileobj
    fdst.write(buf)
OSError: [Errno 28] No space left on device
ERROR:root:Error occurred when pull <https://ci-beam.apache.org/job/beam_PostCommit_Java_VR_Dataflow_V2_Streaming/ws/src/sdks/java/container/build/target/java_third_party_licenses/snakeyaml-1.27.jar/LICENSE>
from http://www.apache.org/licenses/LICENSE-2.0.txt for snakeyaml-1.27. Retrying...
Traceback (most recent call last):
  File "<https://ci-beam.apache.org/job/beam_PostCommit_Java_VR_Dataflow_V2_Streaming/ws/src/sdks/java/container/license_scripts/pull_licenses_java.py",>
line 55, in pull_from_url
    shutil.copyfileobj(url_read, temp_write)
  File "<https://ci-beam.apache.org/job/beam_PostCommit_Java_VR_Dataflow_V2_Streaming/ws/src/sdks/java/container/build/virtualenv/lib/python3.5/shutil.py",>
line 76, in copyfileobj
    fdst.write(buf)
OSError: [Errno 28] No space left on device
ERROR:root:Error occurred when pull <https://ci-beam.apache.org/job/beam_PostCommit_Java_VR_Dataflow_V2_Streaming/ws/src/sdks/java/container/build/target/java_third_party_licenses/asm-analysis-8.0.1.jar/LICENSE>
from http://www.apache.org/licenses/LICENSE-2.0.txt for asm-analysis-8.0.1. Retrying...
Traceback (most recent call last):
  File "<https://ci-beam.apache.org/job/beam_PostCommit_Java_VR_Dataflow_V2_Streaming/ws/src/sdks/java/container/license_scripts/pull_licenses_java.py",>
line 55, in pull_from_url
    shutil.copyfileobj(url_read, temp_write)
  File "<https://ci-beam.apache.org/job/beam_PostCommit_Java_VR_Dataflow_V2_Streaming/ws/src/sdks/java/container/build/virtualenv/lib/python3.5/shutil.py",>
line 76, in copyfileobj
    fdst.write(buf)
OSError: [Errno 28] No space left on device
ERROR:root:Error occurred when pull <https://ci-beam.apache.org/job/beam_PostCommit_Java_VR_Dataflow_V2_Streaming/ws/src/sdks/java/container/build/target/java_third_party_licenses/lz4-java-1.7.1.jar/LICENSE>
from http://www.apache.org/licenses/LICENSE-2.0.txt for lz4-java-1.7.1. Retrying...
INFO:root:pull_licenses_java.py succeed. It took 11.085114 seconds with 16 threads.
Copying licenses from <https://ci-beam.apache.org/job/beam_PostCommit_Java_VR_Dataflow_V2_Streaming/ws/src/sdks/java/container/build/target/java_third_party_licenses>
to <https://ci-beam.apache.org/job/beam_PostCommit_Java_VR_Dataflow_V2_Streaming/ws/src/sdks/java/container/build/target/third_party_licenses.>
Finished license_scripts.sh

> Task :sdks:java:container:java8:copyJavaThirdPartyLicenses NO-SOURCE

> Task :sdks:go:resolveBuildDependencies
Resolving golang.org/x/text: commit='23ae387dee1f90d29a23c0e87ee0b46038fbed0e', urls=[https://go.googlesource.com/text]
Resolving cached github.com/etcd-io/etcd: commit='11214aa33bf5a47d3d9d8dafe0f6b97237dfe921',
urls=[https://github.com/etcd-io/etcd.git, git@github.com:etcd-io/etcd.git]
Resolving google.golang.org/api: commit='0324d5e90dc7753607860272666845fad9ceb97e', urls=[https://code.googlesource.com/google-api-go-client]
Resolving google.golang.org/genproto: commit='4d944d34d83c502a5f761500a14d8842648415c3', urls=[https://github.com/google/go-genproto]
Resolving google.golang.org/grpc: commit='5e8f83304c0563d1ba74db05fee83d9c18ab9a58', urls=[https://github.com/grpc/grpc-go]
Resolving google.golang.org/protobuf: commit='d165be301fb1e13390ad453281ded24385fd8ebc', urls=[https://go.googlesource.com/protobuf]
Resolving cached github.com/etcd-io/etcd: commit='11214aa33bf5a47d3d9d8dafe0f6b97237dfe921',
urls=[https://github.com/etcd-io/etcd.git, git@github.com:etcd-io/etcd.git]
Resolving cached github.com/etcd-io/etcd: commit='11214aa33bf5a47d3d9d8dafe0f6b97237dfe921',
urls=[https://github.com/etcd-io/etcd.git, git@github.com:etcd-io/etcd.git]

> Task :sdks:go:installDependencies
> Task :sdks:go:buildLinuxAmd64
> Task :sdks:go:goBuild

> Task :sdks:java:container:resolveBuildDependencies
Resolving ./github.com/apache/beam/sdks/go@<https://ci-beam.apache.org/job/beam_PostCommit_Java_VR_Dataflow_V2_Streaming/ws/src/sdks/go>

> Task :sdks:java:container:installDependencies
> Task :sdks:java:container:buildLinuxAmd64
> Task :sdks:java:container:goBuild
> Task :sdks:java:container:java8:copySdkHarnessLauncher

FAILURE: Build completed with 2 failures.

1: Task failed with an exception.
-----------
* What went wrong:
Execution failed for task ':sdks:java:io:google-cloud-platform:testJar'.
> Could not add file '<https://ci-beam.apache.org/job/beam_PostCommit_Java_VR_Dataflow_V2_Streaming/ws/src/sdks/java/io/google-cloud-platform/build/resources/test/STU3/Damon455_Will178_136f997d-0a94-4573-97da-a53b5060a612.json'>
to ZIP '<https://ci-beam.apache.org/job/beam_PostCommit_Java_VR_Dataflow_V2_Streaming/ws/src/sdks/java/io/google-cloud-platform/build/libs/beam-sdks-java-io-google-cloud-platform-2.32.0-SNAPSHOT-tests.jar'.>

* Try:
Run with --stacktrace option to get the stack trace. Run with --info or --debug option to
get more log output. Run with --scan to get full insights.
==============================================================================

2: Task failed with an exception.
-----------
* What went wrong:
Execution failed for task ':release:go-licenses:java:dockerRun'.
> Process 'command 'docker'' finished with non-zero exit value 1

* Try:
Run with --stacktrace option to get the stack trace. Run with --info or --debug option to
get more log output. Run with --scan to get full insights.
==============================================================================

* Get more help at https://help.gradle.org

Deprecated Gradle features were used in this build, making it incompatible with Gradle 7.0.
Use '--warning-mode all' to show the individual deprecation warnings.
See https://docs.gradle.org/6.8.3/userguide/command_line_interface.html#sec:command_line_warnings

BUILD FAILED in 4m 25s
119 actionable tasks: 83 executed, 34 from cache, 2 up-to-date

Publishing build scan...
https://gradle.com/s/5mp4jtit5bsem


FAILURE: Build failed with an exception.

* What went wrong:
Could not add entry ':sdks:java:io:google-cloud-platform:testJar' to cache executionHistory.bin
(<https://ci-beam.apache.org/job/beam_PostCommit_Java_VR_Dataflow_V2_Streaming/ws/src/.gradle/6.8.3/executionHistory/executionHistory.bin).>
> java.io.IOException: No space left on device

* Try:
Run with --stacktrace option to get the stack trace. Run with --info or --debug option to
get more log output. Run with --scan to get full insights.

* Get more help at https://help.gradle.org

Deprecated Gradle features were used in this build, making it incompatible with Gradle 7.0.
Use '--warning-mode all' to show the individual deprecation warnings.
See https://docs.gradle.org/6.8.3/userguide/command_line_interface.html#sec:command_line_warnings

BUILD FAILED in 4m 26s
Build step 'Invoke Gradle script' changed build result to FAILURE
Build step 'Invoke Gradle script' marked build as failure

---------------------------------------------------------------------
To unsubscribe, e-mail: builds-unsubscribe@beam.apache.org
For additional commands, e-mail: builds-help@beam.apache.org


Mime
View raw message