beam-builds mailing list archives

Site index · List index
Message view « Date » · « Thread »
Top « Date » · « Thread »
From Apache Jenkins Server <jenk...@builds.apache.org>
Subject Build failed in Jenkins: beam_LoadTests_Go_Combine_Flink_Batch #214
Date Fri, 02 Jul 2021 08:47:29 GMT
See <https://ci-beam.apache.org/job/beam_LoadTests_Go_Combine_Flink_Batch/214/display/redirect?page=changes>

Changes:

[ajamato] [BEAM-11994] Update ShortIdMap's maps to only use valid keyable fields

[noreply] Update _index.md

[editgym] Add support for BigQuery data types aliases to BigQueryAvroUtils

[noreply] Add MatchContinuously PTransform to Python SDK (#15106)

[ajthomas] Expose ReadAllFromTFRecord as public in tfrecordio

[noreply] [BEAM-10955] Fix Flink Java Runner test flake: Could not find Flink job

[noreply] [BEAM-12548] Add examples of Equals and EqualsList to equals_test.go

[Luke Cwik] [BEAM-12422] Remove all optional logging libraries as Netty attempts to

[noreply] [BEAM-12076] Adds a Kafka external read transform for reading with

[noreply] [BEAM-10937] Tour of Beam Windowing notebook (#14962)


------------------------------------------
[...truncated 47.05 KB...]
    value: <
      spec: <
        urn: "beam:go:coder:custom:v1"
        payload: "Cgl0b3AuYWNjdW0ScAgaSmxnaXRodWIuY29tL2FwYWNoZS9iZWFtL3Nka3MvZ28vdGVzdC9sb2FkL3ZlbmRvci9naXRodWIuY29tL2FwYWNoZS9iZWFtL3Nka3MvZ28vcGtnL2JlYW0vdHJhbnNmb3Jtcy90b3AuYWNjdW0a/AEKdWdpdGh1Yi5jb20vYXBhY2hlL2JlYW0vc2Rrcy9nby90ZXN0L2xvYWQvdmVuZG9yL2dpdGh1Yi5jb20vYXBhY2hlL2JlYW0vc2Rrcy9nby9wa2cvYmVhbS90cmFuc2Zvcm1zL3RvcC5hY2N1bUVuYy5mdW5jMRKCAQgWInAIGkpsZ2l0aHViLmNvbS9hcGFjaGUvYmVhbS9zZGtzL2dvL3Rlc3QvbG9hZC92ZW5kb3IvZ2l0aHViLmNvbS9hcGFjaGUvYmVhbS9zZGtzL2dvL3BrZy9iZWFtL3RyYW5zZm9ybXMvdG9wLmFjY3VtKgYIFBICCAgqBAgZQAEi/AEKdWdpdGh1Yi5jb20vYXBhY2hlL2JlYW0vc2Rrcy9nby90ZXN0L2xvYWQvdmVuZG9yL2dpdGh1Yi5jb20vYXBhY2hlL2JlYW0vc2Rrcy9nby9wa2cvYmVhbS90cmFuc2Zvcm1zL3RvcC5hY2N1bURlYy5mdW5jMRKCAQgWIgYIFBICCAgqcAgaSmxnaXRodWIuY29tL2FwYWNoZS9iZWFtL3Nka3MvZ28vdGVzdC9sb2FkL3ZlbmRvci9naXRodWIuY29tL2FwYWNoZS9iZWFtL3Nka3MvZ28vcGtnL2JlYW0vdHJhbnNmb3Jtcy90b3AuYWNjdW0qBAgZQAE="
      >
    >
  >
  coders: <
    key: "c12"
    value: <
      spec: <
        urn: "beam:coder:length_prefix:v1"
      >
      component_coder_ids: "c11"
    >
  >
  coders: <
    key: "c2"
    value: <
      spec: <
        urn: "beam:coder:global_window:v1"
      >
    >
  >
  coders: <
    key: "c3"
    value: <
      spec: <
        urn: "beam:go:coder:custom:v1"
        payload: "CgRqc29uEgoIFBIGCBQSAggIGnkKX2dpdGh1Yi5jb20vYXBhY2hlL2JlYW0vc2Rrcy9nby90ZXN0L2xvYWQvdmVuZG9yL2dpdGh1Yi5jb20vYXBhY2hlL2JlYW0vc2Rrcy9nby9wa2cvYmVhbS5qc29uRW5jEhYIFiIECBlADyoGCBQSAggIKgQIGUABIn8KX2dpdGh1Yi5jb20vYXBhY2hlL2JlYW0vc2Rrcy9nby90ZXN0L2xvYWQvdmVuZG9yL2dpdGh1Yi5jb20vYXBhY2hlL2JlYW0vc2Rrcy9nby9wa2cvYmVhbS5qc29uRGVjEhwIFiIECBlAAyIGCBQSAggIKgQIGUAPKgQIGUAB"
      >
    >
  >
  coders: <
    key: "c4"
    value: <
      spec: <
        urn: "beam:coder:length_prefix:v1"
      >
      component_coder_ids: "c3"
    >
  >
  coders: <
    key: "c5"
    value: <
      spec: <
        urn: "beam:coder:kv:v1"
      >
      component_coder_ids: "c0"
      component_coder_ids: "c4"
    >
  >
  coders: <
    key: "c6"
    value: <
      spec: <
        urn: "beam:coder:row:v1"
        payload: "\n\032\n\013NumElements\032\013:\t\n\003int\032\002\020\004\n\034\n\rInitialSplits\032\013:\t\n\003int\032\002\020\004\n\026\n\007KeySize\032\013:\t\n\003int\032\002\020\004\n\030\n\tValueSize\032\013:\t\n\003int\032\002\020\004\n\031\n\nNumHotKeys\032\013:\t\n\003int\032\002\020\004\n\024\n\016HotKeyFraction\032\002\020\006\022$f691cccd-3963-4ed9-9f25-d9fdfd07b30d"
      >
    >
  >
  coders: <
    key: "c7"
    value: <
      spec: <
        urn: "beam:go:coder:custom:v1"
        payload: "ChdvZmZzZXRyYW5nZS5SZXN0cmljdGlvbhKAAQgaSnxnaXRodWIuY29tL2FwYWNoZS9iZWFtL3Nka3MvZ28vdGVzdC9sb2FkL3ZlbmRvci9naXRodWIuY29tL2FwYWNoZS9iZWFtL3Nka3MvZ28vcGtnL2JlYW0vaW8vcnRyYWNrZXJzL29mZnNldHJhbmdlLlJlc3RyaWN0aW9uGpACCnhnaXRodWIuY29tL2FwYWNoZS9iZWFtL3Nka3MvZ28vdGVzdC9sb2FkL3ZlbmRvci9naXRodWIuY29tL2FwYWNoZS9iZWFtL3Nka3MvZ28vcGtnL2JlYW0vaW8vcnRyYWNrZXJzL29mZnNldHJhbmdlLnJlc3RFbmMSkwEIFiKAAQgaSnxnaXRodWIuY29tL2FwYWNoZS9iZWFtL3Nka3MvZ28vdGVzdC9sb2FkL3ZlbmRvci9naXRodWIuY29tL2FwYWNoZS9iZWFtL3Nka3MvZ28vcGtnL2JlYW0vaW8vcnRyYWNrZXJzL29mZnNldHJhbmdlLlJlc3RyaWN0aW9uKgYIFBICCAgqBAgZQAEikAIKeGdpdGh1Yi5jb20vYXBhY2hlL2JlYW0vc2Rrcy9nby90ZXN0L2xvYWQvdmVuZG9yL2dpdGh1Yi5jb20vYXBhY2hlL2JlYW0vc2Rrcy9nby9wa2cvYmVhbS9pby9ydHJhY2tlcnMvb2Zmc2V0cmFuZ2UucmVzdERlYxKTAQgWIgYIFBICCAgqgAEIGkp8Z2l0aHViLmNvbS9hcGFjaGUvYmVhbS9zZGtzL2dvL3Rlc3QvbG9hZC92ZW5kb3IvZ2l0aHViLmNvbS9hcGFjaGUvYmVhbS9zZGtzL2dvL3BrZy9iZWFtL2lvL3J0cmFja2Vycy9vZmZzZXRyYW5nZS5SZXN0cmljdGlvbioECBlAAQ=="
      >
    >
  >
  coders: <
    key: "c8"
    value: <
      spec: <
        urn: "beam:coder:length_prefix:v1"
      >
      component_coder_ids: "c7"
    >
  >
  coders: <
    key: "c9"
    value: <
      spec: <
        urn: "beam:coder:iterable:v1"
      >
      component_coder_ids: "c0"
    >
  >
  environments: <
    key: "go"
    value: <
      urn: "beam:env:docker:v1"
      payload: "\n>gcr.io/apache-beam-testing/beam_portability/beam_go_sdk:latest"
      capabilities: "beam:protocol:progress_reporting:v0"
      capabilities: "beam:protocol:multi_core_bundle_processing:v1"
      capabilities: "beam:version:sdk_base:go"
      capabilities: "beam:coder:bytes:v1"
      capabilities: "beam:coder:bool:v1"
      capabilities: "beam:coder:varint:v1"
      capabilities: "beam:coder:double:v1"
      capabilities: "beam:coder:string_utf8:v1"
      capabilities: "beam:coder:length_prefix:v1"
      capabilities: "beam:coder:kv:v1"
      capabilities: "beam:coder:iterable:v1"
      capabilities: "beam:coder:state_backed_iterable:v1"
      capabilities: "beam:coder:windowed_value:v1"
      capabilities: "beam:coder:global_window:v1"
      capabilities: "beam:coder:interval_window:v1"
      dependencies: <
        type_urn: "beam:artifact:type:go_****_binary:v1"
        role_urn: "beam:artifact:role:staging_to:v1"
        role_payload: "\n\006****"
      >
    >
  >
>
root_transform_ids: "s1"
root_transform_ids: "e4"
root_transform_ids: "s2"
root_transform_ids: "e7"
root_transform_ids: "e8"
requirements: "beam:requirement:pardo:splittable_dofn:v1"
2021/07/02 08:47:23 Prepared job with id: load-tests-go-flink-batch-combine-1-0702065326_7c0816de-0fb8-46f0-b19c-fcc9ed8d0b32
and staging token: load-tests-go-flink-batch-combine-1-0702065326_7c0816de-0fb8-46f0-b19c-fcc9ed8d0b32
2021/07/02 08:47:23 Using specified **** binary: 'linux_amd64/combine'
2021/07/02 08:47:26 Staged binary artifact with token: 
2021/07/02 08:47:27 Submitted job: load0tests0go0flink0batch0combine0100702065326-root-0702084726-bf400468_2c7c80c0-ce0f-41a2-b4c3-99296203cc73
2021/07/02 08:47:27 Job state: STOPPED
2021/07/02 08:47:27 Job state: STARTING
2021/07/02 08:47:27 Job state: RUNNING
2021/07/02 08:47:27  (): org.apache.beam.vendor.guava.v26_0_jre.com.google.common.util.concurrent.UncheckedExecutionException:
org.apache.beam.vendor.guava.v26_0_jre.com.google.common.util.concurrent.UncheckedExecutionException:
org.apache.beam.vendor.guava.v26_0_jre.com.google.common.util.concurrent.UncheckedExecutionException:
org.apache.beam.vendor.guava.v26_0_jre.com.google.common.util.concurrent.UncheckedExecutionException:
java.lang.IllegalArgumentException: Encountered unsupported logical type URN: int
	at org.apache.beam.vendor.guava.v26_0_jre.com.google.common.cache.LocalCache$Segment.get(LocalCache.java:2050)
	at org.apache.beam.vendor.guava.v26_0_jre.com.google.common.cache.LocalCache.get(LocalCache.java:3952)
	at org.apache.beam.vendor.guava.v26_0_jre.com.google.common.cache.LocalCache.getOrLoad(LocalCache.java:3974)
	at org.apache.beam.vendor.guava.v26_0_jre.com.google.common.cache.LocalCache$LocalLoadingCache.get(LocalCache.java:4958)
	at org.apache.beam.runners.core.construction.RehydratedComponents.getCoder(RehydratedComponents.java:168)
	at org.apache.beam.runners.fnexecution.wire.WireCoders.instantiateRunnerWireCoder(WireCoders.java:94)
	at org.apache.beam.runners.fnexecution.wire.WireCoders.instantiateRunnerWireCoder(WireCoders.java:75)
	at org.apache.beam.runners.flink.FlinkBatchPortablePipelineTranslator.translateExecutableStage(FlinkBatchPortablePipelineTranslator.java:311)
	at org.apache.beam.runners.flink.FlinkBatchPortablePipelineTranslator.translate(FlinkBatchPortablePipelineTranslator.java:272)
	at org.apache.beam.runners.flink.FlinkBatchPortablePipelineTranslator.translate(FlinkBatchPortablePipelineTranslator.java:118)
	at org.apache.beam.runners.flink.FlinkPipelineRunner.runPipelineWithTranslator(FlinkPipelineRunner.java:115)
	at org.apache.beam.runners.flink.FlinkPipelineRunner.run(FlinkPipelineRunner.java:85)
	at org.apache.beam.runners.jobsubmission.JobInvocation.runPipeline(JobInvocation.java:86)
	at org.apache.beam.vendor.guava.v26_0_jre.com.google.common.util.concurrent.TrustedListenableFutureTask$TrustedFutureInterruptibleTask.runInterruptibly(TrustedListenableFutureTask.java:125)
	at org.apache.beam.vendor.guava.v26_0_jre.com.google.common.util.concurrent.InterruptibleTask.run(InterruptibleTask.java:57)
	at org.apache.beam.vendor.guava.v26_0_jre.com.google.common.util.concurrent.TrustedListenableFutureTask.run(TrustedListenableFutureTask.java:78)
	at java.util.concurrent.ThreadPoolExecutor.runWorker(ThreadPoolExecutor.java:1149)
	at java.util.concurrent.ThreadPoolExecutor$Worker.run(ThreadPoolExecutor.java:624)
	at java.lang.Thread.run(Thread.java:748)
Caused by: org.apache.beam.vendor.guava.v26_0_jre.com.google.common.util.concurrent.UncheckedExecutionException:
org.apache.beam.vendor.guava.v26_0_jre.com.google.common.util.concurrent.UncheckedExecutionException:
org.apache.beam.vendor.guava.v26_0_jre.com.google.common.util.concurrent.UncheckedExecutionException:
java.lang.IllegalArgumentException: Encountered unsupported logical type URN: int
	at org.apache.beam.vendor.guava.v26_0_jre.com.google.common.cache.LocalCache$Segment.get(LocalCache.java:2050)
	at org.apache.beam.vendor.guava.v26_0_jre.com.google.common.cache.LocalCache.get(LocalCache.java:3952)
	at org.apache.beam.vendor.guava.v26_0_jre.com.google.common.cache.LocalCache.getOrLoad(LocalCache.java:3974)
	at org.apache.beam.vendor.guava.v26_0_jre.com.google.common.cache.LocalCache$LocalLoadingCache.get(LocalCache.java:4958)
	at org.apache.beam.runners.core.construction.RehydratedComponents.getCoder(RehydratedComponents.java:168)
	at org.apache.beam.runners.core.construction.CoderTranslation.fromKnownCoder(CoderTranslation.java:158)
	at org.apache.beam.runners.core.construction.CoderTranslation.fromProto(CoderTranslation.java:145)
	at org.apache.beam.runners.core.construction.RehydratedComponents$2.load(RehydratedComponents.java:87)
	at org.apache.beam.runners.core.construction.RehydratedComponents$2.load(RehydratedComponents.java:82)
	at org.apache.beam.vendor.guava.v26_0_jre.com.google.common.cache.LocalCache$LoadingValueReference.loadFuture(LocalCache.java:3528)
	at org.apache.beam.vendor.guava.v26_0_jre.com.google.common.cache.LocalCache$Segment.loadSync(LocalCache.java:2277)
	at org.apache.beam.vendor.guava.v26_0_jre.com.google.common.cache.LocalCache$Segment.lockedGetOrLoad(LocalCache.java:2154)
	at org.apache.beam.vendor.guava.v26_0_jre.com.google.common.cache.LocalCache$Segment.get(LocalCache.java:2044)
	... 18 more
Caused by: org.apache.beam.vendor.guava.v26_0_jre.com.google.common.util.concurrent.UncheckedExecutionException:
org.apache.beam.vendor.guava.v26_0_jre.com.google.common.util.concurrent.UncheckedExecutionException:
java.lang.IllegalArgumentException: Encountered unsupported logical type URN: int
	at org.apache.beam.vendor.guava.v26_0_jre.com.google.common.cache.LocalCache$Segment.get(LocalCache.java:2050)
	at org.apache.beam.vendor.guava.v26_0_jre.com.google.common.cache.LocalCache.get(LocalCache.java:3952)
	at org.apache.beam.vendor.guava.v26_0_jre.com.google.common.cache.LocalCache.getOrLoad(LocalCache.java:3974)
	at org.apache.beam.vendor.guava.v26_0_jre.com.google.common.cache.LocalCache$LocalLoadingCache.get(LocalCache.java:4958)
	at org.apache.beam.runners.core.construction.RehydratedComponents.getCoder(RehydratedComponents.java:168)
	at org.apache.beam.runners.core.construction.CoderTranslation.fromKnownCoder(CoderTranslation.java:158)
	at org.apache.beam.runners.core.construction.CoderTranslation.fromProto(CoderTranslation.java:145)
	at org.apache.beam.runners.core.construction.RehydratedComponents$2.load(RehydratedComponents.java:87)
	at org.apache.beam.runners.core.construction.RehydratedComponents$2.load(RehydratedComponents.java:82)
	at org.apache.beam.vendor.guava.v26_0_jre.com.google.common.cache.LocalCache$LoadingValueReference.loadFuture(LocalCache.java:3528)
	at org.apache.beam.vendor.guava.v26_0_jre.com.google.common.cache.LocalCache$Segment.loadSync(LocalCache.java:2277)
	at org.apache.beam.vendor.guava.v26_0_jre.com.google.common.cache.LocalCache$Segment.lockedGetOrLoad(LocalCache.java:2154)
	at org.apache.beam.vendor.guava.v26_0_jre.com.google.common.cache.LocalCache$Segment.get(LocalCache.java:2044)
	... 30 more
Caused by: org.apache.beam.vendor.guava.v26_0_jre.com.google.common.util.concurrent.UncheckedExecutionException:
java.lang.IllegalArgumentException: Encountered unsupported logical type URN: int
	at org.apache.beam.vendor.guava.v26_0_jre.com.google.common.cache.LocalCache$Segment.get(LocalCache.java:2050)
	at org.apache.beam.vendor.guava.v26_0_jre.com.google.common.cache.LocalCache.get(LocalCache.java:3952)
	at org.apache.beam.vendor.guava.v26_0_jre.com.google.common.cache.LocalCache.getOrLoad(LocalCache.java:3974)
	at org.apache.beam.vendor.guava.v26_0_jre.com.google.common.cache.LocalCache$LocalLoadingCache.get(LocalCache.java:4958)
	at org.apache.beam.runners.core.construction.RehydratedComponents.getCoder(RehydratedComponents.java:168)
	at org.apache.beam.runners.core.construction.CoderTranslation.fromKnownCoder(CoderTranslation.java:158)
	at org.apache.beam.runners.core.construction.CoderTranslation.fromProto(CoderTranslation.java:145)
	at org.apache.beam.runners.core.construction.RehydratedComponents$2.load(RehydratedComponents.java:87)
	at org.apache.beam.runners.core.construction.RehydratedComponents$2.load(RehydratedComponents.java:82)
	at org.apache.beam.vendor.guava.v26_0_jre.com.google.common.cache.LocalCache$LoadingValueReference.loadFuture(LocalCache.java:3528)
	at org.apache.beam.vendor.guava.v26_0_jre.com.google.common.cache.LocalCache$Segment.loadSync(LocalCache.java:2277)
	at org.apache.beam.vendor.guava.v26_0_jre.com.google.common.cache.LocalCache$Segment.lockedGetOrLoad(LocalCache.java:2154)
	at org.apache.beam.vendor.guava.v26_0_jre.com.google.common.cache.LocalCache$Segment.get(LocalCache.java:2044)
	... 42 more
Caused by: java.lang.IllegalArgumentException: Encountered unsupported logical type URN: int
	at org.apache.beam.sdk.schemas.SchemaTranslation.fieldTypeFromProtoWithoutNullable(SchemaTranslation.java:328)
	at org.apache.beam.sdk.schemas.SchemaTranslation.fieldTypeFromProto(SchemaTranslation.java:244)
	at org.apache.beam.sdk.schemas.SchemaTranslation.fieldFromProto(SchemaTranslation.java:238)
	at org.apache.beam.sdk.schemas.SchemaTranslation.schemaFromProto(SchemaTranslation.java:212)
	at org.apache.beam.runners.core.construction.CoderTranslators$8.fromComponents(CoderTranslators.java:169)
	at org.apache.beam.runners.core.construction.CoderTranslators$8.fromComponents(CoderTranslators.java:151)
	at org.apache.beam.runners.core.construction.CoderTranslation.fromKnownCoder(CoderTranslation.java:170)
	at org.apache.beam.runners.core.construction.CoderTranslation.fromProto(CoderTranslation.java:145)
	at org.apache.beam.runners.core.construction.RehydratedComponents$2.load(RehydratedComponents.java:87)
	at org.apache.beam.runners.core.construction.RehydratedComponents$2.load(RehydratedComponents.java:82)
	at org.apache.beam.vendor.guava.v26_0_jre.com.google.common.cache.LocalCache$LoadingValueReference.loadFuture(LocalCache.java:3528)
	at org.apache.beam.vendor.guava.v26_0_jre.com.google.common.cache.LocalCache$Segment.loadSync(LocalCache.java:2277)
	at org.apache.beam.vendor.guava.v26_0_jre.com.google.common.cache.LocalCache$Segment.lockedGetOrLoad(LocalCache.java:2154)
	at org.apache.beam.vendor.guava.v26_0_jre.com.google.common.cache.LocalCache$Segment.get(LocalCache.java:2044)
	... 54 more
2021/07/02 08:47:27  (): java.lang.IllegalArgumentException: Encountered unsupported logical
type URN: int
2021/07/02 08:47:27 Job state: FAILED
2021/07/02 08:47:27 Failed to execute job: job load0tests0go0flink0batch0combine0100702065326-root-0702084726-bf400468_2c7c80c0-ce0f-41a2-b4c3-99296203cc73
failed
panic: Failed to execute job: job load0tests0go0flink0batch0combine0100702065326-root-0702084726-bf400468_2c7c80c0-ce0f-41a2-b4c3-99296203cc73
failed

goroutine 1 [running]:
github.com/apache/beam/sdks/go/test/load/vendor/github.com/apache/beam/sdks/go/pkg/beam/log.Fatalf(0x11c1fc0,
0xc00003e0b0, 0x107ad57, 0x19, 0xc00058dee8, 0x1, 0x1)
	<https://ci-beam.apache.org/job/beam_LoadTests_Go_Combine_Flink_Batch/ws/src/sdks/go/test/load/.gogradle/project_gopath/src/github.com/apache/beam/sdks/go/test/load/vendor/github.com/apache/beam/sdks/go/pkg/beam/log/log.go>:153
+0xec
main.main()
	<https://ci-beam.apache.org/job/beam_LoadTests_Go_Combine_Flink_Batch/ws/src/sdks/go/test/load/.gogradle/project_gopath/src/github.com/apache/beam/sdks/go/test/load/combine/combine.go>:80
+0x452

> Task :sdks:go:test:load:run FAILED

FAILURE: Build failed with an exception.

* Where:
Build file '<https://ci-beam.apache.org/job/beam_LoadTests_Go_Combine_Flink_Batch/ws/src/sdks/go/test/load/build.gradle'>
line: 65

* What went wrong:
Execution failed for task ':sdks:go:test:load:run'.
> Process 'command 'sh'' finished with non-zero exit value 2

* Try:
Run with --stacktrace option to get the stack trace. Run with --info or --debug option to
get more log output. Run with --scan to get full insights.

* Get more help at https://help.gradle.org

Deprecated Gradle features were used in this build, making it incompatible with Gradle 7.0.
Use '--warning-mode all' to show the individual deprecation warnings.
See https://docs.gradle.org/6.8.3/userguide/command_line_interface.html#sec:command_line_warnings

BUILD FAILED in 4m 1s
6 actionable tasks: 6 executed

Publishing build scan...
https://gradle.com/s/rt6ybyjvfnm6m

Build step 'Invoke Gradle script' changed build result to FAILURE
Build step 'Invoke Gradle script' marked build as failure

---------------------------------------------------------------------
To unsubscribe, e-mail: builds-unsubscribe@beam.apache.org
For additional commands, e-mail: builds-help@beam.apache.org


Mime
View raw message