beam-builds mailing list archives

Site index · List index
Message view « Date » · « Thread »
Top « Date » · « Thread »
From Apache Jenkins Server <jenk...@builds.apache.org>
Subject Build failed in Jenkins: beam_PostCommit_Java_Nexmark_Dataflow_V2_Java11 #231
Date Wed, 21 Jul 2021 07:27:15 GMT
See <https://ci-beam.apache.org/job/beam_PostCommit_Java_Nexmark_Dataflow_V2_Java11/231/display/redirect?page=changes>

Changes:

[noreply] Update Container beam-master-20210720 (#15197)


------------------------------------------
[...truncated 689.38 KB...]
2021-07-21T07:20:51.965Z no activity
2021-07-21T07:21:07.004Z RUNNING Query7
2021-07-21T07:21:07.685Z sample of 63.6 sec not long enough to calculate steady-state event
rate
Jul 21, 2021 7:21:07 AM org.apache.beam.sdk.testutils.metrics.MetricsReader getCounterMetric
2021-07-21T07:21:07.736Z WARNING: streaming query appears to have been stuck for 56 min.
SEVERE: Failed to get metric fatal, from namespace Query7
2021-07-21T07:21:07.736Z no activity
2021-07-21T07:21:22.763Z RUNNING Query7
2021-07-21T07:21:23.558Z sample of 63.6 sec not long enough to calculate steady-state event
rate
Jul 21, 2021 7:21:23 AM org.apache.beam.sdk.testutils.metrics.MetricsReader getCounterMetric
SEVERE: Failed to get metric fatal, from namespace Query7
2021-07-21T07:21:23.641Z WARNING: streaming query appears to have been stuck for 57 min.
2021-07-21T07:21:23.641Z no activity
2021-07-21T07:21:38.681Z RUNNING Query7
2021-07-21T07:21:39.444Z sample of 63.6 sec not long enough to calculate steady-state event
rate
Jul 21, 2021 7:21:39 AM org.apache.beam.sdk.testutils.metrics.MetricsReader getCounterMetric
2021-07-21T07:21:39.489Z WARNING: streaming query appears to have been stuck for 57 min.
2021-07-21T07:21:39.489Z no activity
SEVERE: Failed to get metric fatal, from namespace Query7
2021-07-21T07:21:54.524Z RUNNING Query7
2021-07-21T07:21:55.168Z sample of 63.6 sec not long enough to calculate steady-state event
rate
Jul 21, 2021 7:21:55 AM org.apache.beam.sdk.testutils.metrics.MetricsReader getCounterMetric
2021-07-21T07:21:55.334Z WARNING: streaming query appears to have been stuck for 57 min.
SEVERE: Failed to get metric fatal, from namespace Query7
2021-07-21T07:21:55.334Z no activity
2021-07-21T07:22:10.371Z RUNNING Query7
2021-07-21T07:22:11.033Z sample of 63.6 sec not long enough to calculate steady-state event
rate
Jul 21, 2021 7:22:11 AM org.apache.beam.sdk.testutils.metrics.MetricsReader getCounterMetric
2021-07-21T07:22:11.086Z WARNING: streaming query appears to have been stuck for 57 min.
2021-07-21T07:22:11.086Z no activity
SEVERE: Failed to get metric fatal, from namespace Query7
2021-07-21T07:22:26.112Z RUNNING Query7
2021-07-21T07:22:26.839Z sample of 63.6 sec not long enough to calculate steady-state event
rate
Jul 21, 2021 7:22:26 AM org.apache.beam.sdk.testutils.metrics.MetricsReader getCounterMetric
2021-07-21T07:22:26.891Z WARNING: streaming query appears to have been stuck for 58 min.
SEVERE: Failed to get metric fatal, from namespace Query7
2021-07-21T07:22:26.891Z no activity
2021-07-21T07:22:41.928Z RUNNING Query7
2021-07-21T07:22:42.613Z sample of 63.6 sec not long enough to calculate steady-state event
rate
Jul 21, 2021 7:22:42 AM org.apache.beam.sdk.testutils.metrics.MetricsReader getCounterMetric
SEVERE: Failed to get metric fatal, from namespace Query7
2021-07-21T07:22:42.709Z WARNING: streaming query appears to have been stuck for 58 min.
2021-07-21T07:22:42.709Z no activity
2021-07-21T07:22:57.747Z RUNNING Query7
2021-07-21T07:22:58.478Z sample of 63.6 sec not long enough to calculate steady-state event
rate
Jul 21, 2021 7:22:58 AM org.apache.beam.sdk.testutils.metrics.MetricsReader getCounterMetric
2021-07-21T07:22:58.542Z WARNING: streaming query appears to have been stuck for 58 min.
SEVERE: Failed to get metric fatal, from namespace Query7
2021-07-21T07:22:58.542Z no activity
2021-07-21T07:23:13.574Z RUNNING Query7
2021-07-21T07:23:14.462Z sample of 63.6 sec not long enough to calculate steady-state event
rate
Jul 21, 2021 7:23:14 AM org.apache.beam.sdk.testutils.metrics.MetricsReader getCounterMetric
2021-07-21T07:23:14.600Z WARNING: streaming query appears to have been stuck for 58 min.
2021-07-21T07:23:14.600Z no activity
SEVERE: Failed to get metric fatal, from namespace Query7
2021-07-21T07:23:29.630Z RUNNING Query7
2021-07-21T07:23:30.530Z sample of 63.6 sec not long enough to calculate steady-state event
rate
Jul 21, 2021 7:23:30 AM org.apache.beam.sdk.testutils.metrics.MetricsReader getCounterMetric
2021-07-21T07:23:30.584Z WARNING: streaming query appears to have been stuck for 59 min.
2021-07-21T07:23:30.585Z no activity
SEVERE: Failed to get metric fatal, from namespace Query7
2021-07-21T07:23:45.618Z RUNNING Query7
2021-07-21T07:23:46.340Z sample of 63.6 sec not long enough to calculate steady-state event
rate
Jul 21, 2021 7:23:46 AM org.apache.beam.sdk.testutils.metrics.MetricsReader getCounterMetric
2021-07-21T07:23:46.426Z WARNING: streaming query appears to have been stuck for 59 min.
2021-07-21T07:23:46.426Z no activity
SEVERE: Failed to get metric fatal, from namespace Query7
2021-07-21T07:24:01.463Z RUNNING Query7
2021-07-21T07:24:02.196Z sample of 63.6 sec not long enough to calculate steady-state event
rate
Jul 21, 2021 7:24:02 AM org.apache.beam.sdk.testutils.metrics.MetricsReader getCounterMetric
SEVERE: Failed to get metric fatal, from namespace Query7
2021-07-21T07:24:02.291Z WARNING: streaming query appears to have been stuck for 59 min.
2021-07-21T07:24:02.291Z no activity
2021-07-21T07:24:17.323Z RUNNING Query7
2021-07-21T07:24:18.022Z sample of 63.6 sec not long enough to calculate steady-state event
rate
Jul 21, 2021 7:24:18 AM org.apache.beam.sdk.testutils.metrics.MetricsReader getCounterMetric
2021-07-21T07:24:18.115Z WARNING: streaming query appears to have been stuck for 59 min.
SEVERE: Failed to get metric fatal, from namespace Query7
2021-07-21T07:24:18.115Z no activity
2021-07-21T07:24:33.155Z RUNNING Query7
2021-07-21T07:24:33.875Z sample of 63.6 sec not long enough to calculate steady-state event
rate
Jul 21, 2021 7:24:33 AM org.apache.beam.sdk.testutils.metrics.MetricsReader getCounterMetric
SEVERE: Failed to get metric fatal, from namespace Query7
2021-07-21T07:24:33.963Z ERROR: streaming query appears to have been stuck for 60 minutes,
cancelling job.
2021-07-21T07:24:34.001Z no activity
2021-07-21T07:24:49.076Z RUNNING Query7 (waiting for shutdown)
2021-07-21T07:24:49.727Z sample of 63.6 sec not long enough to calculate steady-state event
rate
2021-07-21T07:24:49.727Z no activity
2021-07-21T07:25:04.793Z RUNNING Query7 (waiting for shutdown)
2021-07-21T07:25:05.453Z sample of 63.6 sec not long enough to calculate steady-state event
rate
2021-07-21T07:25:05.453Z no activity
2021-07-21T07:25:20.511Z RUNNING Query7 (waiting for shutdown)
2021-07-21T07:25:21.155Z sample of 63.6 sec not long enough to calculate steady-state event
rate
2021-07-21T07:25:21.155Z no activity
2021-07-21T07:25:36.184Z RUNNING Query7 (waiting for shutdown)
2021-07-21T07:25:36.774Z sample of 63.6 sec not long enough to calculate steady-state event
rate
2021-07-21T07:25:36.774Z no activity
2021-07-21T07:25:51.809Z RUNNING Query7 (waiting for shutdown)
2021-07-21T07:25:52.512Z sample of 63.6 sec not long enough to calculate steady-state event
rate
2021-07-21T07:25:52.512Z no activity
2021-07-21T07:26:07.597Z RUNNING Query7 (waiting for shutdown)
2021-07-21T07:26:08.264Z sample of 63.6 sec not long enough to calculate steady-state event
rate
2021-07-21T07:26:08.264Z no activity
2021-07-21T07:26:23.338Z RUNNING Query7 (waiting for shutdown)
2021-07-21T07:26:24.007Z sample of 63.6 sec not long enough to calculate steady-state event
rate
2021-07-21T07:26:24.007Z no activity
2021-07-21T07:26:39.044Z RUNNING Query7 (waiting for shutdown)
2021-07-21T07:26:39.671Z sample of 63.6 sec not long enough to calculate steady-state event
rate
2021-07-21T07:26:39.671Z no activity
2021-07-21T07:26:54.718Z RUNNING Query7 (waiting for shutdown)
2021-07-21T07:26:55.415Z sample of 63.6 sec not long enough to calculate steady-state event
rate
2021-07-21T07:26:55.416Z no activity
2021-07-21T07:27:10.463Z CANCELLED Query7 (waiting for shutdown)
2021-07-21T07:27:10.508Z sample of 63.6 sec not long enough to calculate steady-state event
rate

==========================================================================================
Run started 2021-07-21T06:16:05.425Z and ran for PT4265.084S

Default configuration:
{"debug":true,"query":null,"sourceType":"DIRECT","generateEventFilePathPrefix":null,"sinkType":"DEVNULL","exportSummaryToBigQuery":false,"pubSubMode":"COMBINED","pubsubMessageSerializationMethod":"CODER","sideInputType":"DIRECT","sideInputRowCount":500,"sideInputNumShards":3,"sideInputUrl":null,"sessionGap":600000,"numEvents":100000,"numEventGenerators":100,"rateShape":"SINE","firstEventRate":10000,"nextEventRate":10000,"rateUnit":"PER_SECOND","ratePeriodSec":600,"preloadSeconds":0,"streamTimeout":240,"isRateLimited":false,"useWallclockEventTime":false,"avgPersonByteSize":200,"avgAuctionByteSize":500,"avgBidByteSize":100,"hotAuctionRatio":2,"hotSellersRatio":4,"hotBiddersRatio":4,"windowSizeSec":10,"windowPeriodSec":5,"watermarkHoldbackSec":0,"numInFlightAuctions":100,"numActivePeople":1000,"coderStrategy":"HAND","cpuDelayMs":0,"diskBusyBytes":0,"auctionSkip":123,"fanout":5,"maxAuctionsWaitingTime":600,"occasionalDelaySec":3,"probDelayedEvent":0.1,"maxLogEvents":100000,"usePubsubPublishTime":false,"outOfOrderGroupSize":1,"numKeyBuckets":20000,"pardoCPUFactor":1.0}

Configurations:
  Conf  Description
  0000  query:PASSTHROUGH; numEvents:10000000
  0001  query:CURRENCY_CONVERSION; numEvents:10000000
  0002  query:SELECTION; numEvents:10000000
  0003  query:LOCAL_ITEM_SUGGESTION; numEvents:10000000
  0004  query:AVERAGE_PRICE_FOR_CATEGORY; numEvents:1000000
  0005  query:HOT_ITEMS; numEvents:10000000
  0006  query:AVERAGE_SELLING_PRICE_BY_SELLER; numEvents:1000000
  0007  query:HIGHEST_BID; numEvents:10000000
  0008  query:MONITOR_NEW_USERS; numEvents:10000000
  0009  query:WINNING_BIDS; numEvents:1000000
  0010  query:LOG_TO_SHARDED_FILES; numEvents:10000000
  0011  query:USER_SESSIONS; numEvents:10000000
  0012  query:PROCESSING_TIME_WINDOWS; numEvents:10000000
  0013  query:PORTABILITY_BATCH; numEvents:10000000
  0014  query:BOUNDED_SIDE_INPUT_JOIN; numEvents:10000000
  0015  query:SESSION_SIDE_INPUT_JOIN; numEvents:10000000

Performance:
  Conf  Runtime(sec)    (Baseline)  Events(/sec)    (Baseline)       Results    (Baseline)
  0000          39.4                    195196.9                     7696417             

  0001          28.5                    286403.9                     7522113             

  0002          20.7                    456880.6                       75337             

  0003          82.3                    120490.6                       58760             

  0004  *** not run ***
  0005         416.9                     23746.0                        4544             

  0006  *** not run ***
  0007         301.4                     32914.3                         100             

        *** Cancelling streaming job since it appeared stuck for 60 min. ***
  0008         155.9                     64159.7                       92833             

  0009  *** not run ***
  0010         178.9                     55184.6                         100             

  0011         502.5                     19902.4                     1839657             

  0012         132.0                     75750.1                      265623             

  0013  *** not run ***
  0014  *** not run ***
  0015  *** not run ***
==========================================================================================


==========================================================================================
Run started 2021-07-21T06:16:05.425Z and ran for PT4265.306S

Default configuration:
{"debug":true,"query":null,"sourceType":"DIRECT","generateEventFilePathPrefix":null,"sinkType":"DEVNULL","exportSummaryToBigQuery":false,"pubSubMode":"COMBINED","pubsubMessageSerializationMethod":"CODER","sideInputType":"DIRECT","sideInputRowCount":500,"sideInputNumShards":3,"sideInputUrl":null,"sessionGap":600000,"numEvents":100000,"numEventGenerators":100,"rateShape":"SINE","firstEventRate":10000,"nextEventRate":10000,"rateUnit":"PER_SECOND","ratePeriodSec":600,"preloadSeconds":0,"streamTimeout":240,"isRateLimited":false,"useWallclockEventTime":false,"avgPersonByteSize":200,"avgAuctionByteSize":500,"avgBidByteSize":100,"hotAuctionRatio":2,"hotSellersRatio":4,"hotBiddersRatio":4,"windowSizeSec":10,"windowPeriodSec":5,"watermarkHoldbackSec":0,"numInFlightAuctions":100,"numActivePeople":1000,"coderStrategy":"HAND","cpuDelayMs":0,"diskBusyBytes":0,"auctionSkip":123,"fanout":5,"maxAuctionsWaitingTime":600,"occasionalDelaySec":3,"probDelayedEvent":0.1,"maxLogEvents":100000,"usePubsubPublishTime":false,"outOfOrderGroupSize":1,"numKeyBuckets":20000,"pardoCPUFactor":1.0}

Configurations:
  Conf  Description
  0000  query:PASSTHROUGH; numEvents:10000000
  0001  query:CURRENCY_CONVERSION; numEvents:10000000
  0002  query:SELECTION; numEvents:10000000
  0003  query:LOCAL_ITEM_SUGGESTION; numEvents:10000000
  0004  query:AVERAGE_PRICE_FOR_CATEGORY; numEvents:1000000
  0005  query:HOT_ITEMS; numEvents:10000000
  0006  query:AVERAGE_SELLING_PRICE_BY_SELLER; numEvents:1000000
  0007  query:HIGHEST_BID; numEvents:10000000
  0008  query:MONITOR_NEW_USERS; numEvents:10000000
  0009  query:WINNING_BIDS; numEvents:1000000
  0010  query:LOG_TO_SHARDED_FILES; numEvents:10000000
  0011  query:USER_SESSIONS; numEvents:10000000
  0012  query:PROCESSING_TIME_WINDOWS; numEvents:10000000
  0013  query:PORTABILITY_BATCH; numEvents:10000000
  0014  query:BOUNDED_SIDE_INPUT_JOIN; numEvents:10000000
  0015  query:SESSION_SIDE_INPUT_JOIN; numEvents:10000000

Performance:
  Conf  Runtime(sec)    (Baseline)  Events(/sec)    (Baseline)       Results    (Baseline)
  0000          39.4                    195196.9                     7696417             

  0001          28.5                    286403.9                     7522113             

  0002          20.7                    456880.6                       75337             

  0003          82.3                    120490.6                       58760             

  0004  *** not run ***
  0005         416.9                     23746.0                        4544             

  0006  *** not run ***
  0007         301.4                     32914.3                         100             

        *** Cancelling streaming job since it appeared stuck for 60 min. ***
  0008         155.9                     64159.7                       92833             

  0009  *** not run ***
  0010         178.9                     55184.6                         100             

  0011         502.5                     19902.4                     1839657             

  0012         132.0                     75750.1                      265623             

  0013  *** not run ***
  0014  *** not run ***
  0015  *** not run ***
==========================================================================================

Exception in thread "main" java.lang.RuntimeException: Execution was not successful
	at org.apache.beam.sdk.nexmark.Main.runAll(Main.java:186)
	at org.apache.beam.sdk.nexmark.Main.main(Main.java:495)

> Task :sdks:java:testing:nexmark:run FAILED

> Task :runners:google-cloud-dataflow-java:cleanUpDockerImages
Untagged: us.gcr.io/apache-beam-testing/java-postcommit-it/java:20210721061529
Untagged: us.gcr.io/apache-beam-testing/java-postcommit-it/java@sha256:94f76d98d13d1b32d997ac67ad45aa54fabcf01b92680c109120a3a38bda5e99
Digests:
- us.gcr.io/apache-beam-testing/java-postcommit-it/java@sha256:94f76d98d13d1b32d997ac67ad45aa54fabcf01b92680c109120a3a38bda5e99
  Associated tags:
 - 20210721061529
Tags:
- us.gcr.io/apache-beam-testing/java-postcommit-it/java:20210721061529
Deleted [us.gcr.io/apache-beam-testing/java-postcommit-it/java:20210721061529].
Deleted [us.gcr.io/apache-beam-testing/java-postcommit-it/java@sha256:94f76d98d13d1b32d997ac67ad45aa54fabcf01b92680c109120a3a38bda5e99].

FAILURE: Build failed with an exception.

* What went wrong:
Execution failed for task ':sdks:java:testing:nexmark:run'.
> Process 'command '/usr/lib/jvm/java-8-openjdk-amd64/bin/java'' finished with non-zero
exit value 1

* Try:
Run with --stacktrace option to get the stack trace. Run with --info or --debug option to
get more log output. Run with --scan to get full insights.

* Get more help at https://help.gradle.org

Deprecated Gradle features were used in this build, making it incompatible with Gradle 7.0.
Use '--warning-mode all' to show the individual deprecation warnings.
See https://docs.gradle.org/6.8.3/userguide/command_line_interface.html#sec:command_line_warnings

BUILD FAILED in 1h 11m 46s
129 actionable tasks: 15 executed, 114 up-to-date

Publishing build scan...
https://gradle.com/s/xetj6rjb25uck

Build step 'Invoke Gradle script' changed build result to FAILURE
Build step 'Invoke Gradle script' marked build as failure

---------------------------------------------------------------------
To unsubscribe, e-mail: builds-unsubscribe@beam.apache.org
For additional commands, e-mail: builds-help@beam.apache.org


Mime
View raw message