beam-builds mailing list archives

Site index · List index
Message view « Date » · « Thread »
Top « Date » · « Thread »
From Apache Jenkins Server <jenk...@builds.apache.org>
Subject Build failed in Jenkins: beam_PostCommit_Java_VR_Dataflow_V2_Streaming #1004
Date Tue, 20 Jul 2021 10:50:35 GMT
See <https://ci-beam.apache.org/job/beam_PostCommit_Java_VR_Dataflow_V2_Streaming/1004/display/redirect?page=changes>

Changes:

[noreply] Fix spelling.


------------------------------------------
[...truncated 98.62 KB...]
org.apache.beam.sdk.transforms.ViewTest > testIterableSideInput FAILED
    java.lang.RuntimeException at ViewTest.java:438

org.apache.beam.sdk.transforms.ParDoTest$TimerCoderInferenceTests > testValueStateCoderInference
FAILED
    java.lang.RuntimeException at ParDoTest.java:5260

org.apache.beam.sdk.transforms.CombineTest$BasicTests > testCombinePerKeyLambda FAILED
    java.lang.RuntimeException at CombineTest.java:906

org.apache.beam.sdk.io.CountingSourceTest > testUnboundedSourceSplits FAILED
    java.lang.RuntimeException at CountingSourceTest.java:243

org.apache.beam.sdk.transforms.SplittableDoFnTest > testWindowedSideInputUnbounded FAILED
    java.lang.RuntimeException at SplittableDoFnTest.java:434

org.apache.beam.sdk.transforms.ViewTest > testEmptyMultimapSideInputWithNonDeterministicKeyCoder
FAILED
    java.lang.RuntimeException at ViewTest.java:906

org.apache.beam.sdk.transforms.GroupByKeyTest > org.apache.beam.sdk.transforms.GroupByKeyTest$WindowTests.testGroupByKeyMergingWindows
FAILED
    java.lang.RuntimeException at GroupByKeyTest.java:586

org.apache.beam.sdk.transforms.CombineTest$BasicTests > testHotKeyCombining FAILED
    java.lang.RuntimeException at CombineTest.java:735

org.apache.beam.sdk.transforms.SplittableDoFnTest > testPairWithIndexWindowedTimestampedUnbounded
FAILED
    java.lang.RuntimeException at SplittableDoFnTest.java:229

org.apache.beam.sdk.transforms.ViewTest > testEmptyMapSideInput FAILED
    java.lang.RuntimeException at ViewTest.java:1219

org.apache.beam.sdk.transforms.GroupByKeyTest > org.apache.beam.sdk.transforms.GroupByKeyTest$WindowTests.testGroupByKeyMultipleWindows
FAILED
    java.lang.RuntimeException at GroupByKeyTest.java:558

org.apache.beam.sdk.transforms.CombineTest$BasicTests > testSimpleCombineEmpty FAILED
    java.lang.RuntimeException at CombineTest.java:669

org.apache.beam.sdk.transforms.SplittableDoFnTest > testWindowedSideInputWithCheckpointsUnbounded
FAILED
    java.lang.RuntimeException at SplittableDoFnTest.java:569

org.apache.beam.sdk.transforms.ViewTest > testMapSideInputIsImmutable FAILED
    java.lang.RuntimeException at ViewTest.java:1344

org.apache.beam.sdk.transforms.CombineTest$BasicTests > testSimpleCombine FAILED
    java.lang.RuntimeException at CombineTest.java:660

org.apache.beam.sdk.transforms.GroupByKeyTest > org.apache.beam.sdk.transforms.GroupByKeyTest$WindowTests.testGroupByKeyAndWindows
FAILED
    java.lang.RuntimeException at GroupByKeyTest.java:528

org.apache.beam.sdk.transforms.SplittableDoFnTest > testSideInputUnbounded FAILED
    java.lang.RuntimeException at SplittableDoFnTest.java:382

org.apache.beam.sdk.transforms.ViewTest > testWindowedMapAsEntrySetSideInput FAILED
    java.lang.RuntimeException at ViewTest.java:1141

org.apache.beam.sdk.transforms.CombineTest$BasicTests > testBinaryCombinePerKeyLambda FAILED
    java.lang.RuntimeException at CombineTest.java:920

org.apache.beam.sdk.transforms.GroupByKeyTest > org.apache.beam.sdk.transforms.GroupByKeyTest$BasicTests.testTimestampCombinerLatest
FAILED
    java.lang.RuntimeException at GroupByKeyTest.java:396

org.apache.beam.sdk.metrics.MetricsTest$AttemptedMetricTests > testAttemptedDistributionMetrics
FAILED
    java.lang.RuntimeException at MetricsTest.java:377

org.apache.beam.sdk.transforms.ViewTest > testEmptyMapSideInputWithNonDeterministicKeyCoder
FAILED
    java.lang.RuntimeException at ViewTest.java:1253

org.apache.beam.sdk.transforms.CombineTest$BasicTests > testHotKeyCombiningWithAccumulationMode
FAILED
    java.lang.RuntimeException at CombineTest.java:760

org.apache.beam.sdk.transforms.GroupByKeyTest > org.apache.beam.sdk.transforms.GroupByKeyTest$BasicTests.testGroupByKeyEmpty
FAILED
    java.lang.RuntimeException at GroupByKeyTest.java:153

org.apache.beam.sdk.metrics.MetricsTest$AttemptedMetricTests > testAttemptedCounterMetrics
FAILED
    java.lang.RuntimeException at MetricsTest.java:369

org.apache.beam.sdk.transforms.ViewTest > testMultimapAsEntrySetSideInput FAILED
    java.lang.RuntimeException at ViewTest.java:623

org.apache.beam.sdk.transforms.CombineTest$BasicTests > testBasicCombineEmpty FAILED
    java.lang.RuntimeException at CombineTest.java:686

org.apache.beam.sdk.transforms.GroupByKeyTest > org.apache.beam.sdk.transforms.GroupByKeyTest$BasicTests.testTimestampCombinerEarliest
FAILED
    java.lang.RuntimeException at GroupByKeyTest.java:376

org.apache.beam.sdk.transforms.ViewTest > testSingletonSideInput FAILED
    java.lang.RuntimeException at ViewTest.java:114

org.apache.beam.sdk.transforms.ParDoTest$TimerFamilyTests > testTimerWithMultipleTimerFamilyUnbounded
FAILED
    java.lang.RuntimeException at ParDoTest.java:5715

org.apache.beam.sdk.transforms.GroupByKeyTest > org.apache.beam.sdk.transforms.GroupByKeyTest$BasicTests.testGroupByKey
FAILED
    java.lang.RuntimeException at GroupByKeyTest.java:136

org.apache.beam.sdk.transforms.CombineTest$AccumulationTests > testAccumulatingCombine
FAILED
    java.lang.RuntimeException at CombineTest.java:1443

org.apache.beam.sdk.transforms.ParDoTest$TimerFamilyTests > testTimerWithMultipleTimerFamilyBounded
FAILED
    java.lang.RuntimeException at ParDoTest.java:5715

org.apache.beam.sdk.transforms.GroupByKeyTest > org.apache.beam.sdk.transforms.GroupByKeyTest$BasicTests.testGroupByKeyWithBadEqualsHashCode
FAILED
    java.lang.RuntimeException at GroupByKeyTest.java:453

org.apache.beam.sdk.transforms.ParDoTest$TimerFamilyTests > testTimerFamilyAndTimerBounded
FAILED
    java.lang.RuntimeException at ParDoTest.java:5776

org.apache.beam.sdk.transforms.CombineTest$AccumulationTests > testAccumulatingCombineEmpty
FAILED
    java.lang.RuntimeException at CombineTest.java:1452

org.apache.beam.sdk.transforms.ParDoTest$KeyTests > testKeyInOnTimer FAILED
    java.lang.RuntimeException at ParDoTest.java:5856

org.apache.beam.sdk.transforms.ParDoTest$TimerFamilyTests > testTimerFamilyAndTimerUnbounded
FAILED
    java.lang.RuntimeException at ParDoTest.java:5776

org.apache.beam.sdk.transforms.ParDoTest$KeyTests > testKeyInOnTimerWithGenericKey FAILED
    java.lang.RuntimeException at ParDoTest.java:5890

org.apache.beam.sdk.transforms.ParDoTest$TimerFamilyTests > testTimerFamilyEventTimeBounded
FAILED
    java.lang.RuntimeException at ParDoTest.java:5653

org.apache.beam.sdk.transforms.ParDoTest$TimerFamilyTests > testTimerFamilyEventTimeUnbounded
FAILED
    java.lang.RuntimeException at ParDoTest.java:5653

org.apache.beam.sdk.transforms.ParDoSchemaTest > testReadAndWrite FAILED
    java.lang.RuntimeException at ParDoSchemaTest.java:168

org.apache.beam.sdk.transforms.ParDoSchemaTest > testSchemasPassedThrough FAILED
    java.lang.RuntimeException at ParDoSchemaTest.java:438

org.apache.beam.sdk.transforms.ParDoSchemaTest > testSchemaFieldSelectionNested FAILED
    java.lang.RuntimeException at ParDoSchemaTest.java:651

org.apache.beam.sdk.transforms.ParDoSchemaTest > testSchemaFieldSelectionUnboxing FAILED
    java.lang.RuntimeException at ParDoSchemaTest.java:560

org.apache.beam.sdk.transforms.ParDoSchemaTest > testSchemaFieldDescriptorSelectionUnboxing
FAILED
    java.lang.RuntimeException at ParDoSchemaTest.java:601

org.apache.beam.sdk.transforms.ParDoSchemaTest > testInferredSchemaPipeline FAILED
    java.lang.RuntimeException at ParDoSchemaTest.java:423

org.apache.beam.sdk.transforms.ParDoSchemaTest > testFieldAccessSchemaPipeline FAILED
    java.lang.RuntimeException at ParDoSchemaTest.java:345

org.apache.beam.sdk.transforms.ParDoSchemaTest > testSimpleSchemaPipeline FAILED
    java.lang.RuntimeException at ParDoSchemaTest.java:114

org.apache.beam.sdk.transforms.ParDoSchemaTest > testSchemaConversionPipeline FAILED
    java.lang.RuntimeException at ParDoSchemaTest.java:471

org.apache.beam.sdk.transforms.ParDoSchemaTest > testReadAndWriteWithSchemaRegistry FAILED
    java.lang.RuntimeException at ParDoSchemaTest.java:310

org.apache.beam.sdk.transforms.ParDoSchemaTest > testReadAndWriteMultiOutput FAILED
    java.lang.RuntimeException at ParDoSchemaTest.java:265

org.apache.beam.sdk.transforms.ParDoSchemaTest > testNestedSchema FAILED
    java.lang.RuntimeException at ParDoSchemaTest.java:510

org.apache.beam.sdk.transforms.ParDoTest$LifecycleTests > testWindowingInStartAndFinishBundle
FAILED
    java.lang.RuntimeException at ParDoTest.java:1786

org.apache.beam.sdk.transforms.ParDoTest$LifecycleTests > testParDoWithErrorInStartBatch
FAILED
    java.lang.AssertionError at MatcherAssert.java:18

org.apache.beam.sdk.transforms.ParDoTest$LifecycleTests > testParDoWithErrorInProcessElement
FAILED
    java.lang.AssertionError at MatcherAssert.java:18

org.apache.beam.sdk.transforms.ParDoTest$LifecycleTests > testParDoWithErrorInFinishBatch
FAILED
    java.lang.AssertionError at MatcherAssert.java:18

241 tests completed, 209 failed, 4 skipped

> Task :runners:google-cloud-dataflow-java:validatesRunnerV2TestStreaming FAILED

> Task :runners:google-cloud-dataflow-java:cleanUpDockerImages
Untagged: us.gcr.io/apache-beam-testing/java-postcommit-it/java:20210720060101
Untagged: us.gcr.io/apache-beam-testing/java-postcommit-it/java@sha256:0d9cb3d20c3a85feb0b860351583747119c4fb951678143ce9574a1df4d94281
Deleted: sha256:d92f42e1c70069a9415ad3ad423f9c3da8bca13cf93ab74b16a3609d9a3296b4
Deleted: sha256:88001cadabd11c06182e84f37cc612131427114578c4bb0d8ae395c6ae3f00a2
Deleted: sha256:23d55e18dc526bc2f30c1153258a6461f85c18195fb4bf7bdf18d9e35d1aaf57
Deleted: sha256:3e15442dfa9b4863b3063d251117a6ddbedf2b2a2bc7a6f7da8ca8d4988c8bde
Deleted: sha256:cf301403733ab225c0c5b6b62bd0083dab4c3b6ecd27a0601789efa4c6acaa2a
Deleted: sha256:82043d451b8b05df0264c2c039244ad7b03e01bdf74ed557bb6afe562178d9b4
Deleted: sha256:f2c64a1da5dbb594b36c4b37617790aa7ba3d827fb41e4ff46af5d01055691b4
Deleted: sha256:584ddaaa939b8470300ad1fe5b19edcc774905abbca5fdd44044d9214023a248
Deleted: sha256:b8251841a0ef123a50f600da9e113a5d08409dfdada0609efd13b16979bd7638
Deleted: sha256:fe05888fe9fa705765d0ada2ead69683cbc3c07f366c024f60fcdc84c5cb075c
Deleted: sha256:7f639c3d7fd11afcf27e8ca2f1a15fffa9b2c219b660fcbeebf812e63b4eb94a
Deleted: sha256:1e4123a2e956907cca137f8aa14a92324be7cc507c1c79d540670147e42863be
Deleted: sha256:26f4db0d1a4533d33d082bd87528a6188b6293abcf1782f147d8ee22c782f87d
Deleted: sha256:c916dee800c8f7158e2639c16f5394c8fff4f0179088f67aaf6cc41d5d39428b
Deleted: sha256:1608ff60f144087799bc8e6421127d3c3a98881b860d0697d92dce17b9db2e24
Deleted: sha256:d51b395927c329bc0c6e633ef9adc220f0eacb6f06b3deba4296053d04e8b92b
Deleted: sha256:e08fb0d35f95915c4c72fda3445d39410b435139ed2518fbfcb7d1cdaa501cc7
Deleted: sha256:c627715dfa22b1ece4ecee1c81ab4755765905564b7e29991a416e14cb75760d
Deleted: sha256:c7bc8b6d5a21fe7084346bce1a819da3723728d8fc4e6408f55e2510c99c80a1
Deleted: sha256:da1029b4be7cde91d40c795fbcdb34e962d43c3dd565b1023a14a108f53a1861
Deleted: sha256:d233226402cebbec72b1c44af802d07e26fc3a0b560fe867a76fff57940832c0
Deleted: sha256:a97fa7b7ddddeb0f1a1eb2f0689c257adb3a2d842e04c1b485c49ed532386692
Deleted: sha256:386feef24989b4c3a756177a42db3478f44dd36fe8ed5955fcb65a6ea9b8c28a
Deleted: sha256:6922bac63339e1211999005d12457e5f12167f34ae470b76af08795d5cab9861
Deleted: sha256:e4a41c959a0dd4f28d877ea84ecba8cb7d43353365a669896f13d40dfb1a18e8
Deleted: sha256:59a95aaa525b07fe4efaf98bee0381989a1bcde1baf1b3bd55afa0106742e73d
Deleted: sha256:83bec8820aa67af3685c6a68c8e0661d2c956ffe1fbd678603eba8d4a871929f
Deleted: sha256:5a26414ed75261cbbb9a17bc037b73121ffa2dd4b883629e8baa4e58b3d869a6
ERROR: (gcloud.container.images.delete) [us.gcr.io/apache-beam-testing/java-postcommit-it/java:20210720060101]
is not a valid name. Expected tag in the form "base:tag" or "tag" or digest in the form "sha256:<digest>"

> Task :runners:google-cloud-dataflow-java:cleanUpDockerImages FAILED

FAILURE: Build completed with 2 failures.

1: Task failed with an exception.
-----------
* What went wrong:
Execution failed for task ':runners:google-cloud-dataflow-java:validatesRunnerV2TestStreaming'.
> There were failing tests. See the report at: file://<https://ci-beam.apache.org/job/beam_PostCommit_Java_VR_Dataflow_V2_Streaming/ws/src/runners/google-cloud-dataflow-java/build/reports/tests/validatesRunnerV2TestStreaming/index.html>

* Try:
Run with --stacktrace option to get the stack trace. Run with --info or --debug option to
get more log output. Run with --scan to get full insights.
==============================================================================

2: Task failed with an exception.
-----------
* Where:
Build file '<https://ci-beam.apache.org/job/beam_PostCommit_Java_VR_Dataflow_V2_Streaming/ws/src/runners/google-cloud-dataflow-java/build.gradle'>
line: 279

* What went wrong:
Execution failed for task ':runners:google-cloud-dataflow-java:cleanUpDockerImages'.
> Process 'command 'gcloud'' finished with non-zero exit value 1

* Try:
Run with --stacktrace option to get the stack trace. Run with --info or --debug option to
get more log output. Run with --scan to get full insights.
==============================================================================

* Get more help at https://help.gradle.org

Deprecated Gradle features were used in this build, making it incompatible with Gradle 7.0.
Use '--warning-mode all' to show the individual deprecation warnings.
See https://docs.gradle.org/6.8.3/userguide/command_line_interface.html#sec:command_line_warnings

BUILD FAILED in 4h 50m 5s
130 actionable tasks: 89 executed, 39 from cache, 2 up-to-date

Publishing build scan...
https://gradle.com/s/gpvbyzu2oqffm

Build step 'Invoke Gradle script' changed build result to FAILURE
Build step 'Invoke Gradle script' marked build as failure

---------------------------------------------------------------------
To unsubscribe, e-mail: builds-unsubscribe@beam.apache.org
For additional commands, e-mail: builds-help@beam.apache.org


Mime
View raw message