beam-builds mailing list archives

Site index · List index
Message view « Date » · « Thread »
Top « Date » · « Thread »
From Apache Jenkins Server <jenk...@builds.apache.org>
Subject Build failed in Jenkins: beam_PreCommit_GoPortable_Cron #532
Date Wed, 21 Jul 2021 00:19:29 GMT
See <https://ci-beam.apache.org/job/beam_PreCommit_GoPortable_Cron/532/display/redirect?page=changes>

Changes:

[dhuntsperger] fixed broken tabs for runner and shell in java quickstart

[noreply] [BEAM-10955] Revert f077ba51cb0790c403297833d5378b399b7248df (#15119)

[noreply] [BEAM-12596] Ensure that SDF restriction size is always greater then

[noreply] [BEAM-12639] Allow for zero splits in SplitAndSizeRestriction (#15191)

[noreply] [BEAM-12559] Enable CrossLanguageValidateRunner test for Samza (#15195)

[dhuntsperger] fix remaining runner and shell snippets

[noreply] Update Container beam-master-20210720 (#15197)


------------------------------------------
[...truncated 576.52 KB...]
instruction_id: "bundle_129"
log_location: "<https://ci-beam.apache.org/job/beam_PreCommit_GoPortable_Cron/ws/temp_gopath/src/github.com/apache/beam/sdks/go/test/vendor/github.com/apache/beam/sdks/go/pkg/beam/core/runtime/exec/datasink.go>:84"

INFO:apache_beam.runners.portability.fn_api_runner.fn_runner:Running (((e30)+(e31))+(e33_keyed2))+(n33_keyede33_2/Write)
INFO:root:severity: INFO
timestamp {
  seconds: 1626826764
  nanos: 266503341
}
message: "DataSource: 1 elements in 78285 ns"
instruction_id: "bundle_130"
log_location: "<https://ci-beam.apache.org/job/beam_PreCommit_GoPortable_Cron/ws/temp_gopath/src/github.com/apache/beam/sdks/go/test/vendor/github.com/apache/beam/sdks/go/pkg/beam/core/runtime/exec/datasource.go>:232"

INFO:root:severity: INFO
timestamp {
  seconds: 1626826764
  nanos: 266522094
}
message: "DataSink: 5 elements in 96489 ns"
instruction_id: "bundle_130"
log_location: "<https://ci-beam.apache.org/job/beam_PreCommit_GoPortable_Cron/ws/temp_gopath/src/github.com/apache/beam/sdks/go/test/vendor/github.com/apache/beam/sdks/go/pkg/beam/core/runtime/exec/datasink.go>:84"

INFO:apache_beam.runners.portability.fn_api_runner.fn_runner:Running (e23)+(e24)
INFO:root:severity: INFO
timestamp {
  seconds: 1626826764
  nanos: 285842543
}
message: "DataSource: 1 elements in 2076858 ns"
instruction_id: "bundle_131"
log_location: "<https://ci-beam.apache.org/job/beam_PreCommit_GoPortable_Cron/ws/temp_gopath/src/github.com/apache/beam/sdks/go/test/vendor/github.com/apache/beam/sdks/go/pkg/beam/core/runtime/exec/datasource.go>:232"

INFO:apache_beam.runners.portability.fn_api_runner.fn_runner:Running (((e8)+(e9))+(e11_keyed2))+(n9_keyede11_2/Write)
INFO:root:severity: INFO
timestamp {
  seconds: 1626826764
  nanos: 296933039
}
message: "DataSource: 1 elements in 80457 ns"
instruction_id: "bundle_132"
log_location: "<https://ci-beam.apache.org/job/beam_PreCommit_GoPortable_Cron/ws/temp_gopath/src/github.com/apache/beam/sdks/go/test/vendor/github.com/apache/beam/sdks/go/pkg/beam/core/runtime/exec/datasource.go>:232"

INFO:root:severity: INFO
timestamp {
  seconds: 1626826764
  nanos: 296949055
}
message: "DataSink: 3 elements in 94512 ns"
instruction_id: "bundle_132"
log_location: "<https://ci-beam.apache.org/job/beam_PreCommit_GoPortable_Cron/ws/temp_gopath/src/github.com/apache/beam/sdks/go/test/vendor/github.com/apache/beam/sdks/go/pkg/beam/core/runtime/exec/datasink.go>:84"

INFO:apache_beam.runners.portability.fn_api_runner.fn_runner:Running (((((GBK/Fixed/CoGBK/Read)+(e5))+(e6))+(e7))+(e11_keyed1))+(n7_keyede11_1/Write)
INFO:root:severity: INFO
timestamp {
  seconds: 1626826764
  nanos: 326205794
}
message: "DataSource: 3 elements in 92916 ns"
instruction_id: "bundle_133"
log_location: "<https://ci-beam.apache.org/job/beam_PreCommit_GoPortable_Cron/ws/temp_gopath/src/github.com/apache/beam/sdks/go/test/vendor/github.com/apache/beam/sdks/go/pkg/beam/core/runtime/exec/datasource.go>:232"

INFO:root:severity: INFO
timestamp {
  seconds: 1626826764
  nanos: 326232132
}
message: "DataSink: 3 elements in 116434 ns"
instruction_id: "bundle_133"
log_location: "<https://ci-beam.apache.org/job/beam_PreCommit_GoPortable_Cron/ws/temp_gopath/src/github.com/apache/beam/sdks/go/test/vendor/github.com/apache/beam/sdks/go/pkg/beam/core/runtime/exec/datasink.go>:84"

INFO:apache_beam.runners.portability.fn_api_runner.fn_runner:Running (((((((e10)+(e11))+(e13_keyed1))+(e13_keyed3))+(e13_keyed2))+(n13_keyede13_3/Write))+(n12_keyede13_2/Write))+(n11_keyede13_1/Write)
INFO:root:severity: INFO
timestamp {
  seconds: 1626826764
  nanos: 343970151
}
message: "DataSource: 1 elements in 1265550 ns"
instruction_id: "bundle_134"
log_location: "<https://ci-beam.apache.org/job/beam_PreCommit_GoPortable_Cron/ws/temp_gopath/src/github.com/apache/beam/sdks/go/test/vendor/github.com/apache/beam/sdks/go/pkg/beam/core/runtime/exec/datasource.go>:232"

INFO:root:severity: INFO
timestamp {
  seconds: 1626826764
  nanos: 343994030
}
message: "DataSink: 0 elements in 1288399 ns"
instruction_id: "bundle_134"
log_location: "<https://ci-beam.apache.org/job/beam_PreCommit_GoPortable_Cron/ws/temp_gopath/src/github.com/apache/beam/sdks/go/test/vendor/github.com/apache/beam/sdks/go/pkg/beam/core/runtime/exec/datasink.go>:84"

INFO:apache_beam.runners.portability.fn_api_runner.fn_runner:Running (e12)+(e13)
INFO:root:severity: INFO
timestamp {
  seconds: 1626826764
  nanos: 344020332
}
message: "DataSink: 3 elements in 1314689 ns"
instruction_id: "bundle_134"
log_location: "<https://ci-beam.apache.org/job/beam_PreCommit_GoPortable_Cron/ws/temp_gopath/src/github.com/apache/beam/sdks/go/test/vendor/github.com/apache/beam/sdks/go/pkg/beam/core/runtime/exec/datasink.go>:84"

INFO:root:severity: INFO
timestamp {
  seconds: 1626826764
  nanos: 344034684
}
message: "DataSink: 0 elements in 1328521 ns"
instruction_id: "bundle_134"
log_location: "<https://ci-beam.apache.org/job/beam_PreCommit_GoPortable_Cron/ws/temp_gopath/src/github.com/apache/beam/sdks/go/test/vendor/github.com/apache/beam/sdks/go/pkg/beam/core/runtime/exec/datasink.go>:84"

INFO:root:severity: INFO
timestamp {
  seconds: 1626826764
  nanos: 369272526
}
message: "DataSource: 1 elements in 8220559 ns"
instruction_id: "bundle_135"
log_location: "<https://ci-beam.apache.org/job/beam_PreCommit_GoPortable_Cron/ws/temp_gopath/src/github.com/apache/beam/sdks/go/test/vendor/github.com/apache/beam/sdks/go/pkg/beam/core/runtime/exec/datasource.go>:232"

INFO:apache_beam.runners.portability.fn_api_runner.fn_runner:Running (((((GBK/Sliding/CoGBK/Read)+(e27))+(e28))+(e29))+(e33_keyed1))+(n31_keyede33_1/Write)
INFO:root:severity: INFO
timestamp {
  seconds: 1626826764
  nanos: 385750638
}
message: "DataSource: 5 elements in 122874 ns"
instruction_id: "bundle_136"
log_location: "<https://ci-beam.apache.org/job/beam_PreCommit_GoPortable_Cron/ws/temp_gopath/src/github.com/apache/beam/sdks/go/test/vendor/github.com/apache/beam/sdks/go/pkg/beam/core/runtime/exec/datasource.go>:232"

INFO:root:severity: INFO
timestamp {
  seconds: 1626826764
  nanos: 385768487
}
message: "DataSink: 5 elements in 139353 ns"
instruction_id: "bundle_136"
log_location: "<https://ci-beam.apache.org/job/beam_PreCommit_GoPortable_Cron/ws/temp_gopath/src/github.com/apache/beam/sdks/go/test/vendor/github.com/apache/beam/sdks/go/pkg/beam/core/runtime/exec/datasink.go>:84"

INFO:apache_beam.runners.portability.fn_api_runner.fn_runner:Running (((((((e32)+(e33))+(e35_keyed3))+(e35_keyed2))+(e35_keyed1))+(n37_keyede35_3/Write))+(n36_keyede35_2/Write))+(n35_keyede35_1/Write)
INFO:root:severity: INFO
timestamp {
  seconds: 1626826764
  nanos: 401829171
}
message: "DataSource: 1 elements in 1661470 ns"
instruction_id: "bundle_137"
log_location: "<https://ci-beam.apache.org/job/beam_PreCommit_GoPortable_Cron/ws/temp_gopath/src/github.com/apache/beam/sdks/go/test/vendor/github.com/apache/beam/sdks/go/pkg/beam/core/runtime/exec/datasource.go>:232"

INFO:root:severity: INFO
timestamp {
  seconds: 1626826764
  nanos: 401854494
}
message: "DataSink: 0 elements in 1686081 ns"
instruction_id: "bundle_137"
log_location: "<https://ci-beam.apache.org/job/beam_PreCommit_GoPortable_Cron/ws/temp_gopath/src/github.com/apache/beam/sdks/go/test/vendor/github.com/apache/beam/sdks/go/pkg/beam/core/runtime/exec/datasink.go>:84"

INFO:root:severity: INFO
timestamp {
  seconds: 1626826764
  nanos: 401884196
}
message: "DataSink: 5 elements in 1714073 ns"
instruction_id: "bundle_137"
log_location: "<https://ci-beam.apache.org/job/beam_PreCommit_GoPortable_Cron/ws/temp_gopath/src/github.com/apache/beam/sdks/go/test/vendor/github.com/apache/beam/sdks/go/pkg/beam/core/runtime/exec/datasink.go>:84"

INFO:root:severity: INFO
timestamp {
  seconds: 1626826764
  nanos: 401898288
}
message: "DataSink: 0 elements in 1727459 ns"
instruction_id: "bundle_137"
log_location: "<https://ci-beam.apache.org/job/beam_PreCommit_GoPortable_Cron/ws/temp_gopath/src/github.com/apache/beam/sdks/go/test/vendor/github.com/apache/beam/sdks/go/pkg/beam/core/runtime/exec/datasink.go>:84"

INFO:apache_beam.runners.portability.fn_api_runner.fn_runner:Running (e34)+(e35)
INFO:root:severity: INFO
timestamp {
  seconds: 1626826764
  nanos: 427712180
}
message: "DataSource: 1 elements in 3388828 ns"
instruction_id: "bundle_138"
log_location: "<https://ci-beam.apache.org/job/beam_PreCommit_GoPortable_Cron/ws/temp_gopath/src/github.com/apache/beam/sdks/go/test/vendor/github.com/apache/beam/sdks/go/pkg/beam/core/runtime/exec/datasource.go>:232"

WARNING:root:severity: WARN
timestamp {
  seconds: 1626826764
  nanos: 440170841
}
message: "forcing DataChannel[localhost:42313] reconnection on port {localhost:42313} due
to EOF"
instruction_id: "bundle_122"
log_location: "<https://ci-beam.apache.org/job/beam_PreCommit_GoPortable_Cron/ws/temp_gopath/src/github.com/apache/beam/sdks/go/test/vendor/github.com/apache/beam/sdks/go/pkg/beam/core/runtime/harness/datamgr.go>:118"

WARNING:root:severity: WARN
timestamp {
  seconds: 1626826764
  nanos: 440201388
}
message: "DataChannel.read localhost:42313 closed"
instruction_id: "bundle_122"
log_location: "<https://ci-beam.apache.org/job/beam_PreCommit_GoPortable_Cron/ws/temp_gopath/src/github.com/apache/beam/sdks/go/test/vendor/github.com/apache/beam/sdks/go/pkg/beam/core/runtime/harness/datamgr.go>:258"

INFO:apache_beam.runners.portability.local_job_service:Successfully completed job in 4.870247840881348
seconds.

if [[ "$RUNNER" == "dataflow" ]]; then
  # Delete the container locally and remotely
  docker rmi $CONTAINER:$TAG || echo "Failed to remove container"
  gcloud --quiet container images delete $CONTAINER:$TAG || echo "Failed to delete container"

  if [[ -n "$TEST_EXPANSION_ADDR" || -n "$IO_EXPANSION_ADDR" ]]; then
    # Delete the java cross-language container locally and remotely
    docker rmi $JAVA_CONTAINER:$JAVA_TAG || echo "Failed to remove container"
    gcloud --quiet container images delete $JAVA_CONTAINER:$JAVA_TAG || echo "Failed to delete
container"
  fi

  # Clean up tempdir
  rm -rf $TMPDIR
fi

exit $TEST_EXIT_CODE
exit_background_processes

> Task :sdks:go:test:ulrValidatesRunner FAILED

FAILURE: Build failed with an exception.

* Where:
Build file '<https://ci-beam.apache.org/job/beam_PreCommit_GoPortable_Cron/ws/src/sdks/go/test/build.gradle'>
line: 171

* What went wrong:
Execution failed for task ':sdks:go:test:ulrValidatesRunner'.
> Process 'command 'sh'' finished with non-zero exit value 1

* Try:
Run with --stacktrace option to get the stack trace. Run with --info or --debug option to
get more log output. Run with --scan to get full insights.

* Get more help at https://help.gradle.org

Deprecated Gradle features were used in this build, making it incompatible with Gradle 7.0.
Use '--warning-mode all' to show the individual deprecation warnings.
See https://docs.gradle.org/6.8.3/userguide/command_line_interface.html#sec:command_line_warnings

BUILD FAILED in 15m 1s
110 actionable tasks: 81 executed, 25 from cache, 4 up-to-date

Publishing build scan...
https://gradle.com/s/vdpobuiw4uawi

Build step 'Invoke Gradle script' changed build result to FAILURE
Build step 'Invoke Gradle script' marked build as failure

---------------------------------------------------------------------
To unsubscribe, e-mail: builds-unsubscribe@beam.apache.org
For additional commands, e-mail: builds-help@beam.apache.org


Mime
View raw message