beam-builds mailing list archives

Site index · List index
Message view « Date » · « Thread »
Top « Date » · « Thread »
From Apache Jenkins Server <jenk...@builds.apache.org>
Subject Build failed in Jenkins: beam_PostCommit_Java_ValidatesRunner_ULR #1067
Date Thu, 01 Jul 2021 12:00:39 GMT
See <https://ci-beam.apache.org/job/beam_PostCommit_Java_ValidatesRunner_ULR/1067/display/redirect>

Changes:


------------------------------------------
Started by timer
Running as SYSTEM
[EnvInject] - Loading node environment variables.
Building remotely on apache-beam-jenkins-3 (beam) in workspace <https://ci-beam.apache.org/job/beam_PostCommit_Java_ValidatesRunner_ULR/ws/>
The recommended git tool is: NONE
No credentials specified
Wiping out workspace first.
Cloning the remote Git repository
Cloning repository https://github.com/apache/beam.git
 > git init <https://ci-beam.apache.org/job/beam_PostCommit_Java_ValidatesRunner_ULR/ws/src>
# timeout=10
Fetching upstream changes from https://github.com/apache/beam.git
 > git --version # timeout=10
 > git --version # 'git version 2.7.4'
 > git fetch --tags --progress https://github.com/apache/beam.git +refs/heads/*:refs/remotes/origin/*
# timeout=10
 > git config remote.origin.url https://github.com/apache/beam.git # timeout=10
 > git config --add remote.origin.fetch +refs/heads/*:refs/remotes/origin/* # timeout=10
 > git config remote.origin.url https://github.com/apache/beam.git # timeout=10
Fetching upstream changes from https://github.com/apache/beam.git
 > git fetch --tags --progress https://github.com/apache/beam.git +refs/heads/*:refs/remotes/origin/*
+refs/pull/${ghprbPullId}/*:refs/remotes/origin/pr/${ghprbPullId}/* # timeout=10
 > git rev-parse origin/master^{commit} # timeout=10
Checking out Revision 7b30339a64949bcb7c1bc11305b8c9ab49e12942 (origin/master)
 > git config core.sparsecheckout # timeout=10
 > git checkout -f 7b30339a64949bcb7c1bc11305b8c9ab49e12942 # timeout=10
Commit message: "[BEAM-12548] Add EqualsList functionality to PAssert (#15110)"
 > git rev-list --no-walk 7b30339a64949bcb7c1bc11305b8c9ab49e12942 # timeout=10
No emails were triggered.
[EnvInject] - Executing scripts and injecting environment variables after the SCM step.
[EnvInject] - Injecting as environment variables the properties content 
SPARK_LOCAL_IP=127.0.0.1
SETUPTOOLS_USE_DISTUTILS=stdlib

[EnvInject] - Variables injected successfully.
[Gradle] - Launching build.
[src] $ <https://ci-beam.apache.org/job/beam_PostCommit_Java_ValidatesRunner_ULR/ws/src/gradlew>
:runners:portability:java:ulrLoopbackValidatesRunner
Starting a Gradle Daemon, 2 busy Daemons could not be reused, use --status for details

FAILURE: Build failed with an exception.

* What went wrong:
Failed to create directory '<https://ci-beam.apache.org/job/beam_PostCommit_Java_ValidatesRunner_ULR/ws/src/.gradle/configuration-cache'>

* Try:
Run with --stacktrace option to get the stack trace. Run with --info or --debug option to
get more log output. Run with --scan to get full insights.

* Get more help at https://help.gradle.org

BUILD FAILED in 7s

A build scan cannot be produced as an error occurred spooling the build data.
Please report this problem via https://gradle.com/help/plugin and include the following via
copy/paste:

----------
Gradle version: 6.8.3
Plugin version: 3.4.1

java.lang.IllegalStateException: Could not close the event spooler due to previous errors.
	at com.gradle.scan.plugin.internal.f.c.c.a(SourceFile:128)
	at com.gradle.scan.plugin.internal.q.a$a.a(SourceFile:31)
	at com.gradle.scan.plugin.internal.q.a$a.a(SourceFile:20)
	at com.gradle.scan.plugin.internal.q.a.c(SourceFile:67)
----------

Build step 'Invoke Gradle script' changed build result to FAILURE
Build step 'Invoke Gradle script' marked build as failure

---------------------------------------------------------------------
To unsubscribe, e-mail: builds-unsubscribe@beam.apache.org
For additional commands, e-mail: builds-help@beam.apache.org


Mime
View raw message