beam-builds mailing list archives

Site index · List index
Message view « Date » · « Thread »
Top « Date » · « Thread »
From Apache Jenkins Server <jenk...@builds.apache.org>
Subject Build failed in Jenkins: beam_PostCommit_Java_VR_Dataflow_V2_Streaming #1005
Date Tue, 20 Jul 2021 16:45:41 GMT
See <https://ci-beam.apache.org/job/beam_PostCommit_Java_VR_Dataflow_V2_Streaming/1005/display/redirect>

Changes:


------------------------------------------
[...truncated 89.93 KB...]

org.apache.beam.sdk.transforms.CombineTest$BasicTests > testCombinePerKeyInstanceMethodReference
FAILED
    java.lang.RuntimeException at CombineTest.java:934

org.apache.beam.sdk.transforms.ParDoTest$TimestampTests > testParDoOutputWithTimestamp
FAILED
    java.lang.RuntimeException at ParDoTest.java:1811

org.apache.beam.sdk.transforms.ViewTest > testWindowedSideInputFixedToFixed FAILED
    java.lang.RuntimeException at ViewTest.java:1418

org.apache.beam.sdk.transforms.ParDoTest$MultipleInputsAndOutputTests > testParDoWithEmptyTaggedOutput
FAILED
    java.lang.RuntimeException at ParDoTest.java:767

org.apache.beam.sdk.transforms.SplittableDoFnTest > testAdditionalOutputUnbounded FAILED
    java.lang.RuntimeException at SplittableDoFnTest.java:642

org.apache.beam.sdk.transforms.CombineTest$BasicTests > testBasicCombine FAILED
    java.lang.RuntimeException at CombineTest.java:675

org.apache.beam.sdk.transforms.ParDoTest$TimerCoderInferenceTests > testValueStateCoderInferenceFromInputCoder
FAILED
    java.lang.RuntimeException at ParDoTest.java:5326

org.apache.beam.sdk.transforms.CombineTest$BasicTests > testCombinePerKeyLambda FAILED
    java.lang.RuntimeException at CombineTest.java:906

org.apache.beam.sdk.transforms.ViewTest > testIterableSideInput FAILED
    java.lang.RuntimeException at ViewTest.java:438

org.apache.beam.sdk.transforms.SplittableDoFnTest > testLifecycleMethodsUnbounded FAILED
    java.lang.RuntimeException at SplittableDoFnTest.java:770

org.apache.beam.sdk.transforms.ParDoTest$MultipleInputsAndOutputTests > testParDoWithSideInputs
FAILED
    java.lang.RuntimeException at ParDoTest.java:846

org.apache.beam.sdk.transforms.ParDoTest$TimerCoderInferenceTests > testValueStateCoderInference
FAILED
    java.lang.RuntimeException at ParDoTest.java:5260

org.apache.beam.sdk.transforms.CombineTest$BasicTests > testHotKeyCombining FAILED
    java.lang.RuntimeException at CombineTest.java:735

org.apache.beam.sdk.transforms.ViewTest > testEmptyMultimapSideInputWithNonDeterministicKeyCoder
FAILED
    java.lang.RuntimeException at ViewTest.java:906

org.apache.beam.sdk.transforms.GroupByKeyTest > org.apache.beam.sdk.transforms.GroupByKeyTest$WindowTests.testGroupByKeyMergingWindows
FAILED
    java.lang.RuntimeException at GroupByKeyTest.java:586

org.apache.beam.sdk.transforms.SplittableDoFnTest > testWindowedSideInputUnbounded FAILED
    java.lang.RuntimeException at SplittableDoFnTest.java:434

org.apache.beam.sdk.transforms.ParDoTest$MultipleInputsAndOutputTests > testParDoWithSideInputsIsCumulative
FAILED
    java.lang.RuntimeException at ParDoTest.java:1197

org.apache.beam.sdk.transforms.CombineTest$BasicTests > testSimpleCombineEmpty FAILED
    java.lang.RuntimeException at CombineTest.java:669

org.apache.beam.sdk.transforms.ViewTest > testEmptyMapSideInput FAILED
    java.lang.RuntimeException at ViewTest.java:1219

org.apache.beam.sdk.transforms.GroupByKeyTest > org.apache.beam.sdk.transforms.GroupByKeyTest$WindowTests.testGroupByKeyMultipleWindows
FAILED
    java.lang.RuntimeException at GroupByKeyTest.java:558

org.apache.beam.sdk.transforms.SplittableDoFnTest > testPairWithIndexWindowedTimestampedUnbounded
FAILED
    java.lang.RuntimeException at SplittableDoFnTest.java:229

org.apache.beam.sdk.io.CountingSourceTest > testUnboundedSourceSplits FAILED
    java.lang.RuntimeException at CountingSourceTest.java:243

org.apache.beam.sdk.transforms.CombineTest$BasicTests > testSimpleCombine FAILED
    java.lang.RuntimeException at CombineTest.java:660

org.apache.beam.sdk.transforms.ViewTest > testMapSideInputIsImmutable FAILED
    java.lang.RuntimeException at ViewTest.java:1344

org.apache.beam.sdk.transforms.GroupByKeyTest > org.apache.beam.sdk.transforms.GroupByKeyTest$WindowTests.testGroupByKeyAndWindows
FAILED
    java.lang.RuntimeException at GroupByKeyTest.java:528

org.apache.beam.sdk.transforms.ViewTest > testWindowedMapAsEntrySetSideInput FAILED
    java.lang.RuntimeException at ViewTest.java:1141

org.apache.beam.sdk.transforms.SplittableDoFnTest > testWindowedSideInputWithCheckpointsUnbounded
FAILED
    java.lang.RuntimeException at SplittableDoFnTest.java:569

org.apache.beam.sdk.transforms.CombineTest$BasicTests > testBinaryCombinePerKeyLambda FAILED
    java.lang.RuntimeException at CombineTest.java:920

org.apache.beam.sdk.transforms.GroupByKeyTest > org.apache.beam.sdk.transforms.GroupByKeyTest$BasicTests.testTimestampCombinerLatest
FAILED
    java.lang.RuntimeException at GroupByKeyTest.java:396

org.apache.beam.sdk.transforms.ViewTest > testEmptyMapSideInputWithNonDeterministicKeyCoder
FAILED
    java.lang.RuntimeException at ViewTest.java:1253

org.apache.beam.sdk.transforms.SplittableDoFnTest > testSideInputUnbounded FAILED
    java.lang.RuntimeException at SplittableDoFnTest.java:382

org.apache.beam.sdk.transforms.CombineTest$BasicTests > testHotKeyCombiningWithAccumulationMode
FAILED
    java.lang.RuntimeException at CombineTest.java:760

org.apache.beam.sdk.transforms.GroupByKeyTest > org.apache.beam.sdk.transforms.GroupByKeyTest$BasicTests.testGroupByKeyEmpty
FAILED
    java.lang.RuntimeException at GroupByKeyTest.java:153

org.apache.beam.sdk.transforms.ViewTest > testMultimapAsEntrySetSideInput FAILED
    java.lang.RuntimeException at ViewTest.java:623

org.apache.beam.sdk.metrics.MetricsTest$AttemptedMetricTests > testAttemptedDistributionMetrics
FAILED
    java.lang.RuntimeException at MetricsTest.java:377

org.apache.beam.sdk.transforms.CombineTest$BasicTests > testBasicCombineEmpty FAILED
    java.lang.RuntimeException at CombineTest.java:686

org.apache.beam.sdk.transforms.GroupByKeyTest > org.apache.beam.sdk.transforms.GroupByKeyTest$BasicTests.testTimestampCombinerEarliest
FAILED
    java.lang.RuntimeException at GroupByKeyTest.java:376

org.apache.beam.sdk.metrics.MetricsTest$AttemptedMetricTests > testAttemptedCounterMetrics
FAILED
    java.lang.RuntimeException at MetricsTest.java:369

org.apache.beam.sdk.transforms.ParDoTest$TimerFamilyTests > testTimerWithMultipleTimerFamilyUnbounded
FAILED
    java.lang.RuntimeException at ParDoTest.java:5715

org.apache.beam.sdk.transforms.ViewTest > testSingletonSideInput FAILED
    java.lang.RuntimeException at ViewTest.java:114

org.apache.beam.sdk.transforms.GroupByKeyTest > org.apache.beam.sdk.transforms.GroupByKeyTest$BasicTests.testGroupByKey
FAILED
    java.lang.RuntimeException at GroupByKeyTest.java:136

org.apache.beam.sdk.transforms.ParDoTest$TimerFamilyTests > testTimerWithMultipleTimerFamilyBounded
FAILED
    java.lang.RuntimeException at ParDoTest.java:5715

org.apache.beam.sdk.transforms.CombineTest$AccumulationTests > testAccumulatingCombine
FAILED
    java.lang.RuntimeException at CombineTest.java:1443

org.apache.beam.sdk.transforms.ParDoTest$TimerFamilyTests > testTimerFamilyAndTimerBounded
FAILED
    java.lang.RuntimeException at ParDoTest.java:5776

org.apache.beam.sdk.transforms.CombineTest$AccumulationTests > testAccumulatingCombineEmpty
FAILED
    java.lang.RuntimeException at CombineTest.java:1452

org.apache.beam.sdk.transforms.GroupByKeyTest > org.apache.beam.sdk.transforms.GroupByKeyTest$BasicTests.testGroupByKeyWithBadEqualsHashCode
FAILED
    java.lang.RuntimeException at GroupByKeyTest.java:453

org.apache.beam.sdk.transforms.ParDoTest$TimerFamilyTests > testTimerFamilyAndTimerUnbounded
FAILED
    java.lang.RuntimeException at ParDoTest.java:5776

org.apache.beam.sdk.transforms.ParDoTest$KeyTests > testKeyInOnTimer FAILED
    java.lang.RuntimeException at ParDoTest.java:5856

org.apache.beam.sdk.transforms.ParDoTest$TimerFamilyTests > testTimerFamilyEventTimeBounded
FAILED
    java.lang.RuntimeException at ParDoTest.java:5653

org.apache.beam.sdk.transforms.ParDoTest$KeyTests > testKeyInOnTimerWithGenericKey FAILED
    java.lang.RuntimeException at ParDoTest.java:5890

org.apache.beam.sdk.transforms.ParDoTest$TimerFamilyTests > testTimerFamilyEventTimeUnbounded
FAILED
    java.lang.RuntimeException at ParDoTest.java:5653

org.apache.beam.sdk.transforms.ParDoSchemaTest > testReadAndWrite FAILED
    java.lang.RuntimeException at ParDoSchemaTest.java:168

org.apache.beam.sdk.transforms.ParDoSchemaTest > testSchemasPassedThrough FAILED
    java.lang.RuntimeException at ParDoSchemaTest.java:438

org.apache.beam.sdk.transforms.ParDoSchemaTest > testSchemaFieldSelectionNested FAILED
    java.lang.RuntimeException at ParDoSchemaTest.java:651

org.apache.beam.sdk.transforms.ParDoSchemaTest > testSchemaFieldSelectionUnboxing FAILED
    java.lang.RuntimeException at ParDoSchemaTest.java:560

org.apache.beam.sdk.transforms.ParDoSchemaTest > testSchemaFieldDescriptorSelectionUnboxing
FAILED
    java.lang.RuntimeException at ParDoSchemaTest.java:601

org.apache.beam.sdk.transforms.ParDoSchemaTest > testInferredSchemaPipeline FAILED
    java.lang.RuntimeException at ParDoSchemaTest.java:423

org.apache.beam.sdk.transforms.ParDoSchemaTest > testFieldAccessSchemaPipeline FAILED
    java.lang.RuntimeException at ParDoSchemaTest.java:345

org.apache.beam.sdk.transforms.ParDoSchemaTest > testSimpleSchemaPipeline FAILED
    java.lang.RuntimeException at ParDoSchemaTest.java:114

org.apache.beam.sdk.transforms.ParDoSchemaTest > testSchemaConversionPipeline FAILED
    java.lang.RuntimeException at ParDoSchemaTest.java:471

org.apache.beam.sdk.transforms.ParDoSchemaTest > testReadAndWriteWithSchemaRegistry FAILED
    java.lang.RuntimeException at ParDoSchemaTest.java:310

org.apache.beam.sdk.transforms.ParDoSchemaTest > testReadAndWriteMultiOutput FAILED
    java.lang.RuntimeException at ParDoSchemaTest.java:265

org.apache.beam.sdk.transforms.ParDoSchemaTest > testNestedSchema FAILED
    java.lang.RuntimeException at ParDoSchemaTest.java:510

org.apache.beam.sdk.transforms.ParDoTest$LifecycleTests > testWindowingInStartAndFinishBundle
FAILED
    java.lang.RuntimeException at ParDoTest.java:1786

org.apache.beam.sdk.transforms.ParDoTest$LifecycleTests > testParDoWithErrorInStartBatch
FAILED
    java.lang.AssertionError at MatcherAssert.java:18

org.apache.beam.sdk.transforms.ParDoTest$LifecycleTests > testParDoWithErrorInProcessElement
FAILED
    java.lang.AssertionError at MatcherAssert.java:18

org.apache.beam.sdk.transforms.ParDoTest$LifecycleTests > testParDoWithErrorInFinishBatch
FAILED
    java.lang.AssertionError at MatcherAssert.java:18

241 tests completed, 208 failed, 4 skipped

> Task :runners:google-cloud-dataflow-java:validatesRunnerV2TestStreaming FAILED

> Task :runners:google-cloud-dataflow-java:cleanUpDockerImages FAILED
Error: No such image: us.gcr.io/apache-beam-testing/java-postcommit-it/java:20210720120047
ERROR: (gcloud.container.images.delete) [us.gcr.io/apache-beam-testing/java-postcommit-it/java:20210720120047]
is not a valid name. Expected tag in the form "base:tag" or "tag" or digest in the form "sha256:<digest>"

FAILURE: Build completed with 2 failures.

1: Task failed with an exception.
-----------
* What went wrong:
Execution failed for task ':runners:google-cloud-dataflow-java:validatesRunnerV2TestStreaming'.
> There were failing tests. See the report at: file://<https://ci-beam.apache.org/job/beam_PostCommit_Java_VR_Dataflow_V2_Streaming/ws/src/runners/google-cloud-dataflow-java/build/reports/tests/validatesRunnerV2TestStreaming/index.html>

* Try:
Run with --stacktrace option to get the stack trace. Run with --info or --debug option to
get more log output. Run with --scan to get full insights.
==============================================================================

2: Task failed with an exception.
-----------
* Where:
Build file '<https://ci-beam.apache.org/job/beam_PostCommit_Java_VR_Dataflow_V2_Streaming/ws/src/runners/google-cloud-dataflow-java/build.gradle'>
line: 279

* What went wrong:
Execution failed for task ':runners:google-cloud-dataflow-java:cleanUpDockerImages'.
> Process 'command 'gcloud'' finished with non-zero exit value 1

* Try:
Run with --stacktrace option to get the stack trace. Run with --info or --debug option to
get more log output. Run with --scan to get full insights.
==============================================================================

* Get more help at https://help.gradle.org

Deprecated Gradle features were used in this build, making it incompatible with Gradle 7.0.
Use '--warning-mode all' to show the individual deprecation warnings.
See https://docs.gradle.org/6.8.3/userguide/command_line_interface.html#sec:command_line_warnings

BUILD FAILED in 4h 45m 13s
130 actionable tasks: 89 executed, 39 from cache, 2 up-to-date

Publishing build scan...
https://gradle.com/s/i36ow5rzbu54c

Build step 'Invoke Gradle script' changed build result to FAILURE
Build step 'Invoke Gradle script' marked build as failure

---------------------------------------------------------------------
To unsubscribe, e-mail: builds-unsubscribe@beam.apache.org
For additional commands, e-mail: builds-help@beam.apache.org


Mime
View raw message