beam-builds mailing list archives

Site index · List index
Message view « Date » · « Thread »
Top « Date » · « Thread »
From Apache Jenkins Server <jenk...@builds.apache.org>
Subject Build failed in Jenkins: beam_PostCommit_Go_VR_Flink #4982
Date Wed, 21 Jul 2021 00:13:29 GMT
See <https://ci-beam.apache.org/job/beam_PostCommit_Go_VR_Flink/4982/display/redirect?page=changes>

Changes:

[dhuntsperger] fixed broken tabs for runner and shell in java quickstart

[noreply] [BEAM-10955] Revert f077ba51cb0790c403297833d5378b399b7248df (#15119)

[noreply] [BEAM-12596] Ensure that SDF restriction size is always greater then

[noreply] [BEAM-12639] Allow for zero splits in SplitAndSizeRestriction (#15191)

[noreply] [BEAM-12559] Enable CrossLanguageValidateRunner test for Samza (#15195)

[dhuntsperger] fix remaining runner and shell snippets


------------------------------------------
[...truncated 3.07 MB...]
      "labels": {
        "PCOLLECTION": "n4"
      }
    }, {
      "urn": "beam:metric:element_count:v1",
      "type": "beam:metrics:sum_int64:v1",
      "payload": "AQ==",
      "labels": {
        "PCOLLECTION": "n26"
      }
    }, {
      "urn": "beam:metric:data_channel:read_index:v1",
      "type": "beam:metrics:sum_int64:v1",
      "payload": "AQ==",
      "labels": {
        "PTRANSFORM": "fn/read/n26:0"
      }
    }, {
      "urn": "beam:metric:data_channel:read_index:v1",
      "type": "beam:metrics:sum_int64:v1",
      "payload": "AQ==",
      "labels": {
        "PTRANSFORM": "fn/read/n46:0"
      }
    }, {
      "urn": "beam:metric:element_count:v1",
      "type": "beam:metrics:sum_int64:v1",
      "payload": "AQ==",
      "labels": {
        "PCOLLECTION": "n46"
      }
    }, {
      "urn": "beam:metric:element_count:v1",
      "type": "beam:metrics:sum_int64:v1",
      "payload": "AQ==",
      "labels": {
        "PCOLLECTION": "n14"
      }
    }, {
      "urn": "beam:metric:data_channel:read_index:v1",
      "type": "beam:metrics:sum_int64:v1",
      "payload": "AQ==",
      "labels": {
        "PTRANSFORM": "fn/read/n14:0"
      }
    }, {
      "urn": "beam:metric:data_channel:read_index:v1",
      "type": "beam:metrics:sum_int64:v1",
      "payload": "AQ==",
      "labels": {
        "PTRANSFORM": "fn/read/n20:0"
      }
    }, {
      "urn": "beam:metric:element_count:v1",
      "type": "beam:metrics:sum_int64:v1",
      "payload": "AQ==",
      "labels": {
        "PCOLLECTION": "n20"
      }
    }, {
      "urn": "beam:metric:data_channel:read_index:v1",
      "type": "beam:metrics:sum_int64:v1",
      "payload": "AQ==",
      "labels": {
        "PTRANSFORM": "fn/read/n22:0"
      }
    }, {
      "urn": "beam:metric:element_count:v1",
      "type": "beam:metrics:sum_int64:v1",
      "payload": "AQ==",
      "labels": {
        "PCOLLECTION": "n22"
      }
    }, {
      "urn": "beam:metric:data_channel:read_index:v1",
      "type": "beam:metrics:sum_int64:v1",
      "payload": "AQ==",
      "labels": {
        "PTRANSFORM": "fn/read/n8:0"
      }
    }, {
      "urn": "beam:metric:element_count:v1",
      "type": "beam:metrics:sum_int64:v1",
      "payload": "AQ==",
      "labels": {
        "PCOLLECTION": "n8"
      }
    }, {
      "urn": "beam:metric:element_count:v1",
      "type": "beam:metrics:sum_int64:v1",
      "payload": "AQ==",
      "labels": {
        "PCOLLECTION": "n10"
      }
    }, {
      "urn": "beam:metric:data_channel:read_index:v1",
      "type": "beam:metrics:sum_int64:v1",
      "payload": "AQ==",
      "labels": {
        "PTRANSFORM": "fn/read/n10:0"
      }
    }, {
      "urn": "beam:metric:data_channel:read_index:v1",
      "type": "beam:metrics:sum_int64:v1",
      "payload": "AQ==",
      "labels": {
        "PTRANSFORM": "fn/read/n34:0"
      }
    }, {
      "urn": "beam:metric:element_count:v1",
      "type": "beam:metrics:sum_int64:v1",
      "payload": "AQ==",
      "labels": {
        "PCOLLECTION": "n34"
      }
    }, {
      "urn": "beam:metric:element_count:v1",
      "type": "beam:metrics:sum_int64:v1",
      "payload": "AQ==",
      "labels": {
        "PCOLLECTION": "n40"
      }
    }, {
      "urn": "beam:metric:data_channel:read_index:v1",
      "type": "beam:metrics:sum_int64:v1",
      "payload": "AQ==",
      "labels": {
        "PTRANSFORM": "fn/read/n40:0"
      }
    }, {
      "urn": "beam:metric:data_channel:read_index:v1",
      "type": "beam:metrics:sum_int64:v1",
      "payload": "Aw==",
      "labels": {
        "PTRANSFORM": "fn/read/n16:0"
      }
    }, {
      "urn": "beam:metric:element_count:v1",
      "type": "beam:metrics:sum_int64:v1",
      "payload": "Aw==",
      "labels": {
        "PCOLLECTION": "n16"
      }
    }]
  }
}
Jul 21, 2021 12:13:26 AM org.apache.flink.runtime.taskexecutor.DefaultJobLeaderService stop
INFO: Stop job leader service.
Jul 21, 2021 12:13:26 AM org.apache.flink.runtime.state.TaskExecutorLocalStateStoresManager
shutdown
INFO: Shutting down TaskExecutorLocalStateStoresManager.
Jul 21, 2021 12:13:26 AM org.apache.flink.runtime.io.disk.FileChannelManagerImpl lambda$getFileCloser$0
INFO: FileChannelManager removed spill file directory /tmp/flink-io-8d211e95-bb56-41fe-84af-6d2907e6e92a
Jul 21, 2021 12:13:26 AM org.apache.beam.runners.jobsubmission.InMemoryJobService getJobMetrics
INFO: Getting job metrics for go0job01001626826398298664221-jenkins-0721001321-10ad5f15_75065010-d338-4cc2-b80b-961743d42253
Jul 21, 2021 12:13:26 AM org.apache.flink.runtime.io.network.NettyShuffleEnvironment close
INFO: Shutting down the network environment and its components.
Jul 21, 2021 12:13:26 AM org.apache.beam.runners.jobsubmission.InMemoryJobService getJobMetrics
INFO: Finished getting job metrics for go0job01001626826398298664221-jenkins-0721001321-10ad5f15_75065010-d338-4cc2-b80b-961743d42253
Jul 21, 2021 12:13:26 AM org.apache.flink.runtime.io.disk.FileChannelManagerImpl lambda$getFileCloser$0
INFO: FileChannelManager removed spill file directory /tmp/flink-netty-shuffle-11fd7b90-4de3-476e-9dbc-97a986c86c2d
Jul 21, 2021 12:13:26 AM org.apache.flink.runtime.taskexecutor.KvStateService shutdown
INFO: Shutting down the kvState service and its components.
Jul 21, 2021 12:13:26 AM org.apache.flink.runtime.taskexecutor.DefaultJobLeaderService stop
INFO: Stop job leader service.
Jul 21, 2021 12:13:26 AM org.apache.flink.runtime.filecache.FileCache shutdown
INFO: removed file cache directory /tmp/flink-dist-cache-86462494-18d5-4d32-a17f-779bd4c3b5b3
Jul 21, 2021 12:13:26 AM org.apache.flink.runtime.taskexecutor.TaskExecutor handleOnStopException
INFO: Stopped TaskExecutor akka://flink/user/rpc/taskmanager_116.
Jul 21, 2021 12:13:26 AM org.apache.flink.runtime.webmonitor.WebMonitorEndpoint lambda$shutDownInternal$5
INFO: Removing cache directory /tmp/flink-web-ui
Jul 21, 2021 12:13:26 AM org.apache.flink.runtime.rest.RestServerEndpoint lambda$closeAsync$1
INFO: Shut down complete.
Jul 21, 2021 12:13:26 AM org.apache.flink.runtime.resourcemanager.ResourceManager deregisterApplication
INFO: Shut down cluster because application is in CANCELED, diagnostics DispatcherResourceManagerComponent
has been closed..
Jul 21, 2021 12:13:26 AM org.apache.flink.runtime.entrypoint.component.DispatcherResourceManagerComponent
closeAsyncInternal
INFO: Closing components.
Jul 21, 2021 12:13:26 AM org.apache.flink.runtime.dispatcher.runner.AbstractDispatcherLeaderProcess
closeInternal
INFO: Stopping SessionDispatcherLeaderProcess.
Jul 21, 2021 12:13:26 AM org.apache.flink.runtime.dispatcher.Dispatcher onStop
INFO: Stopping dispatcher akka://flink/user/rpc/dispatcher_118.
Jul 21, 2021 12:13:26 AM org.apache.flink.runtime.resourcemanager.slotmanager.DeclarativeSlotManager
close
INFO: Closing the slot manager.
Jul 21, 2021 12:13:26 AM org.apache.flink.runtime.dispatcher.Dispatcher terminateRunningJobs
INFO: Stopping all currently running jobs of dispatcher akka://flink/user/rpc/dispatcher_118.
Jul 21, 2021 12:13:26 AM org.apache.flink.runtime.resourcemanager.slotmanager.DeclarativeSlotManager
suspend
INFO: Suspending the slot manager.
Jul 21, 2021 12:13:26 AM org.apache.flink.runtime.dispatcher.Dispatcher lambda$onStop$0
INFO: Stopped dispatcher akka://flink/user/rpc/dispatcher_118.
Jul 21, 2021 12:13:26 AM org.apache.flink.runtime.rpc.akka.AkkaRpcService stopService
INFO: Stopping Akka RPC service.
Jul 21, 2021 12:13:26 AM org.apache.flink.runtime.rpc.akka.AkkaRpcService stopService
INFO: Stopping Akka RPC service.
Jul 21, 2021 12:13:26 AM org.apache.flink.runtime.rpc.akka.AkkaRpcService lambda$stopService$7
INFO: Stopped Akka RPC service.
Jul 21, 2021 12:13:26 AM org.apache.flink.runtime.blob.AbstractBlobCache close
INFO: Shutting down BLOB cache
Jul 21, 2021 12:13:26 AM org.apache.flink.runtime.blob.AbstractBlobCache close
INFO: Shutting down BLOB cache
Jul 21, 2021 12:13:26 AM org.apache.flink.runtime.blob.BlobServer close
INFO: Stopped BLOB server at 0.0.0.0:44001
Jul 21, 2021 12:13:26 AM org.apache.flink.runtime.rpc.akka.AkkaRpcService lambda$stopService$7
INFO: Stopped Akka RPC service.

if [[ "$RUNNER" == "dataflow" ]]; then
  # Delete the container locally and remotely
  docker rmi $CONTAINER:$TAG || echo "Failed to remove container"
  gcloud --quiet container images delete $CONTAINER:$TAG || echo "Failed to delete container"

  if [[ -n "$TEST_EXPANSION_ADDR" || -n "$IO_EXPANSION_ADDR" ]]; then
    # Delete the java cross-language container locally and remotely
    docker rmi $JAVA_CONTAINER:$JAVA_TAG || echo "Failed to remove container"
    gcloud --quiet container images delete $JAVA_CONTAINER:$JAVA_TAG || echo "Failed to delete
container"
  fi

  # Clean up tempdir
  rm -rf $TMPDIR
fi

exit $TEST_EXIT_CODE
exit_background_processes

> Task :sdks:go:test:flinkValidatesRunner FAILED

FAILURE: Build failed with an exception.

* Where:
Build file '<https://ci-beam.apache.org/job/beam_PostCommit_Go_VR_Flink/ws/src/sdks/go/test/build.gradle'>
line: 92

* What went wrong:
Execution failed for task ':sdks:go:test:flinkValidatesRunner'.
> Process 'command 'sh'' finished with non-zero exit value 1

* Try:
Run with --stacktrace option to get the stack trace. Run with --info or --debug option to
get more log output. Run with --scan to get full insights.

* Get more help at https://help.gradle.org

Deprecated Gradle features were used in this build, making it incompatible with Gradle 7.0.
Use '--warning-mode all' to show the individual deprecation warnings.
See https://docs.gradle.org/6.8.3/userguide/command_line_interface.html#sec:command_line_warnings

BUILD FAILED in 13m 1s
142 actionable tasks: 98 executed, 42 from cache, 2 up-to-date

Publishing build scan...
https://gradle.com/s/pymdcvulbzmww

Build step 'Invoke Gradle script' changed build result to FAILURE
Build step 'Invoke Gradle script' marked build as failure

---------------------------------------------------------------------
To unsubscribe, e-mail: builds-unsubscribe@beam.apache.org
For additional commands, e-mail: builds-help@beam.apache.org


Mime
View raw message