beam-builds mailing list archives

Site index · List index
Message view « Date » · « Thread »
Top « Date » · « Thread »
From Apache Jenkins Server <jenk...@builds.apache.org>
Subject Build failed in Jenkins: beam_PostCommit_Java_PVR_Spark2_Streaming #300
Date Thu, 01 Jul 2021 01:08:20 GMT
See <https://ci-beam.apache.org/job/beam_PostCommit_Java_PVR_Spark2_Streaming/300/display/redirect?page=changes>

Changes:

[noreply] Update README to mention modules and Go versions. (#15109)

[noreply] [BEAM-12548] Add EqualsList functionality to PAssert (#15110)


------------------------------------------
[...truncated 2.16 KB...]
[EnvInject] - Variables injected successfully.
[Gradle] - Launching build.
[src] $ <https://ci-beam.apache.org/job/beam_PostCommit_Java_PVR_Spark2_Streaming/ws/src/gradlew>
--continue --max-workers=12 -Dorg.gradle.jvmargs=-Xms2g -Dorg.gradle.jvmargs=-Xmx4g -Dorg.gradle.vfs.watch=false
-Pdocker-pull-licenses :runners:spark:2:job-server:validatesPortableRunnerStreaming
> Task :buildSrc:compileJava NO-SOURCE
> Task :buildSrc:compileGroovy FROM-CACHE
> Task :buildSrc:pluginDescriptors
> Task :buildSrc:processResources
> Task :buildSrc:classes
> Task :buildSrc:jar
> Task :buildSrc:assemble
> Task :buildSrc:spotlessGroovy FROM-CACHE
> Task :buildSrc:spotlessGroovyCheck UP-TO-DATE
> Task :buildSrc:spotlessGroovyGradle FROM-CACHE
> Task :buildSrc:spotlessGroovyGradleCheck UP-TO-DATE
> Task :buildSrc:spotlessCheck UP-TO-DATE
> Task :buildSrc:pluginUnderTestMetadata
> Task :buildSrc:compileTestJava NO-SOURCE
> Task :buildSrc:compileTestGroovy NO-SOURCE
> Task :buildSrc:processTestResources NO-SOURCE
> Task :buildSrc:testClasses UP-TO-DATE
> Task :buildSrc:test NO-SOURCE
> Task :buildSrc:validatePlugins FROM-CACHE
> Task :buildSrc:check UP-TO-DATE
> Task :buildSrc:build
Configuration on demand is an incubating feature.
> Task :model:job-management:createCheckerFrameworkManifest
> Task :runners:core-construction-java:createCheckerFrameworkManifest
> Task :model:pipeline:createCheckerFrameworkManifest
> Task :runners:java-job-service:createCheckerFrameworkManifest
> Task :model:fn-execution:createCheckerFrameworkManifest
> Task :sdks:java:core:createCheckerFrameworkManifest
> Task :sdks:java:extensions:google-cloud-platform-core:createCheckerFrameworkManifest
> Task :runners:java-fn-execution:createCheckerFrameworkManifest
> Task :sdks:java:fn-execution:createCheckerFrameworkManifest
> Task :runners:core-java:createCheckerFrameworkManifest
> Task :sdks:java:expansion-service:createCheckerFrameworkManifest
> Task :sdks:java:harness:createCheckerFrameworkManifest
> Task :sdks:java:core:generateAvroProtocol NO-SOURCE
> Task :sdks:java:expansion-service:processResources NO-SOURCE
> Task :sdks:java:fn-execution:processResources NO-SOURCE
> Task :runners:core-construction-java:processResources NO-SOURCE
> Task :runners:core-java:processResources NO-SOURCE
> Task :sdks:java:extensions:google-cloud-platform-core:processResources NO-SOURCE
> Task :runners:java-job-service:processResources NO-SOURCE
> Task :sdks:java:harness:processResources NO-SOURCE
> Task :model:fn-execution:extractProto
> Task :runners:spark:2:copyResourcesOverrides NO-SOURCE
> Task :sdks:java:core:generateAvroJava NO-SOURCE
> Task :runners:core-construction-java:processTestResources NO-SOURCE
> Task :model:job-management:extractProto
> Task :runners:portability:java:createCheckerFrameworkManifest
> Task :sdks:java:io:kafka:createCheckerFrameworkManifest
> Task :runners:core-java:processTestResources NO-SOURCE
> Task :runners:java-fn-execution:processResources NO-SOURCE
> Task :sdks:java:io:kafka:processResources NO-SOURCE
> Task :runners:portability:java:processResources NO-SOURCE
> Task :runners:portability:java:processTestResources NO-SOURCE
> Task :model:job-management:processResources
> Task :sdks:java:core:generateGrammarSource FROM-CACHE
> Task :sdks:java:core:processResources
> Task :sdks:java:core:generateTestAvroProtocol NO-SOURCE
> Task :model:fn-execution:processResources
> Task :runners:spark:2:copySourceOverrides
> Task :runners:spark:2:copyTestResourcesOverrides NO-SOURCE
> Task :runners:spark:2:createCheckerFrameworkManifest
> Task :runners:spark:2:processResources
> Task :runners:spark:2:copyTestSourceOverrides
> Task :runners:spark:2:processTestResources
> Task :model:pipeline:extractIncludeProto
> Task :model:pipeline:extractProto
> Task :model:pipeline:generateProto FROM-CACHE
> Task :model:pipeline:compileJava FROM-CACHE
> Task :model:pipeline:processResources
> Task :model:pipeline:classes
> Task :sdks:java:core:generateTestAvroJava
> Task :sdks:java:core:generateTestGrammarSource NO-SOURCE
> Task :model:pipeline:jar
> Task :sdks:java:core:processTestResources
> Task :model:pipeline:shadowJar FROM-CACHE
> Task :model:fn-execution:extractIncludeProto
> Task :model:job-management:extractIncludeProto
> Task :model:job-management:generateProto FROM-CACHE
> Task :model:fn-execution:generateProto FROM-CACHE
> Task :model:job-management:compileJava FROM-CACHE
> Task :model:job-management:classes
> Task :model:fn-execution:compileJava FROM-CACHE
> Task :model:fn-execution:classes
> Task :model:job-management:shadowJar FROM-CACHE
> Task :model:fn-execution:shadowJar FROM-CACHE
> Task :sdks:java:core:compileJava FROM-CACHE
> Task :sdks:java:core:classes
> Task :sdks:java:core:shadowJar FROM-CACHE
> Task :sdks:java:fn-execution:compileJava FROM-CACHE
> Task :sdks:java:fn-execution:classes UP-TO-DATE
> Task :sdks:java:fn-execution:jar
> Task :runners:core-construction-java:compileJava FROM-CACHE
> Task :runners:core-construction-java:classes UP-TO-DATE
> Task :sdks:java:core:jar
> Task :runners:core-construction-java:jar
> Task :runners:core-java:compileJava FROM-CACHE
> Task :runners:core-java:classes UP-TO-DATE
> Task :runners:core-java:jar
> Task :sdks:java:extensions:google-cloud-platform-core:compileJava FROM-CACHE
> Task :sdks:java:extensions:google-cloud-platform-core:classes UP-TO-DATE
> Task :sdks:java:extensions:google-cloud-platform-core:jar
> Task :sdks:java:harness:compileJava FROM-CACHE
> Task :sdks:java:harness:classes UP-TO-DATE
> Task :sdks:java:harness:jar
> Task :sdks:java:core:compileTestJava FROM-CACHE
> Task :sdks:java:core:testClasses
> Task :sdks:java:core:shadowTestJar FROM-CACHE
> Task :sdks:java:harness:shadowJar FROM-CACHE
> Task :runners:core-java:compileTestJava FROM-CACHE
> Task :runners:core-java:testClasses UP-TO-DATE
> Task :runners:core-construction-java:compileTestJava FROM-CACHE
> Task :runners:core-construction-java:testClasses UP-TO-DATE
> Task :runners:core-java:testJar
> Task :runners:core-construction-java:testJar
> Task :runners:java-fn-execution:compileJava FROM-CACHE
> Task :runners:java-fn-execution:classes UP-TO-DATE
> Task :runners:java-fn-execution:jar
> Task :sdks:java:expansion-service:compileJava FROM-CACHE
> Task :sdks:java:expansion-service:classes UP-TO-DATE
> Task :sdks:java:expansion-service:jar
> Task :runners:java-job-service:compileJava FROM-CACHE
> Task :runners:java-job-service:classes UP-TO-DATE
> Task :runners:java-job-service:jar
> Task :sdks:java:io:kafka:compileJava FROM-CACHE
> Task :sdks:java:io:kafka:classes UP-TO-DATE
> Task :runners:portability:java:compileJava FROM-CACHE
> Task :runners:portability:java:classes UP-TO-DATE
> Task :runners:portability:java:jar
> Task :sdks:java:io:kafka:jar
> Task :runners:portability:java:compileTestJava FROM-CACHE
> Task :runners:portability:java:testClasses UP-TO-DATE
> Task :runners:portability:java:testJar
> Task :runners:spark:2:compileJava FROM-CACHE
> Task :runners:spark:2:classes
> Task :runners:spark:2:jar
> Task :runners:spark:2:compileTestJava FROM-CACHE
> Task :runners:spark:2:testClasses
> Task :runners:spark:2:testJar
> Task :runners:spark:2:job-server:validatesPortableRunnerStreaming

org.apache.beam.sdk.schemas.AvroSchemaTest > testAvroPipelineGroupBy FAILED
    java.lang.RuntimeException at AvroSchemaTest.java:497

org.apache.beam.sdk.values.PCollectionTupleTest > testComposePCollectionTuple FAILED
    java.lang.AssertionError at PCollectionTupleTest.java:106

org.apache.beam.sdk.PipelineTest > testTupleInjectionTransform FAILED
    java.lang.AssertionError at PipelineTest.java:368

org.apache.beam.sdk.transforms.ReshuffleTest > testAssignShardFn FAILED
    java.lang.AssertionError at ReshuffleTest.java:302

org.apache.beam.sdk.testing.PAssertTest > testPAssertThatListSatisfiesOneMatcher FAILED
    java.lang.AssertionError at PAssertTest.java:652

org.apache.beam.sdk.PipelineTest > testTupleProjectionTransform FAILED
    java.lang.AssertionError at PipelineTest.java:340

org.apache.beam.sdk.transforms.KeysTest > testKeys FAILED
    java.lang.AssertionError at KeysTest.java:66

org.apache.beam.sdk.testing.PAssertTest > testPAssertThatFlattened FAILED
    java.lang.AssertionError at PAssertTest.java:613

org.apache.beam.sdk.transforms.ReshuffleTest > testReshuffleAfterFixedWindows FAILED
    java.lang.AssertionError at ReshuffleTest.java:235

org.apache.beam.sdk.PipelineTest > testMultipleApply FAILED
    java.lang.AssertionError at PipelineTest.java:252

org.apache.beam.sdk.transforms.KeysTest > testKeysEmpty FAILED
    java.lang.AssertionError at KeysTest.java:79

org.apache.beam.sdk.transforms.ReshuffleTest > testReshuffleAfterSlidingWindows FAILED
    java.lang.AssertionError at ReshuffleTest.java:255

org.apache.beam.sdk.testing.PAssertTest > testPAssertThatListSatisfiesMultipleMatchers
FAILED
    java.lang.AssertionError at PAssertTest.java:707

org.apache.beam.sdk.transforms.ImpulseTest > testImpulse FAILED
    java.lang.AssertionError at ImpulseTest.java:47

org.apache.beam.sdk.transforms.CombineTest$WindowingTests > testWindowedCombineEmpty FAILED
    java.lang.AssertionError at CombineTest.java:1330

org.apache.beam.sdk.transforms.GroupByKeyTest > org.apache.beam.sdk.transforms.GroupByKeyTest$BasicTests.testLargeKeys100KB
FAILED
    java.lang.AssertionError at GroupByKeyTest.java:465

org.apache.beam.sdk.transforms.ParDoTest$LifecycleTests > testWindowingInStartAndFinishBundle
FAILED
    java.lang.AssertionError at ParDoTest.java:1786

org.apache.beam.sdk.transforms.ParDoTest$LifecycleTests > testParDoWithErrorInStartBatch
FAILED
    java.lang.AssertionError at Assert.java:89

org.apache.beam.sdk.transforms.ParDoTest$LifecycleTests > testParDoWithErrorInProcessElement
FAILED
    java.lang.AssertionError at Assert.java:89

org.apache.beam.sdk.transforms.ParDoTest$LifecycleTests > testParDoWithErrorInFinishBatch
FAILED
    java.lang.AssertionError at Assert.java:89

org.apache.beam.sdk.transforms.WithTimestampsTest > withTimestampsShouldApplyTimestamps
FAILED
    java.lang.AssertionError at WithTimestampsTest.java:78

org.apache.beam.sdk.transforms.WithTimestampsTest > withTimestampsBackwardsInTimeAndWithAllowedTimestampSkewShouldSucceed
FAILED
    java.lang.AssertionError at WithTimestampsTest.java:142

org.apache.beam.sdk.transforms.WithTimestampsTest > withTimestampsLambdaShouldApplyTimestamps
FAILED
    java.lang.AssertionError at WithTimestampsTest.java:205

org.apache.beam.runners.core.metrics.MetricsPusherTest > pushesUserMetrics FAILED
    java.lang.NullPointerException at MetricsPusherTest.java:74

org.apache.beam.runners.core.metrics.MetricsPusherTest > pushesSystemMetrics FAILED
    java.lang.NullPointerException at MetricsPusherTest.java:95

org.apache.beam.sdk.transforms.ParDoTest$BasicTests > testPipelineOptionsParameter FAILED
    java.lang.RuntimeException at ParDoTest.java:624

111 tests completed, 26 failed, 1 skipped

> Task :runners:spark:2:job-server:validatesPortableRunnerStreaming FAILED

FAILURE: Build failed with an exception.

* What went wrong:
Execution failed for task ':runners:spark:2:job-server:validatesPortableRunnerStreaming'.
> There were failing tests. See the report at: file://<https://ci-beam.apache.org/job/beam_PostCommit_Java_PVR_Spark2_Streaming/ws/src/runners/spark/2/job-server/build/reports/tests/validatesPortableRunnerStreaming/index.html>

* Try:
Run with --stacktrace option to get the stack trace. Run with --info or --debug option to
get more log output. Run with --scan to get full insights.

* Get more help at https://help.gradle.org

Deprecated Gradle features were used in this build, making it incompatible with Gradle 7.0.
Use '--warning-mode all' to show the individual deprecation warnings.
See https://docs.gradle.org/6.8.3/userguide/command_line_interface.html#sec:command_line_warnings

BUILD FAILED in 1h 7m 53s
79 actionable tasks: 49 executed, 30 from cache

Publishing build scan...
https://gradle.com/s/7m4a2r3phtwcc

Build step 'Invoke Gradle script' changed build result to FAILURE
Build step 'Invoke Gradle script' marked build as failure

---------------------------------------------------------------------
To unsubscribe, e-mail: builds-unsubscribe@beam.apache.org
For additional commands, e-mail: builds-help@beam.apache.org


Mime
View raw message