carbondata-commits mailing list archives

Site index · List index
Message view « Date » · « Thread »
Top « Date » · « Thread »
From Apache Jenkins Server <jenk...@builds.apache.org>
Subject Build failed in Jenkins: carbondata-master-spark-2.3 #2182
Date Wed, 08 Apr 2020 16:44:39 GMT
See <https://builds.apache.org/job/carbondata-master-spark-2.3/2182/display/redirect?page=changes>

Changes:

[ajanthabhat] [CARBONDATA-3759] Refactor segmentRefreshInfo and fix cache issue in


------------------------------------------
[...truncated 5.49 MB...]
|Table page size in mb        |                                                          
                                                            |       |
|                             |                                                          
                                                            |       |
|## Encoding Information      |                                                          
                                                            |       |
|Local Dictionary Enabled     |true                                                      
                                                            |       |
|Local Dictionary Threshold   |10000                                                     
                                                            |       |
|Local Dictionary Include     |                                                          
                                                            |       |
|                             |                                                          
                                                            |       |
|## Compaction Information    |                                                          
                                                            |       |
|MAJOR_COMPACTION_SIZE        |1024                                                      
                                                            |       |
|AUTO_LOAD_MERGE              |false                                                     
                                                            |       |
|COMPACTION_LEVEL_THRESHOLD   |4,3                                                       
                                                            |       |
|COMPACTION_PRESERVE_SEGMENTS |0                                                         
                                                            |       |
|ALLOWED_COMPACTION_DAYS      |0                                                         
                                                            |       |
|                             |                                                          
                                                            |       |
|## Partition Information     |                                                          
                                                            |       |
|Partition Type               |NATIVE_HIVE                                               
                                                            |       |
|Partition Columns            |c:TIMESTAMP, d:TIMESTAMP                                  
                                                            |       |
|Number of Partitions         |1                                                         
                                                            |       |
|                             |                                                          
                                                            |       |
|## Dynamic Information       |                                                          
                                                            |       |
|Table Data Size              |1.10KB                                                    
                                                            |       |
|Table Index Size             |705.0B                                                    
                                                            |       |
|Last Update                  |Wed Apr 08 09:43:14 PDT 2020                              
                                                            |       |
+-----------------------------+-----------------------------------------------------------------------------------------------------------------------+-------+

2020-04-08 16:43:14 AUDIT audit:74 - {"time":"April 8, 2020 9:43:14 AM PDT","username":"jenkins","opName":"CREATE
MATERIALIZED VIEW","opId":"5512865112584266","opStatus":"START"}
2020-04-08 16:43:14 AUDIT audit:74 - {"time":"April 8, 2020 9:43:14 AM PDT","username":"jenkins","opName":"CREATE
TABLE","opId":"5512865142671159","opStatus":"START"}
2020-04-08 16:43:14 AUDIT audit:74 - {"time":"April 8, 2020 9:43:14 AM PDT","username":"jenkins","opName":"CREATE
TABLE","opId":"5512865150746838","opStatus":"START"}
2020-04-08 16:43:14 AUDIT audit:97 - {"time":"April 8, 2020 9:43:14 AM PDT","username":"jenkins","opName":"CREATE
TABLE","opId":"5512865150746838","opStatus":"SUCCESS","opTime":"120 ms","table":"NA","extraInfo":{}}
2020-04-08 16:43:14 AUDIT audit:97 - {"time":"April 8, 2020 9:43:14 AM PDT","username":"jenkins","opName":"CREATE
TABLE","opId":"5512865142671159","opStatus":"SUCCESS","opTime":"131 ms","table":"partition_mv.dm1","extraInfo":{"local_dictionary_threshold":"10000","bad_record_path":"","table_blocksize":"1024","local_dictionary_enable":"true","flat_folder":"false","external":"false","sort_columns":"","comment":"","carbon.column.compressor":"snappy","mv_related_tables":"partitionone"}}
2020-04-08 16:43:14 AUDIT audit:74 - {"time":"April 8, 2020 9:43:14 AM PDT","username":"jenkins","opName":"INSERT
INTO","opId":"5512865440157573","opStatus":"START"}
2020-04-08 16:43:16 AUDIT audit:97 - {"time":"April 8, 2020 9:43:16 AM PDT","username":"jenkins","opName":"INSERT
INTO","opId":"5512865440157573","opStatus":"SUCCESS","opTime":"1045 ms","table":"partition_mv.dm1","extraInfo":{"SegmentId":"0","DataSize":"688.0B","IndexSize":"454.0B"}}
2020-04-08 16:43:16 AUDIT audit:97 - {"time":"April 8, 2020 9:43:16 AM PDT","username":"jenkins","opName":"CREATE
MATERIALIZED VIEW","opId":"5512865112584266","opStatus":"SUCCESS","opTime":"1369 ms","table":"NA","extraInfo":{"mvName":"dm1"}}
2020-04-08 16:43:16 AUDIT audit:74 - {"time":"April 8, 2020 9:43:16 AM PDT","username":"jenkins","opName":"DROP
TABLE","opId":"5512867044445732","opStatus":"START"}
2020-04-08 16:43:16 AUDIT audit:97 - {"time":"April 8, 2020 9:43:16 AM PDT","username":"jenkins","opName":"DROP
TABLE","opId":"5512867044445732","opStatus":"SUCCESS","opTime":"200 ms","table":"partition_mv.partitionone","extraInfo":{}}
2020-04-08 16:43:16 AUDIT audit:74 - {"time":"April 8, 2020 9:43:16 AM PDT","username":"jenkins","opName":"CREATE
TABLE","opId":"5512867249042606","opStatus":"START"}
2020-04-08 16:43:16 AUDIT audit:97 - {"time":"April 8, 2020 9:43:16 AM PDT","username":"jenkins","opName":"CREATE
TABLE","opId":"5512867249042606","opStatus":"SUCCESS","opTime":"47 ms","table":"NA","extraInfo":{}}
2020-04-08 16:43:16 AUDIT audit:74 - {"time":"April 8, 2020 9:43:16 AM PDT","username":"jenkins","opName":"INSERT
INTO","opId":"5512867382888754","opStatus":"START"}
2020-04-08 16:43:17 AUDIT audit:97 - {"time":"April 8, 2020 9:43:17 AM PDT","username":"jenkins","opName":"INSERT
INTO","opId":"5512867382888754","opStatus":"SUCCESS","opTime":"376 ms","table":"partition_mv.partitionone","extraInfo":{}}
2020-04-08 16:43:17 AUDIT audit:74 - {"time":"April 8, 2020 9:43:17 AM PDT","username":"jenkins","opName":"DROP
MATERIALIZED VIEW","opId":"5512867760575314","opStatus":"START"}
2020-04-08 16:43:17 AUDIT audit:97 - {"time":"April 8, 2020 9:43:17 AM PDT","username":"jenkins","opName":"DROP
MATERIALIZED VIEW","opId":"5512867760575314","opStatus":"SUCCESS","opTime":"1 ms","table":"NA","extraInfo":{"mvName":"dm1"}}
2020-04-08 16:43:17 AUDIT audit:74 - {"time":"April 8, 2020 9:43:17 AM PDT","username":"jenkins","opName":"CREATE
MATERIALIZED VIEW","opId":"5512867764983789","opStatus":"START"}
2020-04-08 16:43:17 AUDIT audit:74 - {"time":"April 8, 2020 9:43:17 AM PDT","username":"jenkins","opName":"CREATE
TABLE","opId":"5512867785666438","opStatus":"START"}
2020-04-08 16:43:17 AUDIT audit:74 - {"time":"April 8, 2020 9:43:17 AM PDT","username":"jenkins","opName":"CREATE
TABLE","opId":"5512867791323507","opStatus":"START"}
2020-04-08 16:43:17 AUDIT audit:97 - {"time":"April 8, 2020 9:43:17 AM PDT","username":"jenkins","opName":"CREATE
TABLE","opId":"5512867791323507","opStatus":"SUCCESS","opTime":"38 ms","table":"NA","extraInfo":{}}
2020-04-08 16:43:17 AUDIT audit:97 - {"time":"April 8, 2020 9:43:17 AM PDT","username":"jenkins","opName":"CREATE
TABLE","opId":"5512867785666438","opStatus":"SUCCESS","opTime":"46 ms","table":"partition_mv.dm1","extraInfo":{"local_dictionary_threshold":"10000","bad_record_path":"","table_blocksize":"1024","local_dictionary_enable":"true","flat_folder":"false","external":"false","sort_columns":"","comment":"","carbon.column.compressor":"snappy","mv_related_tables":"partitionone"}}
2020-04-08 16:43:17 AUDIT audit:74 - {"time":"April 8, 2020 9:43:17 AM PDT","username":"jenkins","opName":"INSERT
INTO","opId":"5512867986380578","opStatus":"START"}
2020-04-08 16:43:19 AUDIT audit:97 - {"time":"April 8, 2020 9:43:19 AM PDT","username":"jenkins","opName":"INSERT
INTO","opId":"5512867986380578","opStatus":"SUCCESS","opTime":"2068 ms","table":"partition_mv.dm1","extraInfo":{}}
2020-04-08 16:43:19 AUDIT audit:97 - {"time":"April 8, 2020 9:43:19 AM PDT","username":"jenkins","opName":"CREATE
MATERIALIZED VIEW","opId":"5512867764983789","opStatus":"SUCCESS","opTime":"2289 ms","table":"NA","extraInfo":{"mvName":"dm1"}}
2020-04-08 16:43:20 AUDIT audit:74 - {"time":"April 8, 2020 9:43:20 AM PDT","username":"jenkins","opName":"DROP
TABLE","opId":"5512870662041097","opStatus":"START"}
2020-04-08 16:43:20 AUDIT audit:97 - {"time":"April 8, 2020 9:43:20 AM PDT","username":"jenkins","opName":"DROP
TABLE","opId":"5512870662041097","opStatus":"SUCCESS","opTime":"275 ms","table":"partition_mv.partitionone","extraInfo":{}}
- test partition on timeseries column
2020-04-08 16:43:20 AUDIT audit:74 - {"time":"April 8, 2020 9:43:20 AM PDT","username":"jenkins","opName":"DROP
TABLE","opId":"5512871087008072","opStatus":"START"}
2020-04-08 16:43:20 AUDIT audit:97 - {"time":"April 8, 2020 9:43:20 AM PDT","username":"jenkins","opName":"DROP
TABLE","opId":"5512871087008072","opStatus":"SUCCESS","opTime":"91 ms","table":"partition_mv.droppartition","extraInfo":{}}
2020-04-08 16:43:20 AUDIT audit:74 - {"time":"April 8, 2020 9:43:20 AM PDT","username":"jenkins","opName":"DROP
TABLE","opId":"5512871178154228","opStatus":"START"}
2020-04-08 16:43:20 AUDIT audit:97 - {"time":"April 8, 2020 9:43:20 AM PDT","username":"jenkins","opName":"DROP
TABLE","opId":"5512871178154228","opStatus":"SUCCESS","opTime":"159 ms","table":"partition_mv.maintable","extraInfo":{}}
2020-04-08 16:43:20 AUDIT audit:74 - {"time":"April 8, 2020 9:43:20 AM PDT","username":"jenkins","opName":"DROP
TABLE","opId":"5512871337107179","opStatus":"START"}
2020-04-08 16:43:20 AUDIT audit:97 - {"time":"April 8, 2020 9:43:20 AM PDT","username":"jenkins","opName":"DROP
TABLE","opId":"5512871337107179","opStatus":"SUCCESS","opTime":"57 ms","table":"partition_mv.par","extraInfo":{}}
2020-04-08 16:43:20 AUDIT audit:74 - {"time":"April 8, 2020 9:43:20 AM PDT","username":"jenkins","opName":"DROP
TABLE","opId":"5512871393788323","opStatus":"START"}
2020-04-08 16:43:21 AUDIT audit:97 - {"time":"April 8, 2020 9:43:21 AM PDT","username":"jenkins","opName":"DROP
TABLE","opId":"5512871393788323","opStatus":"SUCCESS","opTime":"129 ms","table":"partition_mv.partitiontable","extraInfo":{}}
MVTPCDSTestCase:
- test create materialized view with tpcds_1_4_testCases case_1 !!! IGNORED !!!
- test create materialized view with tpcds_1_4_testCases case_3 !!! IGNORED !!!
- test create materialized view with tpcds_1_4_testCases case_4 !!! IGNORED !!!
- test create materialized view with tpcds_1_4_testCases case_5 !!! IGNORED !!!
- test create materialized view with tpcds_1_4_testCases case_6 !!! IGNORED !!!
- test create materialized view with tpcds_1_4_testCases case_8 !!! IGNORED !!!
- test create materialized view with tpcds_1_4_testCases case_11 !!! IGNORED !!!
- test create materialized view with tpcds_1_4_testCases case_15 !!! IGNORED !!!
- test create materialized view with tpcds_1_4_testCases case_16 !!! IGNORED !!!
IsSPJGHSuite:
- project only
- groupby-project
- groupby-project-filter
- groupby-project-filter-join
LogicalToModularPlanSuite:
- select only
- select-project-groupby grouping without aggregate function
- select-project with filter
- join
- left outer join
- right outer join
- joins: conjunctive predicates #1 with alias !!! IGNORED !!!
- joins: conjunctive predicates #2 with alias !!! IGNORED !!!
- SPJGH query !!! IGNORED !!!
- non-SPJGH query !!! IGNORED !!!
Run completed in 15 minutes, 9 seconds.
Total number of tests run: 268
Suites: completed 28, aborted 0
Tests: succeeded 266, failed 2, canceled 0, ignored 25, pending 0
*** 2 TESTS FAILED ***
[JENKINS] Recording test results
[INFO] ------------------------------------------------------------------------
[INFO] Reactor Summary:
[INFO] 
[INFO] Apache CarbonData :: Parent ........................ SUCCESS [ 36.815 s]
[INFO] Apache CarbonData :: Common ........................ SUCCESS [ 22.455 s]
[INFO] Apache CarbonData :: Core .......................... SUCCESS [02:49 min]
[INFO] Apache CarbonData :: Processing .................... SUCCESS [ 31.387 s]
[INFO] Apache CarbonData :: Hadoop ........................ SUCCESS [ 24.939 s]
[INFO] Apache CarbonData :: Materialized View Plan ........ SUCCESS [01:03 min]
[INFO] Apache CarbonData :: Hive .......................... SUCCESS [01:53 min]
[INFO] Apache CarbonData :: SDK ........................... SUCCESS [01:07 min]
[INFO] Apache CarbonData :: CLI ........................... SUCCESS [06:05 min]
[INFO] Apache CarbonData :: Lucene Index .................. SUCCESS [ 19.048 s]
[INFO] Apache CarbonData :: Bloom Index ................... SUCCESS [ 14.623 s]
[INFO] Apache CarbonData :: Geo ........................... SUCCESS [ 19.510 s]
[INFO] Apache CarbonData :: Streaming ..................... SUCCESS [ 27.203 s]
[INFO] Apache CarbonData :: Spark ......................... SUCCESS [56:25 min]
[INFO] Apache CarbonData :: Materialized View Core ........ FAILURE [16:29 min]
[INFO] Apache CarbonData :: Secondary Index ............... SKIPPED
[INFO] Apache CarbonData :: Index Examples ................ SKIPPED
[INFO] Apache CarbonData :: Flink Proxy ................... SKIPPED
[INFO] Apache CarbonData :: Flink ......................... SKIPPED
[INFO] Apache CarbonData :: Flink Build ................... SKIPPED
[INFO] Apache CarbonData :: Presto ........................ SKIPPED
[INFO] Apache CarbonData :: Examples ...................... SKIPPED
[INFO] Apache CarbonData :: Flink Examples ................ SKIPPED
[INFO] Apache CarbonData :: Assembly ...................... SKIPPED
[INFO] ------------------------------------------------------------------------
[INFO] BUILD FAILURE
[INFO] ------------------------------------------------------------------------
[INFO] Total time: 01:30 h
[INFO] Finished at: 2020-04-08T16:43:45+00:00
[INFO] Final Memory: 170M/1714M
[INFO] ------------------------------------------------------------------------
Waiting for Jenkins to finish collecting data
[ERROR] Failed to execute goal org.scalatest:scalatest-maven-plugin:1.0:test (test) on project
carbondata-mv-core: There are test failures -> [Help 1]
org.apache.maven.lifecycle.LifecycleExecutionException: Failed to execute goal org.scalatest:scalatest-maven-plugin:1.0:test
(test) on project carbondata-mv-core: There are test failures
	at org.apache.maven.lifecycle.internal.MojoExecutor.execute(MojoExecutor.java:212)
	at org.apache.maven.lifecycle.internal.MojoExecutor.execute(MojoExecutor.java:153)
	at org.apache.maven.lifecycle.internal.MojoExecutor.execute(MojoExecutor.java:145)
	at org.apache.maven.lifecycle.internal.LifecycleModuleBuilder.buildProject(LifecycleModuleBuilder.java:116)
	at org.apache.maven.lifecycle.internal.LifecycleModuleBuilder.buildProject(LifecycleModuleBuilder.java:80)
	at org.apache.maven.lifecycle.internal.builder.singlethreaded.SingleThreadedBuilder.build(SingleThreadedBuilder.java:51)
	at org.apache.maven.lifecycle.internal.LifecycleStarter.execute(LifecycleStarter.java:128)
	at org.apache.maven.DefaultMaven.doExecute(DefaultMaven.java:307)
	at org.apache.maven.DefaultMaven.doExecute(DefaultMaven.java:193)
	at org.apache.maven.DefaultMaven.execute(DefaultMaven.java:106)
	at org.jvnet.hudson.maven3.launcher.Maven33Launcher.main(Maven33Launcher.java:129)
	at sun.reflect.NativeMethodAccessorImpl.invoke0(Native Method)
	at sun.reflect.NativeMethodAccessorImpl.invoke(NativeMethodAccessorImpl.java:62)
	at sun.reflect.DelegatingMethodAccessorImpl.invoke(DelegatingMethodAccessorImpl.java:43)
	at java.lang.reflect.Method.invoke(Method.java:498)
	at org.codehaus.plexus.classworlds.launcher.Launcher.launchStandard(Launcher.java:330)
	at org.codehaus.plexus.classworlds.launcher.Launcher.launch(Launcher.java:238)
	at jenkins.maven3.agent.Maven33Main.launch(Maven33Main.java:178)
	at sun.reflect.NativeMethodAccessorImpl.invoke0(Native Method)
	at sun.reflect.NativeMethodAccessorImpl.invoke(NativeMethodAccessorImpl.java:62)
	at sun.reflect.DelegatingMethodAccessorImpl.invoke(DelegatingMethodAccessorImpl.java:43)
	at java.lang.reflect.Method.invoke(Method.java:498)
	at hudson.maven.Maven3Builder.call(Maven3Builder.java:139)
	at hudson.maven.Maven3Builder.call(Maven3Builder.java:70)
	at hudson.remoting.UserRequest.perform(UserRequest.java:212)
	at hudson.remoting.UserRequest.perform(UserRequest.java:54)
	at hudson.remoting.Request$2.run(Request.java:369)
	at hudson.remoting.InterceptingExecutorService$1.call(InterceptingExecutorService.java:72)
	at java.util.concurrent.FutureTask.run(FutureTask.java:266)
	at java.util.concurrent.ThreadPoolExecutor.runWorker(ThreadPoolExecutor.java:1149)
	at java.util.concurrent.ThreadPoolExecutor$Worker.run(ThreadPoolExecutor.java:624)
	at java.lang.Thread.run(Thread.java:748)
Caused by: org.apache.maven.plugin.MojoFailureException: There are test failures
	at org.scalatest.tools.maven.TestMojo.execute(TestMojo.java:107)
	at org.apache.maven.plugin.DefaultBuildPluginManager.executeMojo(DefaultBuildPluginManager.java:134)
	at org.apache.maven.lifecycle.internal.MojoExecutor.execute(MojoExecutor.java:207)
	... 31 more
[ERROR] 
[ERROR] Re-run Maven using the -X switch to enable full debug logging.
[ERROR] 
[ERROR] For more information about the errors and possible solutions, please read the following
articles:
[ERROR] [Help 1] http://cwiki.apache.org/confluence/display/MAVEN/MojoFailureException
[ERROR] 
[ERROR] After correcting the problems, you can resume the build with the command
[ERROR]   mvn <goals> -rf :carbondata-mv-core
[JENKINS] Archiving <https://builds.apache.org/job/carbondata-master-spark-2.3/ws/processing/pom.xml>
to org.apache.carbondata/carbondata-processing/2.0.0-SNAPSHOT/carbondata-processing-2.0.0-SNAPSHOT.pom
[JENKINS] Archiving <https://builds.apache.org/job/carbondata-master-spark-2.3/ws/processing/target/carbondata-processing-2.0.0-SNAPSHOT.jar>
to org.apache.carbondata/carbondata-processing/2.0.0-SNAPSHOT/carbondata-processing-2.0.0-SNAPSHOT.jar
[JENKINS] Archiving <https://builds.apache.org/job/carbondata-master-spark-2.3/ws/mv/core/pom.xml>
to org.apache.carbondata/carbondata-mv-core/2.0.0-SNAPSHOT/carbondata-mv-core-2.0.0-SNAPSHOT.pom
[Fast Archiver] No artifacts from carbondata-master-spark-2.3 » Apache CarbonData :: Materialized
View Core #2179 to compare, so performing full copy of artifacts
[JENKINS] Archiving <https://builds.apache.org/job/carbondata-master-spark-2.3/ws/geo/pom.xml>
to org.apache.carbondata/carbondata-geo/2.0.0-SNAPSHOT/carbondata-geo-2.0.0-SNAPSHOT.pom
[JENKINS] Archiving <https://builds.apache.org/job/carbondata-master-spark-2.3/ws/geo/target/carbondata-geo-2.0.0-SNAPSHOT.jar>
to org.apache.carbondata/carbondata-geo/2.0.0-SNAPSHOT/carbondata-geo-2.0.0-SNAPSHOT.jar
[JENKINS] Archiving <https://builds.apache.org/job/carbondata-master-spark-2.3/ws/index/examples/pom.xml>
to org.apache.carbondata/carbondata-index-examples/2.0.0-SNAPSHOT/carbondata-index-examples-2.0.0-SNAPSHOT.pom
[Fast Archiver] No prior successful build to compare, so performing full copy of artifacts
[JENKINS] Archiving <https://builds.apache.org/job/carbondata-master-spark-2.3/ws/streaming/pom.xml>
to org.apache.carbondata/carbondata-streaming/2.0.0-SNAPSHOT/carbondata-streaming-2.0.0-SNAPSHOT.pom
[JENKINS] Archiving <https://builds.apache.org/job/carbondata-master-spark-2.3/ws/streaming/target/carbondata-streaming-2.0.0-SNAPSHOT.jar>
to org.apache.carbondata/carbondata-streaming/2.0.0-SNAPSHOT/carbondata-streaming-2.0.0-SNAPSHOT.jar
[JENKINS] Archiving <https://builds.apache.org/job/carbondata-master-spark-2.3/ws/index/lucene/pom.xml>
to org.apache.carbondata/carbondata-lucene/2.0.0-SNAPSHOT/carbondata-lucene-2.0.0-SNAPSHOT.pom
[JENKINS] Archiving <https://builds.apache.org/job/carbondata-master-spark-2.3/ws/index/lucene/target/carbondata-lucene-2.0.0-SNAPSHOT.jar>
to org.apache.carbondata/carbondata-lucene/2.0.0-SNAPSHOT/carbondata-lucene-2.0.0-SNAPSHOT.jar
[JENKINS] Archiving <https://builds.apache.org/job/carbondata-master-spark-2.3/ws/integration/hive/pom.xml>
to org.apache.carbondata/carbondata-hive/2.0.0-SNAPSHOT/carbondata-hive-2.0.0-SNAPSHOT.pom
[JENKINS] Archiving <https://builds.apache.org/job/carbondata-master-spark-2.3/ws/integration/hive/target/carbondata-hive-2.0.0-SNAPSHOT.jar>
to org.apache.carbondata/carbondata-hive/2.0.0-SNAPSHOT/carbondata-hive-2.0.0-SNAPSHOT.jar
[JENKINS] Archiving <https://builds.apache.org/job/carbondata-master-spark-2.3/ws/examples/spark/pom.xml>
to org.apache.carbondata/carbondata-examples/2.0.0-SNAPSHOT/carbondata-examples-2.0.0-SNAPSHOT.pom
[JENKINS] Archiving <https://builds.apache.org/job/carbondata-master-spark-2.3/ws/common/pom.xml>
to org.apache.carbondata/carbondata-common/2.0.0-SNAPSHOT/carbondata-common-2.0.0-SNAPSHOT.pom
[JENKINS] Archiving <https://builds.apache.org/job/carbondata-master-spark-2.3/ws/common/target/carbondata-common-2.0.0-SNAPSHOT.jar>
to org.apache.carbondata/carbondata-common/2.0.0-SNAPSHOT/carbondata-common-2.0.0-SNAPSHOT.jar
[JENKINS] Archiving <https://builds.apache.org/job/carbondata-master-spark-2.3/ws/mv/plan/pom.xml>
to org.apache.carbondata/carbondata-mv-plan/2.0.0-SNAPSHOT/carbondata-mv-plan-2.0.0-SNAPSHOT.pom
[JENKINS] Archiving <https://builds.apache.org/job/carbondata-master-spark-2.3/ws/mv/plan/target/carbondata-mv-plan-2.0.0-SNAPSHOT.jar>
to org.apache.carbondata/carbondata-mv-plan/2.0.0-SNAPSHOT/carbondata-mv-plan-2.0.0-SNAPSHOT.jar
[JENKINS] Archiving <https://builds.apache.org/job/carbondata-master-spark-2.3/ws/integration/flink-proxy/pom.xml>
to org.apache.carbondata/carbondata-flink-proxy/2.0.0-SNAPSHOT/carbondata-flink-proxy-2.0.0-SNAPSHOT.pom
[JENKINS] Archiving <https://builds.apache.org/job/carbondata-master-spark-2.3/ws/integration/flink/pom.xml>
to org.apache.carbondata/carbondata-flink/2.0.0-SNAPSHOT/carbondata-flink-2.0.0-SNAPSHOT.pom
[JENKINS] Archiving <https://builds.apache.org/job/carbondata-master-spark-2.3/ws/integration/flink-build/pom.xml>
to org.apache.carbondata/carbondata-flink-build/2.0.0-SNAPSHOT/carbondata-flink-build-2.0.0-SNAPSHOT.pom
[Fast Archiver] No prior successful build to compare, so performing full copy of artifacts
[JENKINS] Archiving <https://builds.apache.org/job/carbondata-master-spark-2.3/ws/tools/cli/pom.xml>
to org.apache.carbondata/carbondata-cli/2.0.0-SNAPSHOT/carbondata-cli-2.0.0-SNAPSHOT.pom
[JENKINS] Archiving <https://builds.apache.org/job/carbondata-master-spark-2.3/ws/tools/cli/target/carbondata-cli-2.0.0-SNAPSHOT.jar>
to org.apache.carbondata/carbondata-cli/2.0.0-SNAPSHOT/carbondata-cli-2.0.0-SNAPSHOT.jar
[JENKINS] Archiving <https://builds.apache.org/job/carbondata-master-spark-2.3/ws/index/bloom/pom.xml>
to org.apache.carbondata/carbondata-bloom/2.0.0-SNAPSHOT/carbondata-bloom-2.0.0-SNAPSHOT.pom
[JENKINS] Archiving <https://builds.apache.org/job/carbondata-master-spark-2.3/ws/index/bloom/target/carbondata-bloom-2.0.0-SNAPSHOT.jar>
to org.apache.carbondata/carbondata-bloom/2.0.0-SNAPSHOT/carbondata-bloom-2.0.0-SNAPSHOT.jar
[JENKINS] Archiving <https://builds.apache.org/job/carbondata-master-spark-2.3/ws/assembly/pom.xml>
to org.apache.carbondata/carbondata-assembly/2.0.0-SNAPSHOT/carbondata-assembly-2.0.0-SNAPSHOT.pom
[JENKINS] Archiving <https://builds.apache.org/job/carbondata-master-spark-2.3/ws/pom.xml>
to org.apache.carbondata/carbondata-parent/2.0.0-SNAPSHOT/carbondata-parent-2.0.0-SNAPSHOT.pom
[JENKINS] Archiving <https://builds.apache.org/job/carbondata-master-spark-2.3/ws/examples/flink/pom.xml>
to org.apache.carbondata/carbondata-examples-flink/2.0.0-SNAPSHOT/carbondata-examples-flink-2.0.0-SNAPSHOT.pom
[JENKINS] Archiving <https://builds.apache.org/job/carbondata-master-spark-2.3/ws/core/pom.xml>
to org.apache.carbondata/carbondata-core/2.0.0-SNAPSHOT/carbondata-core-2.0.0-SNAPSHOT.pom
[JENKINS] Archiving <https://builds.apache.org/job/carbondata-master-spark-2.3/ws/core/target/carbondata-core-2.0.0-SNAPSHOT.jar>
to org.apache.carbondata/carbondata-core/2.0.0-SNAPSHOT/carbondata-core-2.0.0-SNAPSHOT.jar
[JENKINS] Archiving <https://builds.apache.org/job/carbondata-master-spark-2.3/ws/sdk/sdk/pom.xml>
to org.apache.carbondata/carbondata-sdk/2.0.0-SNAPSHOT/carbondata-sdk-2.0.0-SNAPSHOT.pom
[JENKINS] Archiving <https://builds.apache.org/job/carbondata-master-spark-2.3/ws/sdk/sdk/target/carbondata-sdk-2.0.0-SNAPSHOT.jar>
to org.apache.carbondata/carbondata-sdk/2.0.0-SNAPSHOT/carbondata-sdk-2.0.0-SNAPSHOT.jar
[JENKINS] Archiving <https://builds.apache.org/job/carbondata-master-spark-2.3/ws/hadoop/pom.xml>
to org.apache.carbondata/carbondata-hadoop/2.0.0-SNAPSHOT/carbondata-hadoop-2.0.0-SNAPSHOT.pom
[JENKINS] Archiving <https://builds.apache.org/job/carbondata-master-spark-2.3/ws/hadoop/target/carbondata-hadoop-2.0.0-SNAPSHOT.jar>
to org.apache.carbondata/carbondata-hadoop/2.0.0-SNAPSHOT/carbondata-hadoop-2.0.0-SNAPSHOT.jar
[JENKINS] Archiving <https://builds.apache.org/job/carbondata-master-spark-2.3/ws/integration/presto/pom.xml>
to org.apache.carbondata/carbondata-presto/2.0.0-SNAPSHOT/carbondata-presto-2.0.0-SNAPSHOT.pom
[JENKINS] Archiving <https://builds.apache.org/job/carbondata-master-spark-2.3/ws/index/secondary-index/pom.xml>
to org.apache.carbondata/carbondata-secondary-index/2.0.0-SNAPSHOT/carbondata-secondary-index-2.0.0-SNAPSHOT.pom
[Fast Archiver] No prior successful build to compare, so performing full copy of artifacts
[JENKINS] Archiving <https://builds.apache.org/job/carbondata-master-spark-2.3/ws/integration/spark/pom.xml>
to org.apache.carbondata/carbondata-spark/2.0.0-SNAPSHOT/carbondata-spark-2.0.0-SNAPSHOT.pom
[JENKINS] Archiving <https://builds.apache.org/job/carbondata-master-spark-2.3/ws/integration/spark/target/carbondata-spark-2.0.0-SNAPSHOT.jar>
to org.apache.carbondata/carbondata-spark/2.0.0-SNAPSHOT/carbondata-spark-2.0.0-SNAPSHOT.jar
[JENKINS] Archiving <https://builds.apache.org/job/carbondata-master-spark-2.3/ws/integration/spark/target/carbondata-spark-2.0.0-SNAPSHOT-tests.jar>
to org.apache.carbondata/carbondata-spark/2.0.0-SNAPSHOT/carbondata-spark-2.0.0-SNAPSHOT-tests.jar
No mail will be sent out, as 'carbondata-master-spark-2.3 » Apache CarbonData :: Processing
#2182' does not have a result yet. Please make sure you set a proper result in case of pipeline/build
scripts.
Sending e-mails to: commits@carbondata.apache.org
No mail will be sent out, as 'carbondata-master-spark-2.3 » Apache CarbonData :: Geo #2182'
does not have a result yet. Please make sure you set a proper result in case of pipeline/build
scripts.
No mail will be sent out, as 'carbondata-master-spark-2.3 » Apache CarbonData :: Index
Examples #2182' does not have a result yet. Please make sure you set a proper result in case
of pipeline/build scripts.
No mail will be sent out, as 'carbondata-master-spark-2.3 » Apache CarbonData :: Streaming
#2182' does not have a result yet. Please make sure you set a proper result in case of pipeline/build
scripts.
No mail will be sent out, as 'carbondata-master-spark-2.3 » Apache CarbonData :: Lucene
Index #2182' does not have a result yet. Please make sure you set a proper result in case
of pipeline/build scripts.
No mail will be sent out, as 'carbondata-master-spark-2.3 » Apache CarbonData :: Examples
#2182' does not have a result yet. Please make sure you set a proper result in case of pipeline/build
scripts.
No mail will be sent out, as 'carbondata-master-spark-2.3 » Apache CarbonData :: Common
#2182' does not have a result yet. Please make sure you set a proper result in case of pipeline/build
scripts.
No mail will be sent out, as 'carbondata-master-spark-2.3 » Apache CarbonData :: Materialized
View Plan #2182' does not have a result yet. Please make sure you set a proper result in case
of pipeline/build scripts.
No mail will be sent out, as 'carbondata-master-spark-2.3 » Apache CarbonData :: Flink
Proxy #2182' does not have a result yet. Please make sure you set a proper result in case
of pipeline/build scripts.
No mail will be sent out, as 'carbondata-master-spark-2.3 » Apache CarbonData :: Flink
Build #2182' does not have a result yet. Please make sure you set a proper result in case
of pipeline/build scripts.
No mail will be sent out, as 'carbondata-master-spark-2.3 » Apache CarbonData :: CLI #2182'
does not have a result yet. Please make sure you set a proper result in case of pipeline/build
scripts.
No mail will be sent out, as 'carbondata-master-spark-2.3 » Apache CarbonData :: Parent
#2182' does not have a result yet. Please make sure you set a proper result in case of pipeline/build
scripts.
No mail will be sent out, as 'carbondata-master-spark-2.3 » Apache CarbonData :: Hadoop
#2182' does not have a result yet. Please make sure you set a proper result in case of pipeline/build
scripts.
No mail will be sent out, as 'carbondata-master-spark-2.3 » Apache CarbonData :: Hive #2182'
does not have a result yet. Please make sure you set a proper result in case of pipeline/build
scripts.
No mail will be sent out, as 'carbondata-master-spark-2.3 » Apache CarbonData :: Flink
#2182' does not have a result yet. Please make sure you set a proper result in case of pipeline/build
scripts.
No mail will be sent out, as 'carbondata-master-spark-2.3 » Apache CarbonData :: Bloom
Index #2182' does not have a result yet. Please make sure you set a proper result in case
of pipeline/build scripts.
No mail will be sent out, as 'carbondata-master-spark-2.3 » Apache CarbonData :: Assembly
#2182' does not have a result yet. Please make sure you set a proper result in case of pipeline/build
scripts.
No mail will be sent out, as 'carbondata-master-spark-2.3 » Apache CarbonData :: Flink
Examples #2182' does not have a result yet. Please make sure you set a proper result in case
of pipeline/build scripts.
No mail will be sent out, as 'carbondata-master-spark-2.3 » Apache CarbonData :: Core #2182'
does not have a result yet. Please make sure you set a proper result in case of pipeline/build
scripts.
Sending e-mails to: commits@carbondata.apache.org
No mail will be sent out, as 'carbondata-master-spark-2.3 » Apache CarbonData :: Presto
#2182' does not have a result yet. Please make sure you set a proper result in case of pipeline/build
scripts.
No mail will be sent out, as 'carbondata-master-spark-2.3 » Apache CarbonData :: Secondary
Index #2182' does not have a result yet. Please make sure you set a proper result in case
of pipeline/build scripts.
No mail will be sent out, as 'carbondata-master-spark-2.3 » Apache CarbonData :: Spark
#2182' does not have a result yet. Please make sure you set a proper result in case of pipeline/build
scripts.
channel stopped
Not sending mail to unregistered user 441586683@qq.com
Not sending mail to unregistered user ajanthabhat@gmail.com
Not sending mail to unregistered user akshay.nuthala@gmail.com
Not sending mail to unregistered user carbondatacontributions@gmail.com
Not sending mail to unregistered user indhumathim27@gmail.com
Not sending mail to unregistered user jacky.likun@qq.com
Not sending mail to unregistered user kunalkapoor642@gmail.com
Not sending mail to unregistered user vikramahuja8803@gmail.com

Mime
View raw message