cxf-notifications mailing list archives

Site index · List index
Message view « Date » · « Thread »
Top « Date » · « Thread »
From Apache Hudson Server <hud...@hudson.zones.apache.org>
Subject Build failed in Hudson: CXF-2.2.x-JDK15 #329
Date Wed, 10 Feb 2010 01:14:18 GMT
See <http://hudson.zones.apache.org/hudson/job/CXF-2.2.x-JDK15/329/changes>

Changes:

[dkulp] Merged revisions 908222 via svnmerge from 
https://svn.apache.org/repos/asf/cxf/trunk

........
  r908222 | dkulp | 2010-02-09 16:12:06 -0500 (Tue, 09 Feb 2010) | 2 lines
  
  [CXF-2663] Fix for null classes coming from XmlSeeAlso annotation.
  Modified patch from Craig Tataryn applied
........

[dkulp] Merged revisions 907888 via svnmerge from 
https://svn.apache.org/repos/asf/cxf/trunk

........
  r907888 | dkulp | 2010-02-08 21:32:25 -0500 (Mon, 08 Feb 2010) | 1 line
  
  remove compiler config as the parent configures it
........

[dkulp] Merged revisions 907886 via svnmerge from 
https://svn.apache.org/repos/asf/cxf/trunk

........
  r907886 | dkulp | 2010-02-08 21:32:03 -0500 (Mon, 08 Feb 2010) | 1 line
  
  The checkstyle plugin upgrade also requires new eclipse config
........

[dkulp] Merged revisions 907649 via svnmerge from 
https://svn.apache.org/repos/asf/cxf/trunk

........
  r907649 | bimargulies | 2010-02-08 08:00:57 -0500 (Mon, 08 Feb 2010) | 1 line
  
  update to cs 2.4. no velocity noise
........

------------------------------------------
[...truncated 36 lines...]
[INFO]   Apache CXF Runtime Core
[INFO]   Apache CXF Command Line Tools Common
[INFO]   Apache CXF Command Line Tools Validator
[INFO]   Apache CXF Command Line Tools WSDLTo Core
[INFO]   Apache CXF Command Line Tools WSDLTo JAXWS Frontend
[INFO]   Apache CXF WSDL Validator Maven2 Plugin
[INFO]   Apache CXF Command Line Tools WSDLTo JAXB Databinding
[INFO]   Apache CXF Code Generation Maven2 Plugins
[INFO]   Apache CXF Test Utilities
[INFO]   Apache CXF Runtime JAXB DataBinding
[INFO]   Apache CXF Runtime XML Binding
[INFO]   Apache CXF Runtime SOAP Binding
[INFO]   Apache CXF Runtime Local Transport
[INFO]   Apache CXF Runtime Simple Frontend
[INFO]   Apache CXF Runtime HTTP Transport
[INFO]   Apache CXF Runtime HTTP Jetty Transport
[INFO]   Apache CXF Runtime WS Addressing
[INFO]   Apache CXF Runtime JAX-WS Frontend
[INFO]   Apache CXF Test Case Support
[INFO]   Apache CXF Runtime Aegis Databinding
[INFO]   Apache CXF Runtime JavaScript Client Generator
[INFO]   Apache CXF Command Line Tools WSDL to JavaScript Front End
[INFO]   Apache CXF Runtime Management
[INFO]   Apache CXF Runtime JMS Transport
[INFO]   Apache CXF Runtime XmlBeans DataBinding
[INFO]   Apache CXF Command Line Tools WSDLTo Test
[INFO]   Apache CXF Command Line Tools WSDLTo Misctools
[INFO]   Apache CXF Command Line Tools
[INFO]   Apache CXF Command Line Tools WSDLTo
[INFO]   Apache CXF Command Line Tools JavaTo WS
[INFO]   Apache CXF Command Line Tools JavaTo
[INFO]   Apache CXF Runtime CORBA Binding
[INFO]   Apache CXF Command Line Tools CORBA
[INFO]   Apache CXF Runtime HTTP Binding
[INFO]   Apache CXF Runtime Object Binding
[INFO]   Apache CXF Runtime Colocated Binding
[INFO]   Apache CXF Runtime JBI Binding
[INFO]   Apache CXF Runtime
[INFO]   Apache CXF Runtime Bindings
[INFO]   Apache CXF Runtime JAX-RS Frontend
[INFO]   Apache CXF Runtime JavaScript Frontend
[INFO]   Apache CXF HTTP Transport for OSGi
[INFO]   Apache CXF Runtime JBI Transport
[INFO]   Apache CXF Runtime WS Policy
[INFO]   Apache CXF Runtime WS Reliable Messaging
[INFO]   Apache CXF Runtime WS Security
[INFO]   Apache CXF JBI Integration
[INFO]   Apache CXF JCA Connection
[INFO]   Apache CXF Integration
[INFO]   Apache CXF Java2WS Maven2 Plugin
[INFO]   Apache CXF CORBA Tools Maven2 Plugins
[INFO]   Apache CXF Archetype - Simple JAX-WS Java First
[INFO]   Apache CXF Maven Archetypes
[INFO]   Apache CXF Maven Plugins
[INFO]   Apache CXF Uncategorized System Tests
[INFO]   Apache CXF Transport System Tests
[INFO]   Apache CXF JAX-WS System Tests
[INFO]   Apache CXF Databinding System Tests
[INFO]   Apache CXF JAX-RS System Tests
[INFO]   Apache CXF WS-* Specifications System Tests
[INFO]   Test for writing wsdl to repo
[INFO]   Test for reading wsdl from repo and generating code from it
[INFO]   Apache CXF System Tests
[INFO]   Apache CXF System Tests for WSDL generation and retrieval
[INFO] ------------------------------------------------------------------------
[INFO] Building Apache CXF
[INFO]    task-segment: [clean, install]
[INFO] ------------------------------------------------------------------------
[INFO] [clean:clean {execution: default-clean}]
[INFO] [site:attach-descriptor {execution: default-attach-descriptor}]
[INFO] [install:install {execution: default-install}]
[INFO] Installing <http://hudson.zones.apache.org/hudson/job/CXF-2.2.x-JDK15/ws/2.2.x-fixes/pom.xml>
to <http://hudson.zones.apache.org/hudson/job/CXF-2.2.x-JDK15/ws/.repository/org/apache/cxf/cxf/2.2.7-SNAPSHOT/cxf-2.2.7-SNAPSHOT.pom>
[HUDSON] Archiving <http://hudson.zones.apache.org/hudson/job/CXF-2.2.x-JDK15/ws/2.2.x-fixes/pom.xml>
to /export/home/hudson/hudson/jobs/CXF-2.2.x-JDK15/modules/org.apache.cxf$cxf/builds/2010-02-10_01-11-40/archive/org.apache.cxf/cxf/2.2.7-SNAPSHOT/pom.xml
[HUDSON] Archiving <http://hudson.zones.apache.org/hudson/job/CXF-2.2.x-JDK15/ws/.repository/org/apache/cxf/cxf/2.2.7-SNAPSHOT/cxf-2.2.7-SNAPSHOT.pom>
to /export/home/hudson/hudson/jobs/CXF-2.2.x-JDK15/modules/org.apache.cxf$cxf/builds/2010-02-10_01-11-40/archive/org.apache.cxf/cxf/2.2.7-SNAPSHOT/cxf-2.2.7-SNAPSHOT.pom
[INFO] ------------------------------------------------------------------------
[INFO] Building Apache CXF Buildtools
[INFO]    task-segment: [clean, install]
[INFO] ------------------------------------------------------------------------
[INFO] [clean:clean {execution: default-clean}]
[INFO] Deleting file set: <http://hudson.zones.apache.org/hudson/job/CXF-2.2.x-JDK15/ws/2.2.x-fixes/buildtools/target>
(included: [**], excluded: [])
[INFO] [resources:resources {execution: default-resources}]
[INFO] Using 'UTF-8' encoding to copy filtered resources.
[INFO] Copying 11 resources
[INFO] [compiler:compile {execution: default-compile}]
[INFO] Compiling 3 source files to <http://hudson.zones.apache.org/hudson/job/CXF-2.2.x-JDK15/ws/2.2.x-fixes/buildtools/target/classes>
[INFO] [resources:testResources {execution: default-testResources}]
[INFO] Using 'UTF-8' encoding to copy filtered resources.
[INFO] skip non existing resourceDirectory <http://hudson.zones.apache.org/hudson/job/CXF-2.2.x-JDK15/ws/2.2.x-fixes/buildtools/src/test/resources>
[INFO] [compiler:testCompile {execution: default-testCompile}]
[INFO] Not compiling test sources
[INFO] [surefire:test {execution: default-test}]
[INFO] Tests are skipped.
[INFO] [jar:jar {execution: default-jar}]
[INFO] Building jar: <http://hudson.zones.apache.org/hudson/job/CXF-2.2.x-JDK15/ws/2.2.x-fixes/buildtools/target/cxf-buildtools-2.2.7-SNAPSHOT.jar>
[INFO] [install:install {execution: default-install}]
[INFO] Installing <http://hudson.zones.apache.org/hudson/job/CXF-2.2.x-JDK15/ws/2.2.x-fixes/buildtools/target/cxf-buildtools-2.2.7-SNAPSHOT.jar>
to <http://hudson.zones.apache.org/hudson/job/CXF-2.2.x-JDK15/ws/.repository/org/apache/cxf/cxf-buildtools/2.2.7-SNAPSHOT/cxf-buildtools-2.2.7-SNAPSHOT.jar>
[HUDSON] Archiving <http://hudson.zones.apache.org/hudson/job/CXF-2.2.x-JDK15/ws/2.2.x-fixes/buildtools/pom.xml>
to /export/home/hudson/hudson/jobs/CXF-2.2.x-JDK15/modules/org.apache.cxf$cxf-buildtools/builds/2010-02-10_01-11-40/archive/org.apache.cxf/cxf-buildtools/2.2.7-SNAPSHOT/pom.xml
[HUDSON] Archiving <http://hudson.zones.apache.org/hudson/job/CXF-2.2.x-JDK15/ws/2.2.x-fixes/buildtools/target/cxf-buildtools-2.2.7-SNAPSHOT.jar>
to /export/home/hudson/hudson/jobs/CXF-2.2.x-JDK15/modules/org.apache.cxf$cxf-buildtools/builds/2010-02-10_01-11-40/archive/org.apache.cxf/cxf-buildtools/2.2.7-SNAPSHOT/cxf-buildtools-2.2.7-SNAPSHOT.jar
[INFO] ------------------------------------------------------------------------
[INFO] Building Apache CXF XML to FastInfoset Maven2 Plugin
[INFO]    task-segment: [clean, install]
[INFO] ------------------------------------------------------------------------
[INFO] [clean:clean {execution: default-clean}]
[INFO] Deleting file set: <http://hudson.zones.apache.org/hudson/job/CXF-2.2.x-JDK15/ws/2.2.x-fixes/maven-plugins/xml2fastinfoset-plugin/target>
(included: [**], excluded: [])
[INFO] [plugin:descriptor {execution: default-descriptor}]
[WARNING] Using platform encoding (UTF-8 actually) to read mojo metadata, i.e. build is platform
dependent!
[INFO] Applying mojo extractor for language: java
[INFO] Mojo extractor for language: java found 1 mojo descriptors.
[INFO] Applying mojo extractor for language: bsh
[INFO] Mojo extractor for language: bsh found 0 mojo descriptors.
[INFO] [resources:resources {execution: default-resources}]
[INFO] Using 'UTF-8' encoding to copy filtered resources.
[INFO] skip non existing resourceDirectory <http://hudson.zones.apache.org/hudson/job/CXF-2.2.x-JDK15/ws/2.2.x-fixes/maven-plugins/xml2fastinfoset-plugin/src/main/resources>
[INFO] [compiler:compile {execution: default-compile}]
[INFO] Compiling 1 source file to <http://hudson.zones.apache.org/hudson/job/CXF-2.2.x-JDK15/ws/2.2.x-fixes/maven-plugins/xml2fastinfoset-plugin/target/classes>
[INFO] [resources:testResources {execution: default-testResources}]
[INFO] Using 'UTF-8' encoding to copy filtered resources.
[INFO] skip non existing resourceDirectory <http://hudson.zones.apache.org/hudson/job/CXF-2.2.x-JDK15/ws/2.2.x-fixes/maven-plugins/xml2fastinfoset-plugin/src/test/resources>
[INFO] [compiler:testCompile {execution: default-testCompile}]
[INFO] No sources to compile
[INFO] [surefire:test {execution: default-test}]
[INFO] No tests to run.
[HUDSON] Recording test results
[INFO] [jar:jar {execution: default-jar}]
[INFO] Building jar: <http://hudson.zones.apache.org/hudson/job/CXF-2.2.x-JDK15/ws/2.2.x-fixes/maven-plugins/xml2fastinfoset-plugin/target/cxf-xml2fastinfoset-plugin-2.2.7-SNAPSHOT.jar>
[INFO] [plugin:addPluginArtifactMetadata {execution: default-addPluginArtifactMetadata}]
[INFO] [install:install {execution: default-install}]
[INFO] Installing <http://hudson.zones.apache.org/hudson/job/CXF-2.2.x-JDK15/ws/2.2.x-fixes/maven-plugins/xml2fastinfoset-plugin/target/cxf-xml2fastinfoset-plugin-2.2.7-SNAPSHOT.jar>
to <http://hudson.zones.apache.org/hudson/job/CXF-2.2.x-JDK15/ws/.repository/org/apache/cxf/cxf-xml2fastinfoset-plugin/2.2.7-SNAPSHOT/cxf-xml2fastinfoset-plugin-2.2.7-SNAPSHOT.jar>
[HUDSON] Archiving <http://hudson.zones.apache.org/hudson/job/CXF-2.2.x-JDK15/ws/2.2.x-fixes/maven-plugins/xml2fastinfoset-plugin/pom.xml>
to /export/home/hudson/hudson/jobs/CXF-2.2.x-JDK15/modules/org.apache.cxf$cxf-xml2fastinfoset-plugin/builds/2010-02-10_01-11-40/archive/org.apache.cxf/cxf-xml2fastinfoset-plugin/2.2.7-SNAPSHOT/pom.xml
[HUDSON] Archiving <http://hudson.zones.apache.org/hudson/job/CXF-2.2.x-JDK15/ws/2.2.x-fixes/maven-plugins/xml2fastinfoset-plugin/target/cxf-xml2fastinfoset-plugin-2.2.7-SNAPSHOT.jar>
to /export/home/hudson/hudson/jobs/CXF-2.2.x-JDK15/modules/org.apache.cxf$cxf-xml2fastinfoset-plugin/builds/2010-02-10_01-11-40/archive/org.apache.cxf/cxf-xml2fastinfoset-plugin/2.2.7-SNAPSHOT/cxf-xml2fastinfoset-plugin-2.2.7-SNAPSHOT.jar
[INFO] ------------------------------------------------------------------------
[INFO] Building Apache CXF Parent
[INFO]    task-segment: [clean, install]
[INFO] ------------------------------------------------------------------------
Downloading: http://repo1.maven.org/maven2/org/apache/maven/plugins/maven-checkstyle-plugin/2.4/maven-checkstyle-plugin-2.4.pom

Downloading: http://repo1.maven.org/maven2/org/apache/maven/plugins/maven-plugins/16/maven-plugins-16.pom

Downloading: http://repo1.maven.org/maven2/org/apache/maven/plugins/maven-checkstyle-plugin/2.4/maven-checkstyle-plugin-2.4.jar

[INFO] [clean:clean {execution: default-clean}]
[INFO] Deleting file set: <http://hudson.zones.apache.org/hudson/job/CXF-2.2.x-JDK15/ws/2.2.x-fixes/parent/target>
(included: [**], excluded: [])
Downloading: http://repo1.maven.org/maven2/org/apache/maven/reporting/maven-reporting-impl/2.0.4.3/maven-reporting-impl-2.0.4.3.pom

Downloading: http://repo1.maven.org/maven2/org/apache/maven/shared/maven-shared-components/14/maven-shared-components-14.pom

Downloading: http://repo1.maven.org/maven2/checkstyle/checkstyle/5.0/checkstyle-5.0.pom

Downloading: http://repo1.maven.org/maven2/com/google/collections/google-collections/0.9/google-collections-0.9.pom

Downloading: http://repo1.maven.org/maven2/checkstyle/checkstyle/5.0/checkstyle-5.0.jar
Downloading: http://repo1.maven.org/maven2/org/apache/maven/reporting/maven-reporting-impl/2.0.4.3/maven-reporting-impl-2.0.4.3.jar
Downloading: http://repo1.maven.org/maven2/com/google/collections/google-collections/0.9/google-collections-0.9.jar



[INFO] [checkstyle:checkstyle {execution: validate}]
[INFO] Source directory does not exist - skipping report.
[INFO] Preparing pmd:check
[HUDSON] Archiving <http://hudson.zones.apache.org/hudson/job/CXF-2.2.x-JDK15/ws/2.2.x-fixes/parent/pom.xml>
to /export/home/hudson/hudson/jobs/CXF-2.2.x-JDK15/modules/org.apache.cxf$cxf-parent/builds/2010-02-10_01-11-40/archive/org.apache.cxf/cxf-parent/2.2.7-SNAPSHOT/pom.xml
[INFO] [pmd:pmd {execution: pmd}]
[INFO] [pmd:check {execution: validate}]
[INFO] [cxf-xml2fastinfoset:xml2fastinfoset {execution: xml2fastinfoset}]
[INFO] Setting property: classpath.resource.loader.class => 'org.codehaus.plexus.velocity.ContextClassLoaderResourceLoader'.
[INFO] Setting property: velocimacro.messages.on => 'false'.
[INFO] Setting property: resource.loader => 'classpath'.
[INFO] Setting property: resource.manager.logwhenfound => 'false'.
[INFO] [remote-resources:process {execution: default}]
[INFO] [site:attach-descriptor {execution: default-attach-descriptor}]
[INFO] [install:install {execution: default-install}]
[INFO] Installing <http://hudson.zones.apache.org/hudson/job/CXF-2.2.x-JDK15/ws/2.2.x-fixes/parent/pom.xml>
to <http://hudson.zones.apache.org/hudson/job/CXF-2.2.x-JDK15/ws/.repository/org/apache/cxf/cxf-parent/2.2.7-SNAPSHOT/cxf-parent-2.2.7-SNAPSHOT.pom>
[HUDSON] Archiving <http://hudson.zones.apache.org/hudson/job/CXF-2.2.x-JDK15/ws/.repository/org/apache/cxf/cxf-parent/2.2.7-SNAPSHOT/cxf-parent-2.2.7-SNAPSHOT.pom>
to /export/home/hudson/hudson/jobs/CXF-2.2.x-JDK15/modules/org.apache.cxf$cxf-parent/builds/2010-02-10_01-11-40/archive/org.apache.cxf/cxf-parent/2.2.7-SNAPSHOT/cxf-parent-2.2.7-SNAPSHOT.pom
[INFO] ------------------------------------------------------------------------
[INFO] Building Apache CXF Common Utilities
[INFO]    task-segment: [clean, install]
[INFO] ------------------------------------------------------------------------
[INFO] [clean:clean {execution: default-clean}]
[INFO] Deleting file set: <http://hudson.zones.apache.org/hudson/job/CXF-2.2.x-JDK15/ws/2.2.x-fixes/common/common/target>
(included: [**], excluded: [])
[INFO] [checkstyle:checkstyle {execution: validate}]
[HUDSON] Archiving <http://hudson.zones.apache.org/hudson/job/CXF-2.2.x-JDK15/ws/2.2.x-fixes/common/common/pom.xml>
to /export/home/hudson/hudson/jobs/CXF-2.2.x-JDK15/modules/org.apache.cxf$cxf-common-utilities/builds/2010-02-10_01-11-40/archive/org.apache.cxf/cxf-common-utilities/2.2.7-SNAPSHOT/pom.xml
[INFO] ------------------------------------------------------------------------
[ERROR] BUILD ERROR
[INFO] ------------------------------------------------------------------------
[INFO] An error has occurred in Checkstyle report generation.

Embedded error: Failed during checkstyle configuration
TreeWalker is not allowed as a parent of FileLength
[INFO] ------------------------------------------------------------------------
[INFO] Trace
org.apache.maven.lifecycle.LifecycleExecutionException: An error has occurred in Checkstyle
report generation.
	at org.apache.maven.lifecycle.DefaultLifecycleExecutor.executeGoals(DefaultLifecycleExecutor.java:719)
	at org.apache.maven.lifecycle.DefaultLifecycleExecutor.executeGoalWithLifecycle(DefaultLifecycleExecutor.java:556)
	at org.apache.maven.lifecycle.DefaultLifecycleExecutor.executeGoal(DefaultLifecycleExecutor.java:535)
	at org.apache.maven.lifecycle.DefaultLifecycleExecutor.executeGoalAndHandleFailures(DefaultLifecycleExecutor.java:387)
	at org.apache.maven.lifecycle.DefaultLifecycleExecutor.executeTaskSegments(DefaultLifecycleExecutor.java:348)
	at org.apache.maven.lifecycle.DefaultLifecycleExecutor.execute(DefaultLifecycleExecutor.java:180)
	at org.apache.maven.lifecycle.LifecycleExecutorInterceptor.execute(LifecycleExecutorInterceptor.java:65)
	at org.apache.maven.DefaultMaven.doExecute(DefaultMaven.java:328)
	at org.apache.maven.DefaultMaven.execute(DefaultMaven.java:138)
	at org.apache.maven.cli.MavenCli.main(MavenCli.java:362)
	at sun.reflect.NativeMethodAccessorImpl.invoke0(Native Method)
	at sun.reflect.NativeMethodAccessorImpl.invoke(NativeMethodAccessorImpl.java:39)
	at sun.reflect.DelegatingMethodAccessorImpl.invoke(DelegatingMethodAccessorImpl.java:25)
	at java.lang.reflect.Method.invoke(Method.java:585)
	at org.codehaus.classworlds.Launcher.launchEnhanced(Launcher.java:315)
	at org.codehaus.classworlds.Launcher.launch(Launcher.java:255)
	at hudson.maven.agent.Main.launch(Main.java:165)
	at hudson.maven.MavenBuilder.call(MavenBuilder.java:159)
	at hudson.maven.MavenModuleSetBuild$Builder.call(MavenModuleSetBuild.java:688)
	at hudson.maven.MavenModuleSetBuild$Builder.call(MavenModuleSetBuild.java:632)
	at hudson.remoting.UserRequest.perform(UserRequest.java:104)
	at hudson.remoting.UserRequest.perform(UserRequest.java:48)
	at hudson.remoting.Request$2.run(Request.java:236)
	at java.util.concurrent.Executors$RunnableAdapter.call(Executors.java:417)
	at java.util.concurrent.FutureTask$Sync.innerRun(FutureTask.java:269)
	at java.util.concurrent.FutureTask.run(FutureTask.java:123)
	at java.util.concurrent.ThreadPoolExecutor$Worker.runTask(ThreadPoolExecutor.java:650)
	at java.util.concurrent.ThreadPoolExecutor$Worker.run(ThreadPoolExecutor.java:675)
	at java.lang.Thread.run(Thread.java:595)
Caused by: org.apache.maven.plugin.MojoExecutionException: An error has occurred in Checkstyle
report generation.
	at org.apache.maven.reporting.AbstractMavenReport.execute(AbstractMavenReport.java:83)
	at org.apache.maven.plugin.DefaultPluginManager.executeMojo(DefaultPluginManager.java:490)
	at hudson.maven.agent.PluginManagerInterceptor.executeMojo(PluginManagerInterceptor.java:182)
	at org.apache.maven.lifecycle.DefaultLifecycleExecutor.executeGoals(DefaultLifecycleExecutor.java:694)
	... 28 more
Caused by: org.apache.maven.reporting.MavenReportException: Failed during checkstyle configuration
	at org.apache.maven.plugin.checkstyle.CheckstyleReport.executeReport(CheckstyleReport.java:645)
	at org.apache.maven.reporting.AbstractMavenReport.generate(AbstractMavenReport.java:131)
	at org.apache.maven.reporting.AbstractMavenReport.execute(AbstractMavenReport.java:76)
	... 31 more
Caused by: com.puppycrawl.tools.checkstyle.api.CheckstyleException: cannot initialize module
TreeWalker - TreeWalker is not allowed as a parent of FileLength
	at com.puppycrawl.tools.checkstyle.Checker.setupChild(Checker.java:177)
	at com.puppycrawl.tools.checkstyle.api.AutomaticBean.configure(AutomaticBean.java:207)
	at org.apache.maven.plugin.checkstyle.CheckstyleReport.executeCheckstyle(CheckstyleReport.java:870)
	at org.apache.maven.plugin.checkstyle.CheckstyleReport.executeReport(CheckstyleReport.java:630)
	... 33 more
Caused by: com.puppycrawl.tools.checkstyle.api.CheckstyleException: TreeWalker is not allowed
as a parent of FileLength
	at com.puppycrawl.tools.checkstyle.TreeWalker.setupChild(TreeWalker.java:161)
	at com.puppycrawl.tools.checkstyle.api.AutomaticBean.configure(AutomaticBean.java:207)
	at com.puppycrawl.tools.checkstyle.Checker.setupChild(Checker.java:156)
	... 36 more
[INFO] ------------------------------------------------------------------------
[INFO] Total time: 34 seconds
[INFO] Finished at: Wed Feb 10 01:12:22 UTC 2010
[INFO] Final Memory: 48M/90M
[INFO] ------------------------------------------------------------------------
Waiting for Hudson to finish collecting data
Sending e-mails to: notifications@cxf.apache.org
channel stopped


Mime
View raw message