cxf-notifications mailing list archives

Site index · List index
Message view « Date » · « Thread »
Top « Date » · « Thread »
From Apache Hudson Server <hud...@hudson.apache.org>
Subject Build failed in Hudson: CXF-2.2.x-JDK15 » Apache CXF Runtime WS Security #545
Date Tue, 05 Oct 2010 16:38:16 GMT
See <https://hudson.apache.org/hudson/job/CXF-2.2.x-JDK15/org.apache.cxf$cxf-rt-ws-security/545/changes>

Changes:

[dkulp] Merged revisions 1004674 via svnmerge from 
https://svn.apache.org/repos/asf/cxf/trunk

........
  r1004674 | dkulp | 2010-10-05 11:34:28 -0400 (Tue, 05 Oct 2010) | 2 lines
  
  [CXF-2527] Fix for using relative references with wsc:Identifiers
  Patch from Colm O'hEigeartaigh applied
........

[dkulp] Merged revisions 1004665 via svnmerge from 
https://svn.apache.org/repos/asf/cxf/trunk

........
  r1004665 | dkulp | 2010-10-05 11:08:24 -0400 (Tue, 05 Oct 2010) | 1 line
  
  Update to latest wss4j
........

------------------------------------------
[INFO] ------------------------------------------------------------------------
[INFO] Building Apache CXF Runtime WS Security
[INFO]    task-segment: [clean, install]
[INFO] ------------------------------------------------------------------------
[INFO] [clean:clean {execution: default-clean}]
[INFO] Deleting <https://hudson.apache.org/hudson/job/CXF-2.2.x-JDK15/org.apache.cxf$cxf-rt-ws-security/ws/target>
Downloading: http://repo1.maven.org/maven2/org/apache/ws/security/wss4j/1.5.9/wss4j-1.5.9.pom

Downloading: http://repo1.maven.org/maven2/org/apache/ws/security/wss4j/1.5.9/wss4j-1.5.9.jar

[INFO] [checkstyle:checkstyle {execution: validate}]
[INFO] Starting audit...
<https://hudson.apache.org/hudson/job/CXF-2.2.x-JDK15/org.apache.cxf$cxf-rt-ws-security/ws/src/main/java/org/apache/cxf/ws/security/wss4j/policyhandlers/SymmetricBindingHandler.java>:388:5:
Executable statement count is 79 (max allowed is 75).
<https://hudson.apache.org/hudson/job/CXF-2.2.x-JDK15/org.apache.cxf$cxf-rt-ws-security/ws/src/main/java/org/apache/cxf/ws/security/wss4j/policyhandlers/SymmetricBindingHandler.java>:388:5:
NCSS for this method is 105 (max allowed is 100).
Audit done.

[HUDSON] Archiving <https://hudson.apache.org/hudson/job/CXF-2.2.x-JDK15/org.apache.cxf$cxf-rt-ws-security/ws/pom.xml>
to /home/hudson/hudson/jobs/CXF-2.2.x-JDK15/modules/org.apache.cxf$cxf-rt-ws-security/builds/2010-10-05_16-14-59/archive/org.apache.cxf/cxf-rt-ws-security/2.2.11-SNAPSHOT/pom.xml
[INFO] ------------------------------------------------------------------------
[ERROR] BUILD ERROR
[INFO] ------------------------------------------------------------------------
[INFO] An error has occurred in Checkstyle report generation.

Embedded error: Failed during checkstyle execution
There are 2 checkstyle errors.
[INFO] ------------------------------------------------------------------------
[INFO] Trace
org.apache.maven.lifecycle.LifecycleExecutionException: An error has occurred in Checkstyle
report generation.
	at org.apache.maven.lifecycle.DefaultLifecycleExecutor.executeGoals(DefaultLifecycleExecutor.java:719)
	at org.apache.maven.lifecycle.DefaultLifecycleExecutor.executeGoalWithLifecycle(DefaultLifecycleExecutor.java:556)
	at org.apache.maven.lifecycle.DefaultLifecycleExecutor.executeGoal(DefaultLifecycleExecutor.java:535)
	at org.apache.maven.lifecycle.DefaultLifecycleExecutor.executeGoalAndHandleFailures(DefaultLifecycleExecutor.java:387)
	at org.apache.maven.lifecycle.DefaultLifecycleExecutor.executeTaskSegments(DefaultLifecycleExecutor.java:348)
	at org.apache.maven.lifecycle.DefaultLifecycleExecutor.execute(DefaultLifecycleExecutor.java:180)
	at org.apache.maven.lifecycle.LifecycleExecutorInterceptor.execute(LifecycleExecutorInterceptor.java:65)
	at org.apache.maven.DefaultMaven.doExecute(DefaultMaven.java:328)
	at org.apache.maven.DefaultMaven.execute(DefaultMaven.java:138)
	at org.apache.maven.cli.MavenCli.main(MavenCli.java:362)
	at sun.reflect.NativeMethodAccessorImpl.invoke0(Native Method)
	at sun.reflect.NativeMethodAccessorImpl.invoke(NativeMethodAccessorImpl.java:39)
	at sun.reflect.DelegatingMethodAccessorImpl.invoke(DelegatingMethodAccessorImpl.java:25)
	at java.lang.reflect.Method.invoke(Method.java:592)
	at org.codehaus.classworlds.Launcher.launchEnhanced(Launcher.java:315)
	at org.codehaus.classworlds.Launcher.launch(Launcher.java:255)
	at hudson.maven.agent.Main.launch(Main.java:165)
	at hudson.maven.MavenBuilder.call(MavenBuilder.java:165)
	at hudson.maven.MavenModuleSetBuild$Builder.call(MavenModuleSetBuild.java:681)
	at hudson.maven.MavenModuleSetBuild$Builder.call(MavenModuleSetBuild.java:625)
	at hudson.remoting.UserRequest.perform(UserRequest.java:114)
	at hudson.remoting.UserRequest.perform(UserRequest.java:48)
	at hudson.remoting.Request$2.run(Request.java:270)
	at java.util.concurrent.Executors$RunnableAdapter.call(Executors.java:417)
	at java.util.concurrent.FutureTask$Sync.innerRun(FutureTask.java:269)
	at java.util.concurrent.FutureTask.run(FutureTask.java:123)
	at java.util.concurrent.ThreadPoolExecutor$Worker.runTask(ThreadPoolExecutor.java:651)
	at java.util.concurrent.ThreadPoolExecutor$Worker.run(ThreadPoolExecutor.java:676)
	at java.lang.Thread.run(Thread.java:595)
Caused by: org.apache.maven.plugin.MojoExecutionException: An error has occurred in Checkstyle
report generation.
	at org.apache.maven.reporting.AbstractMavenReport.execute(AbstractMavenReport.java:122)
	at org.apache.maven.plugin.DefaultPluginManager.executeMojo(DefaultPluginManager.java:490)
	at hudson.maven.agent.PluginManagerInterceptor.executeMojo(PluginManagerInterceptor.java:182)
	at org.apache.maven.lifecycle.DefaultLifecycleExecutor.executeGoals(DefaultLifecycleExecutor.java:694)
	... 28 more
Caused by: org.apache.maven.reporting.MavenReportException: Failed during checkstyle execution
	at org.apache.maven.plugin.checkstyle.CheckstyleReport.executeReport(CheckstyleReport.java:597)
	at org.apache.maven.reporting.AbstractMavenReport.generate(AbstractMavenReport.java:190)
	at org.apache.maven.reporting.AbstractMavenReport.execute(AbstractMavenReport.java:99)
	... 31 more
Caused by: org.apache.maven.plugin.checkstyle.CheckstyleExecutorException: There are 2 checkstyle
errors.
	at org.apache.maven.plugin.checkstyle.DefaultCheckstyleExecutor.executeCheckstyle(DefaultCheckstyleExecutor.java:216)
	at org.apache.maven.plugin.checkstyle.CheckstyleReport.executeReport(CheckstyleReport.java:578)
	... 33 more
[INFO] ------------------------------------------------------------------------
[INFO] Total time: 23 minutes 5 seconds
[INFO] Finished at: Tue Oct 05 16:38:15 UTC 2010
[INFO] Final Memory: 125M/212M
[INFO] ------------------------------------------------------------------------


Mime
View raw message