cxf-notifications mailing list archives

Site index · List index
Message view « Date » · « Thread »
Top « Date » · « Thread »
From Apache Hudson Server <hud...@hudson.apache.org>
Subject Build failed in Hudson: CXF-2.2.x-JDK15 #574
Date Thu, 11 Nov 2010 21:29:44 GMT
See <https://hudson.apache.org/hudson/job/CXF-2.2.x-JDK15/574/changes>

Changes:

[sergeyb] Merged revisions 1034076 via svnmerge from 
https://svn.apache.org/repos/asf/cxf/branches/2.3.x-fixes

................
  r1034076 | sergeyb | 2010-11-11 19:41:34 +0000 (Thu, 11 Nov 2010) | 9 lines
  
  Merged revisions 1034071 via svnmerge from 
  https://svn.apache.org/repos/asf/cxf/trunk
  
  ........
    r1034071 | sergeyb | 2010-11-11 19:39:19 +0000 (Thu, 11 Nov 2010) | 1 line
    
    JAX-RS: another attempt on breaking the client dependency on the servlet api
  ........
................

[sergeyb] Merged revisions 1034055 via svnmerge from 
https://svn.apache.org/repos/asf/cxf/branches/2.3.x-fixes

................
  r1034055 | sergeyb | 2010-11-11 19:15:17 +0000 (Thu, 11 Nov 2010) | 9 lines
  
  Merged revisions 1034052 via svnmerge from 
  https://svn.apache.org/repos/asf/cxf/trunk
  
  ........
    r1034052 | sergeyb | 2010-11-11 19:12:56 +0000 (Thu, 11 Nov 2010) | 1 line
    
    JAX-RS : Fixing a catch statement
  ........
................

[sergeyb] Merged revisions 1034045 via svnmerge from 
https://svn.apache.org/repos/asf/cxf/branches/2.3.x-fixes

................
  r1034045 | sergeyb | 2010-11-11 18:53:20 +0000 (Thu, 11 Nov 2010) | 9 lines
  
  Merged revisions 1034035 via svnmerge from 
  https://svn.apache.org/repos/asf/cxf/trunk
  
  ........
    r1034035 | sergeyb | 2010-11-11 18:44:12 +0000 (Thu, 11 Nov 2010) | 1 line
    
    Making sure no servlet api is strictly required on the client side
  ........
................

------------------------------------------
[...truncated 3610 lines...]
[INFO] Deleting <https://hudson.apache.org/hudson/job/CXF-2.2.x-JDK15/ws/2.2.x-fixes/rt/bindings/coloc/target>
[INFO] [checkstyle:checkstyle {execution: validate}]
[INFO] Starting audit...
Audit done.

[INFO] Preparing pmd:check
[HUDSON] Archiving <https://hudson.apache.org/hudson/job/CXF-2.2.x-JDK15/ws/2.2.x-fixes/rt/bindings/coloc/pom.xml>
to /home/hudson/hudson/jobs/CXF-2.2.x-JDK15/modules/org.apache.cxf$cxf-rt-bindings-coloc/builds/2010-11-11_21-10-49/archive/org.apache.cxf/cxf-rt-bindings-coloc/2.2.12-SNAPSHOT/pom.xml
[INFO] [pmd:pmd {execution: pmd}]
[INFO] [pmd:check {execution: validate}]
[INFO] 
[INFO] [cxf-xml2fastinfoset:xml2fastinfoset {execution: xml2fastinfoset}]
[INFO] [remote-resources:process {execution: default}]
[INFO] [resources:resources {execution: default-resources}]
[INFO] Using 'UTF-8' encoding to copy filtered resources.
[INFO] Copying 1 resource
[INFO] Copying 1 resource
[INFO] skip non existing resourceDirectory <https://hudson.apache.org/hudson/job/CXF-2.2.x-JDK15/ws/2.2.x-fixes/rt/bindings/coloc/src/main/resources-filtered>
[INFO] skip non existing resourceDirectory <https://hudson.apache.org/hudson/job/CXF-2.2.x-JDK15/ws/2.2.x-fixes/rt/bindings/coloc/target/generated/src/main/resources>
[INFO] Copying 3 resources
[INFO] [compiler:compile {execution: default-compile}]
[INFO] Compiling 10 source files to <https://hudson.apache.org/hudson/job/CXF-2.2.x-JDK15/ws/2.2.x-fixes/rt/bindings/coloc/target/classes>
[INFO] [resources:testResources {execution: default-testResources}]
[INFO] Using 'UTF-8' encoding to copy filtered resources.
[INFO] Copying 0 resource
[INFO] skip non existing resourceDirectory <https://hudson.apache.org/hudson/job/CXF-2.2.x-JDK15/ws/2.2.x-fixes/rt/bindings/coloc/src/test/resources>
[INFO] skip non existing resourceDirectory <https://hudson.apache.org/hudson/job/CXF-2.2.x-JDK15/ws/2.2.x-fixes/rt/bindings/coloc/target/generated/src/test/resources>
[INFO] Copying 3 resources
[INFO] [compiler:testCompile {execution: default-testCompile}]
[INFO] Compiling 3 source files to <https://hudson.apache.org/hudson/job/CXF-2.2.x-JDK15/ws/2.2.x-fixes/rt/bindings/coloc/target/test-classes>
[INFO] [surefire:test {execution: default-test}]
[INFO] Surefire report directory: <https://hudson.apache.org/hudson/job/CXF-2.2.x-JDK15/ws/2.2.x-fixes/rt/bindings/coloc/target/surefire-reports>

-------------------------------------------------------
 T E S T S
-------------------------------------------------------
Running org.apache.cxf.binding.coloc.ColocMessageObserverTest
Tests run: 2, Failures: 0, Errors: 0, Skipped: 0, Time elapsed: 0.533 sec
Running org.apache.cxf.binding.coloc.ColocUtilTest
Tests run: 6, Failures: 0, Errors: 0, Skipped: 0, Time elapsed: 0.015 sec
Running org.apache.cxf.binding.coloc.ColocOutInterceptorTest
Tests run: 8, Failures: 0, Errors: 0, Skipped: 0, Time elapsed: 0.122 sec

Results :

Tests run: 16, Failures: 0, Errors: 0, Skipped: 0

[HUDSON] Recording test results
[INFO] [jar:jar {execution: default-jar}]
[INFO] Building jar: <https://hudson.apache.org/hudson/job/CXF-2.2.x-JDK15/ws/2.2.x-fixes/rt/bindings/coloc/target/cxf-rt-bindings-coloc-2.2.12-SNAPSHOT.jar>
[INFO] [install:install {execution: default-install}]
[INFO] Installing <https://hudson.apache.org/hudson/job/CXF-2.2.x-JDK15/ws/2.2.x-fixes/rt/bindings/coloc/target/cxf-rt-bindings-coloc-2.2.12-SNAPSHOT.jar>
to <https://hudson.apache.org/hudson/job/CXF-2.2.x-JDK15/ws/.repository/org/apache/cxf/cxf-rt-bindings-coloc/2.2.12-SNAPSHOT/cxf-rt-bindings-coloc-2.2.12-SNAPSHOT.jar>
[HUDSON] Archiving <https://hudson.apache.org/hudson/job/CXF-2.2.x-JDK15/ws/2.2.x-fixes/rt/bindings/coloc/target/cxf-rt-bindings-coloc-2.2.12-SNAPSHOT.jar>
to /home/hudson/hudson/jobs/CXF-2.2.x-JDK15/modules/org.apache.cxf$cxf-rt-bindings-coloc/builds/2010-11-11_21-10-49/archive/org.apache.cxf/cxf-rt-bindings-coloc/2.2.12-SNAPSHOT/cxf-rt-bindings-coloc-2.2.12-SNAPSHOT.jar
[INFO] ------------------------------------------------------------------------
[INFO] Building Apache CXF Runtime JBI Binding
[INFO]    task-segment: [clean, install]
[INFO] ------------------------------------------------------------------------
[INFO] [clean:clean {execution: default-clean}]
[INFO] Deleting <https://hudson.apache.org/hudson/job/CXF-2.2.x-JDK15/ws/2.2.x-fixes/rt/bindings/jbi/target>
[INFO] [checkstyle:checkstyle {execution: validate}]
[INFO] Starting audit...
Audit done.

[INFO] Preparing pmd:check
[HUDSON] Archiving <https://hudson.apache.org/hudson/job/CXF-2.2.x-JDK15/ws/2.2.x-fixes/rt/bindings/jbi/pom.xml>
to /home/hudson/hudson/jobs/CXF-2.2.x-JDK15/modules/org.apache.cxf$cxf-rt-bindings-jbi/builds/2010-11-11_21-10-49/archive/org.apache.cxf/cxf-rt-bindings-jbi/2.2.12-SNAPSHOT/pom.xml
[INFO] [pmd:pmd {execution: pmd}]
[INFO] [pmd:check {execution: validate}]
[INFO] 
[INFO] [cxf-xml2fastinfoset:xml2fastinfoset {execution: xml2fastinfoset}]
[INFO] [cxf-common-xsd:xsdtojava {execution: generate-sources}]
[INFO] [remote-resources:process {execution: default}]
[INFO] [resources:resources {execution: default-resources}]
[INFO] Using 'UTF-8' encoding to copy filtered resources.
[INFO] Copying 1 resource
[INFO] Copying 9 resources
[INFO] skip non existing resourceDirectory <https://hudson.apache.org/hudson/job/CXF-2.2.x-JDK15/ws/2.2.x-fixes/rt/bindings/jbi/src/main/resources-filtered>
[INFO] Copying 1 resource
[INFO] Copying 3 resources
[INFO] [compiler:compile {execution: default-compile}]
[INFO] Compiling 17 source files to <https://hudson.apache.org/hudson/job/CXF-2.2.x-JDK15/ws/2.2.x-fixes/rt/bindings/jbi/target/classes>
[INFO] [bundle:manifest {execution: bundle-manifest}]
[INFO] [resources:testResources {execution: default-testResources}]
[INFO] Using 'UTF-8' encoding to copy filtered resources.
[INFO] Copying 1 resource
[INFO] skip non existing resourceDirectory <https://hudson.apache.org/hudson/job/CXF-2.2.x-JDK15/ws/2.2.x-fixes/rt/bindings/jbi/src/test/resources>
[INFO] skip non existing resourceDirectory <https://hudson.apache.org/hudson/job/CXF-2.2.x-JDK15/ws/2.2.x-fixes/rt/bindings/jbi/target/generated/src/test/resources>
[INFO] Copying 3 resources
[INFO] [compiler:testCompile {execution: default-testCompile}]
[INFO] Compiling 4 source files to <https://hudson.apache.org/hudson/job/CXF-2.2.x-JDK15/ws/2.2.x-fixes/rt/bindings/jbi/target/test-classes>
[INFO] [surefire:test {execution: default-test}]
[INFO] Surefire report directory: <https://hudson.apache.org/hudson/job/CXF-2.2.x-JDK15/ws/2.2.x-fixes/rt/bindings/jbi/target/surefire-reports>

-------------------------------------------------------
 T E S T S
-------------------------------------------------------
Running org.apache.cxf.binding.jbi.JBIBindingFactoryTest
Tests run: 1, Failures: 0, Errors: 0, Skipped: 0, Time elapsed: 0.144 sec
Running org.apache.cxf.binding.jbi.interceptor.JBIOperationInInterceptorTest
Tests run: 2, Failures: 0, Errors: 0, Skipped: 0, Time elapsed: 0.623 sec
Running org.apache.cxf.binding.jbi.interceptor.JBIFaultOutInterceptorTest
Tests run: 5, Failures: 0, Errors: 0, Skipped: 0, Time elapsed: 0.043 sec
Running org.apache.cxf.binding.jbi.spring.JBIBindingConfigurationInfoTest
Tests run: 1, Failures: 0, Errors: 0, Skipped: 0, Time elapsed: 0.108 sec

Results :

Tests run: 9, Failures: 0, Errors: 0, Skipped: 0

[HUDSON] Recording test results
[INFO] [jar:jar {execution: default-jar}]
[INFO] Building jar: <https://hudson.apache.org/hudson/job/CXF-2.2.x-JDK15/ws/2.2.x-fixes/rt/bindings/jbi/target/cxf-rt-bindings-jbi-2.2.12-SNAPSHOT.jar>
[INFO] [install:install {execution: default-install}]
[INFO] Installing <https://hudson.apache.org/hudson/job/CXF-2.2.x-JDK15/ws/2.2.x-fixes/rt/bindings/jbi/target/cxf-rt-bindings-jbi-2.2.12-SNAPSHOT.jar>
to <https://hudson.apache.org/hudson/job/CXF-2.2.x-JDK15/ws/.repository/org/apache/cxf/cxf-rt-bindings-jbi/2.2.12-SNAPSHOT/cxf-rt-bindings-jbi-2.2.12-SNAPSHOT.jar>
[HUDSON] Archiving <https://hudson.apache.org/hudson/job/CXF-2.2.x-JDK15/ws/2.2.x-fixes/rt/bindings/jbi/target/cxf-rt-bindings-jbi-2.2.12-SNAPSHOT.jar>
to /home/hudson/hudson/jobs/CXF-2.2.x-JDK15/modules/org.apache.cxf$cxf-rt-bindings-jbi/builds/2010-11-11_21-10-49/archive/org.apache.cxf/cxf-rt-bindings-jbi/2.2.12-SNAPSHOT/cxf-rt-bindings-jbi-2.2.12-SNAPSHOT.jar
[INFO] ------------------------------------------------------------------------
[INFO] Building Apache CXF Runtime
[INFO]    task-segment: [clean, install]
[INFO] ------------------------------------------------------------------------
[INFO] [clean:clean {execution: default-clean}]
[INFO] [site:attach-descriptor {execution: default-attach-descriptor}]
[INFO] [install:install {execution: default-install}]
[INFO] Installing <https://hudson.apache.org/hudson/job/CXF-2.2.x-JDK15/ws/2.2.x-fixes/rt/pom.xml>
to <https://hudson.apache.org/hudson/job/CXF-2.2.x-JDK15/ws/.repository/org/apache/cxf/cxf-rt/2.2.12-SNAPSHOT/cxf-rt-2.2.12-SNAPSHOT.pom>
[HUDSON] Archiving <https://hudson.apache.org/hudson/job/CXF-2.2.x-JDK15/ws/2.2.x-fixes/rt/pom.xml>
to /home/hudson/hudson/jobs/CXF-2.2.x-JDK15/modules/org.apache.cxf$cxf-rt/builds/2010-11-11_21-10-49/archive/org.apache.cxf/cxf-rt/2.2.12-SNAPSHOT/pom.xml
[HUDSON] Archiving <https://hudson.apache.org/hudson/job/CXF-2.2.x-JDK15/ws/.repository/org/apache/cxf/cxf-rt/2.2.12-SNAPSHOT/cxf-rt-2.2.12-SNAPSHOT.pom>
to /home/hudson/hudson/jobs/CXF-2.2.x-JDK15/modules/org.apache.cxf$cxf-rt/builds/2010-11-11_21-10-49/archive/org.apache.cxf/cxf-rt/2.2.12-SNAPSHOT/cxf-rt-2.2.12-SNAPSHOT.pom
[INFO] ------------------------------------------------------------------------
[INFO] Building Apache CXF Runtime Bindings
[INFO]    task-segment: [clean, install]
[INFO] ------------------------------------------------------------------------
[INFO] [clean:clean {execution: default-clean}]
[INFO] [site:attach-descriptor {execution: default-attach-descriptor}]
[INFO] [install:install {execution: default-install}]
[INFO] Installing <https://hudson.apache.org/hudson/job/CXF-2.2.x-JDK15/ws/2.2.x-fixes/rt/bindings/pom.xml>
to <https://hudson.apache.org/hudson/job/CXF-2.2.x-JDK15/ws/.repository/org/apache/cxf/cxf-rt-bindings/2.2.12-SNAPSHOT/cxf-rt-bindings-2.2.12-SNAPSHOT.pom>
[HUDSON] Archiving <https://hudson.apache.org/hudson/job/CXF-2.2.x-JDK15/ws/2.2.x-fixes/rt/bindings/pom.xml>
to /home/hudson/hudson/jobs/CXF-2.2.x-JDK15/modules/org.apache.cxf$cxf-rt-bindings/builds/2010-11-11_21-10-49/archive/org.apache.cxf/cxf-rt-bindings/2.2.12-SNAPSHOT/pom.xml
[HUDSON] Archiving <https://hudson.apache.org/hudson/job/CXF-2.2.x-JDK15/ws/.repository/org/apache/cxf/cxf-rt-bindings/2.2.12-SNAPSHOT/cxf-rt-bindings-2.2.12-SNAPSHOT.pom>
to /home/hudson/hudson/jobs/CXF-2.2.x-JDK15/modules/org.apache.cxf$cxf-rt-bindings/builds/2010-11-11_21-10-49/archive/org.apache.cxf/cxf-rt-bindings/2.2.12-SNAPSHOT/cxf-rt-bindings-2.2.12-SNAPSHOT.pom
[INFO] ------------------------------------------------------------------------
[INFO] Building Apache CXF Runtime JAX-RS Frontend
[INFO]    task-segment: [clean, install]
[INFO] ------------------------------------------------------------------------
[INFO] [clean:clean {execution: default-clean}]
[INFO] Deleting <https://hudson.apache.org/hudson/job/CXF-2.2.x-JDK15/ws/2.2.x-fixes/rt/frontend/jaxrs/target>
[INFO] [checkstyle:checkstyle {execution: validate}]
[INFO] Starting audit...
Audit done.

[INFO] Preparing pmd:check
[HUDSON] Archiving <https://hudson.apache.org/hudson/job/CXF-2.2.x-JDK15/ws/2.2.x-fixes/rt/frontend/jaxrs/pom.xml>
to /home/hudson/hudson/jobs/CXF-2.2.x-JDK15/modules/org.apache.cxf$cxf-rt-frontend-jaxrs/builds/2010-11-11_21-10-49/archive/org.apache.cxf/cxf-rt-frontend-jaxrs/2.2.12-SNAPSHOT/pom.xml
[INFO] [pmd:pmd {execution: pmd}]
[INFO] [pmd:check {execution: validate}]
[INFO] 
[INFO] [cxf-xml2fastinfoset:xml2fastinfoset {execution: xml2fastinfoset}]
[INFO] [remote-resources:process {execution: default}]
[INFO] [resources:resources {execution: default-resources}]
[INFO] Using 'UTF-8' encoding to copy filtered resources.
[INFO] Copying 7 resources
[INFO] Copying 7 resources
[INFO] skip non existing resourceDirectory <https://hudson.apache.org/hudson/job/CXF-2.2.x-JDK15/ws/2.2.x-fixes/rt/frontend/jaxrs/src/main/resources-filtered>
[INFO] Copying 1 resource
[INFO] Copying 3 resources
[INFO] [compiler:compile {execution: default-compile}]
[INFO] Compiling 145 source files to <https://hudson.apache.org/hudson/job/CXF-2.2.x-JDK15/ws/2.2.x-fixes/rt/frontend/jaxrs/target/classes>
[INFO] -------------------------------------------------------------
[WARNING] COMPILATION WARNING : 
[INFO] -------------------------------------------------------------
[WARNING] <https://hudson.apache.org/hudson/job/CXF-2.2.x-JDK15/ws/2.2.x-fixes/rt/frontend/jaxrs/src/main/java/org/apache/cxf/jaxrs/impl/tl/ThreadLocalHttpServletRequest.java>:[128,19]
[deprecation] isRequestedSessionIdFromUrl() in javax.servlet.http.HttpServletRequest has been
deprecated
[WARNING] <https://hudson.apache.org/hudson/job/CXF-2.2.x-JDK15/ws/2.2.x-fixes/rt/frontend/jaxrs/src/main/java/org/apache/cxf/jaxrs/impl/tl/ThreadLocalHttpServletRequest.java>:[209,18]
[deprecation] getRealPath(java.lang.String) in javax.servlet.ServletRequest has been deprecated
[WARNING] <https://hudson.apache.org/hudson/job/CXF-2.2.x-JDK15/ws/2.2.x-fixes/rt/frontend/jaxrs/src/main/java/org/apache/cxf/jaxrs/impl/HttpServletResponseFilter.java>:[29,7]
[deprecation] setStatus(int,java.lang.String) in javax.servlet.http.HttpServletResponse has
been deprecated
[WARNING] <https://hudson.apache.org/hudson/job/CXF-2.2.x-JDK15/ws/2.2.x-fixes/rt/frontend/jaxrs/src/main/java/org/apache/cxf/jaxrs/impl/HttpServletResponseFilter.java>:[29,7]
[deprecation] encodeRedirectUrl(java.lang.String) in javax.servlet.http.HttpServletResponse
has been deprecated
[WARNING] <https://hudson.apache.org/hudson/job/CXF-2.2.x-JDK15/ws/2.2.x-fixes/rt/frontend/jaxrs/src/main/java/org/apache/cxf/jaxrs/impl/HttpServletResponseFilter.java>:[29,7]
[deprecation] encodeUrl(java.lang.String) in javax.servlet.http.HttpServletResponse has been
deprecated
[WARNING] <https://hudson.apache.org/hudson/job/CXF-2.2.x-JDK15/ws/2.2.x-fixes/rt/frontend/jaxrs/src/main/java/org/apache/cxf/jaxrs/impl/tl/ThreadLocalServletContext.java>:[124,16]
[deprecation] log(java.lang.Exception,java.lang.String) in javax.servlet.ServletContext has
been deprecated
[WARNING] <https://hudson.apache.org/hudson/job/CXF-2.2.x-JDK15/ws/2.2.x-fixes/rt/frontend/jaxrs/src/main/java/org/apache/cxf/jaxrs/impl/tl/ThreadLocalServletContext.java>:[110,23]
[deprecation] getServletNames() in javax.servlet.ServletContext has been deprecated
[WARNING] <https://hudson.apache.org/hudson/job/CXF-2.2.x-JDK15/ws/2.2.x-fixes/rt/frontend/jaxrs/src/main/java/org/apache/cxf/jaxrs/impl/tl/ThreadLocalServletContext.java>:[115,23]
[deprecation] getServlets() in javax.servlet.ServletContext has been deprecated
[WARNING] <https://hudson.apache.org/hudson/job/CXF-2.2.x-JDK15/ws/2.2.x-fixes/rt/frontend/jaxrs/src/main/java/org/apache/cxf/jaxrs/impl/tl/ThreadLocalServletContext.java>:[101,19]
[deprecation] getServlet(java.lang.String) in javax.servlet.ServletContext has been deprecated
[WARNING] <https://hudson.apache.org/hudson/job/CXF-2.2.x-JDK15/ws/2.2.x-fixes/rt/frontend/jaxrs/src/main/java/org/apache/cxf/jaxrs/impl/tl/ThreadLocalHttpServletResponse.java>:[105,16]
[deprecation] setStatus(int,java.lang.String) in javax.servlet.http.HttpServletResponse has
been deprecated
[WARNING] <https://hudson.apache.org/hudson/job/CXF-2.2.x-JDK15/ws/2.2.x-fixes/rt/frontend/jaxrs/src/main/java/org/apache/cxf/jaxrs/impl/tl/ThreadLocalHttpServletResponse.java>:[61,18]
[deprecation] encodeRedirectUrl(java.lang.String) in javax.servlet.http.HttpServletResponse
has been deprecated
[WARNING] <https://hudson.apache.org/hudson/job/CXF-2.2.x-JDK15/ws/2.2.x-fixes/rt/frontend/jaxrs/src/main/java/org/apache/cxf/jaxrs/impl/tl/ThreadLocalHttpServletResponse.java>:[70,18]
[deprecation] encodeUrl(java.lang.String) in javax.servlet.http.HttpServletResponse has been
deprecated
[WARNING] <https://hudson.apache.org/hudson/job/CXF-2.2.x-JDK15/ws/2.2.x-fixes/rt/frontend/jaxrs/src/main/java/org/apache/cxf/jaxrs/provider/RequestDispatcherProvider.java>:[203,21]
[deprecation] getRealPath(java.lang.String) in javax.servlet.ServletRequest has been deprecated
[WARNING] <https://hudson.apache.org/hudson/job/CXF-2.2.x-JDK15/ws/2.2.x-fixes/rt/frontend/jaxrs/src/main/java/org/apache/cxf/jaxrs/provider/RequestDispatcherProvider.java>:[203,21]
[deprecation] isRequestedSessionIdFromUrl() in javax.servlet.http.HttpServletRequest has been
deprecated
[WARNING] <https://hudson.apache.org/hudson/job/CXF-2.2.x-JDK15/ws/2.2.x-fixes/rt/frontend/jaxrs/src/main/java/org/apache/cxf/jaxrs/provider/RequestDispatcherProvider.java>:[203,21]
[deprecation] getRealPath(java.lang.String) in javax.servlet.ServletRequest has been deprecated
[INFO] 15 warnings 
[INFO] -------------------------------------------------------------
[INFO] -------------------------------------------------------------
[ERROR] COMPILATION ERROR : 
[INFO] -------------------------------------------------------------
[ERROR] <https://hudson.apache.org/hudson/job/CXF-2.2.x-JDK15/ws/2.2.x-fixes/rt/frontend/jaxrs/src/main/java/org/apache/cxf/jaxrs/utils/InjectionUtils.java>:[728,19]
cannot find symbol
symbol  : class SearchContext
location: class org.apache.cxf.jaxrs.utils.InjectionUtils
[ERROR] <https://hudson.apache.org/hudson/job/CXF-2.2.x-JDK15/ws/2.2.x-fixes/rt/frontend/jaxrs/src/main/java/org/apache/cxf/jaxrs/utils/InjectionUtils.java>:[729,24]
cannot find symbol
symbol  : class ThreadLocalSearchContext
location: class org.apache.cxf.jaxrs.utils.InjectionUtils
[INFO] 2 errors 
[INFO] -------------------------------------------------------------
[INFO] ------------------------------------------------------------------------
[ERROR] BUILD FAILURE
[INFO] ------------------------------------------------------------------------
[INFO] Compilation failure

<https://hudson.apache.org/hudson/job/CXF-2.2.x-JDK15/ws/2.2.x-fixes/rt/frontend/jaxrs/src/main/java/org/apache/cxf/jaxrs/utils/InjectionUtils.java>:[728,19]
cannot find symbol
symbol  : class SearchContext
location: class org.apache.cxf.jaxrs.utils.InjectionUtils
<https://hudson.apache.org/hudson/job/CXF-2.2.x-JDK15/ws/2.2.x-fixes/rt/frontend/jaxrs/src/main/java/org/apache/cxf/jaxrs/utils/InjectionUtils.java>:[729,24]
cannot find symbol
symbol  : class ThreadLocalSearchContext
location: class org.apache.cxf.jaxrs.utils.InjectionUtils

[INFO] ------------------------------------------------------------------------
[INFO] Trace
org.apache.maven.BuildFailureException: Compilation failure
	at org.apache.maven.lifecycle.DefaultLifecycleExecutor.executeGoals(DefaultLifecycleExecutor.java:715)
	at org.apache.maven.lifecycle.DefaultLifecycleExecutor.executeGoalWithLifecycle(DefaultLifecycleExecutor.java:556)
	at org.apache.maven.lifecycle.DefaultLifecycleExecutor.executeGoal(DefaultLifecycleExecutor.java:535)
	at org.apache.maven.lifecycle.DefaultLifecycleExecutor.executeGoalAndHandleFailures(DefaultLifecycleExecutor.java:387)
	at org.apache.maven.lifecycle.DefaultLifecycleExecutor.executeTaskSegments(DefaultLifecycleExecutor.java:348)
	at org.apache.maven.lifecycle.DefaultLifecycleExecutor.execute(DefaultLifecycleExecutor.java:180)
	at org.apache.maven.lifecycle.LifecycleExecutorInterceptor.execute(LifecycleExecutorInterceptor.java:65)
	at org.apache.maven.DefaultMaven.doExecute(DefaultMaven.java:328)
	at org.apache.maven.DefaultMaven.execute(DefaultMaven.java:138)
	at org.apache.maven.cli.MavenCli.main(MavenCli.java:362)
	at sun.reflect.NativeMethodAccessorImpl.invoke0(Native Method)
	at sun.reflect.NativeMethodAccessorImpl.invoke(NativeMethodAccessorImpl.java:39)
	at sun.reflect.DelegatingMethodAccessorImpl.invoke(DelegatingMethodAccessorImpl.java:25)
	at java.lang.reflect.Method.invoke(Method.java:592)
	at org.codehaus.classworlds.Launcher.launchEnhanced(Launcher.java:315)
	at org.codehaus.classworlds.Launcher.launch(Launcher.java:255)
	at hudson.maven.agent.Main.launch(Main.java:165)
	at hudson.maven.MavenBuilder.call(MavenBuilder.java:165)
	at hudson.maven.MavenModuleSetBuild$Builder.call(MavenModuleSetBuild.java:750)
	at hudson.maven.MavenModuleSetBuild$Builder.call(MavenModuleSetBuild.java:694)
	at hudson.remoting.UserRequest.perform(UserRequest.java:114)
	at hudson.remoting.UserRequest.perform(UserRequest.java:48)
	at hudson.remoting.Request$2.run(Request.java:270)
	at java.util.concurrent.Executors$RunnableAdapter.call(Executors.java:417)
	at java.util.concurrent.FutureTask$Sync.innerRun(FutureTask.java:269)
	at java.util.concurrent.FutureTask.run(FutureTask.java:123)
	at java.util.concurrent.ThreadPoolExecutor$Worker.runTask(ThreadPoolExecutor.java:651)
	at java.util.concurrent.ThreadPoolExecutor$Worker.run(ThreadPoolExecutor.java:676)
	at java.lang.Thread.run(Thread.java:595)
Caused by: org.apache.maven.plugin.CompilationFailureException: Compilation failure
	at org.apache.maven.plugin.AbstractCompilerMojo.execute(AbstractCompilerMojo.java:656)
	at org.apache.maven.plugin.CompilerMojo.execute(CompilerMojo.java:128)
	at org.apache.maven.plugin.DefaultPluginManager.executeMojo(DefaultPluginManager.java:490)
	at hudson.maven.agent.PluginManagerInterceptor.executeMojo(PluginManagerInterceptor.java:182)
	at org.apache.maven.lifecycle.DefaultLifecycleExecutor.executeGoals(DefaultLifecycleExecutor.java:694)
	... 28 more
[INFO] ------------------------------------------------------------------------
[INFO] Total time: 18 minutes 42 seconds
[INFO] Finished at: Thu Nov 11 21:29:40 UTC 2010
[INFO] Final Memory: 121M/196M
[INFO] ------------------------------------------------------------------------
Waiting for Hudson to finish collecting data
Sending e-mails to: notifications@cxf.apache.org sberyozkin@gmail.com
channel stopped


Mime
View raw message