cxf-notifications mailing list archives

Site index · List index
Message view « Date » · « Thread »
Top « Date » · « Thread »
From Apache Hudson Server <hud...@hudson.apache.org>
Subject Build failed in Hudson: cxf-wss4j-1.6-port #2
Date Mon, 08 Nov 2010 18:17:35 GMT
See <https://hudson.apache.org/hudson/job/cxf-wss4j-1.6-port/2/>

------------------------------------------
[...truncated 10854 lines...]
There are no tests to run.

Results :

Tests run: 0, Failures: 0, Errors: 0, Skipped: 0

[HUDSON] Recording test results
[INFO] ------------------------------------------------------------------------
[INFO] Building Apache CXF Code Generation Maven2 Plugins
[INFO]    task-segment: [clean, test]
[INFO] ------------------------------------------------------------------------
[INFO] [clean:clean {execution: default-clean}]
Downloading: http://repo1.maven.org/maven2/org/apache/maven/wagon/wagon-file/1.0-alpha-7/wagon-file-1.0-alpha-7.jar
Downloading: http://repo1.maven.org/maven2/org/apache/maven/maven-core/2.0.4/maven-core-2.0.4.jar
Downloading: http://repo1.maven.org/maven2/org/apache/maven/reporting/maven-reporting-api/2.0.4/maven-reporting-api-2.0.4.jar
Downloading: http://repo1.maven.org/maven2/com/jcraft/jsch/0.1.24/jsch-0.1.24.jar




Downloading: http://repo1.maven.org/maven2/org/apache/maven/maven-plugin-parameter-documenter/2.0.4/maven-plugin-parameter-documenter-2.0.4.jar
Downloading: http://repo1.maven.org/maven2/org/apache/maven/wagon/wagon-http-lightweight/1.0-alpha-6/wagon-http-lightweight-1.0-alpha-6.jar


Downloading: http://repo1.maven.org/maven2/org/apache/maven/wagon/wagon-ssh/1.0-alpha-7/wagon-ssh-1.0-alpha-7.jar
Downloading: http://repo1.maven.org/maven2/org/apache/maven/maven-error-diagnostics/2.0.4/maven-error-diagnostics-2.0.4.jar


Downloading: http://repo1.maven.org/maven2/org/apache/maven/maven-plugin-registry/2.0.4/maven-plugin-registry-2.0.4.jar

Downloading: http://repo1.maven.org/maven2/org/apache/maven/maven-monitor/2.0.4/maven-monitor-2.0.4.jar

[INFO] [checkstyle:checkstyle {execution: validate}]
[INFO] Starting audit...
Audit done.

[INFO] Preparing pmd:check
[HUDSON] Archiving <https://hudson.apache.org/hudson/job/cxf-wss4j-1.6-port/ws/maven-plugins/codegen-plugin/pom.xml>
to /home/hudson/hudson/jobs/cxf-wss4j-1.6-port/modules/org.apache.cxf$cxf-codegen-plugin/builds/2010-11-08_18-12-34/archive/org.apache.cxf/cxf-codegen-plugin/2.4.0-SNAPSHOT/pom.xml
[INFO] [pmd:pmd {execution: pmd}]
[INFO] [pmd:check {execution: validate}]
[INFO] 
[INFO] [cxf-xml2fastinfoset:xml2fastinfoset {execution: xml2fastinfoset}]
[INFO] [plugin:descriptor {execution: default-descriptor}]
[WARNING] Using platform encoding (UTF-8 actually) to read mojo metadata, i.e. build is platform
dependent!
[INFO] Applying mojo extractor for language: java
[INFO] Mojo extractor for language: java found 1 mojo descriptors.
[INFO] Applying mojo extractor for language: bsh
[INFO] Mojo extractor for language: bsh found 0 mojo descriptors.
[INFO] [remote-resources:process {execution: default}]
[INFO] [resources:resources {execution: default-resources}]
[INFO] Using 'UTF-8' encoding to copy filtered resources.
[INFO] Copying 0 resource
[INFO] skip non existing resourceDirectory <https://hudson.apache.org/hudson/job/cxf-wss4j-1.6-port/ws/maven-plugins/codegen-plugin/src/main/resources>
[INFO] skip non existing resourceDirectory <https://hudson.apache.org/hudson/job/cxf-wss4j-1.6-port/ws/maven-plugins/codegen-plugin/src/main/resources-filtered>
[INFO] skip non existing resourceDirectory <https://hudson.apache.org/hudson/job/cxf-wss4j-1.6-port/ws/maven-plugins/codegen-plugin/target/generated/src/main/resources>
[INFO] Copying 3 resources
[INFO] [compiler:compile {execution: default-compile}]
[INFO] Compiling 6 source files to <https://hudson.apache.org/hudson/job/cxf-wss4j-1.6-port/ws/maven-plugins/codegen-plugin/target/classes>
[INFO] [resources:testResources {execution: default-testResources}]
[INFO] Using 'UTF-8' encoding to copy filtered resources.
[INFO] Copying 0 resource
[INFO] Copying 0 resource
[INFO] skip non existing resourceDirectory <https://hudson.apache.org/hudson/job/cxf-wss4j-1.6-port/ws/maven-plugins/codegen-plugin/target/generated/src/test/resources>
[INFO] Copying 3 resources
[INFO] [compiler:testCompile {execution: default-testCompile}]
[INFO] Nothing to compile - all classes are up to date
[INFO] [surefire:test {execution: default-test}]
[INFO] Surefire report directory: <https://hudson.apache.org/hudson/job/cxf-wss4j-1.6-port/ws/maven-plugins/codegen-plugin/target/surefire-reports>

-------------------------------------------------------
 T E S T S
-------------------------------------------------------
There are no tests to run.

Results :

Tests run: 0, Failures: 0, Errors: 0, Skipped: 0

[HUDSON] Recording test results
[INFO] ------------------------------------------------------------------------
[INFO] Building Apache CXF Test Utilities
[INFO]    task-segment: [clean, test]
[INFO] ------------------------------------------------------------------------
[INFO] [clean:clean {execution: default-clean}]
Downloading: http://repo1.maven.org/maven2/org/apache/activemq/activemq-core/5.4.1/activemq-core-5.4.1.pom

Downloading: http://repo1.maven.org/maven2/org/apache/activemq/activemq-parent/5.4.1/activemq-parent-5.4.1.pom

Downloading: http://repository.springsource.com/maven/bundles/external/org/apache/activemq/kahadb/5.4.1/kahadb-5.4.1.pom
[INFO] Unable to find resource 'org.apache.activemq:kahadb:pom:5.4.1' in repository com.springsource.repository.bundles.external
(http://repository.springsource.com/maven/bundles/external)
Downloading: http://repo1.maven.org/maven2/org/apache/activemq/kahadb/5.4.1/kahadb-5.4.1.pom

Downloading: http://repository.springsource.com/maven/bundles/external/org/apache/activemq/protobuf/activemq-protobuf/1.1/activemq-protobuf-1.1.pom
[INFO] Unable to find resource 'org.apache.activemq.protobuf:activemq-protobuf:pom:1.1' in
repository com.springsource.repository.bundles.external (http://repository.springsource.com/maven/bundles/external)
Downloading: http://repo1.maven.org/maven2/org/apache/activemq/protobuf/activemq-protobuf/1.1/activemq-protobuf-1.1.pom

Downloading: http://repository.springsource.com/maven/bundles/external/org/apache/activemq/protobuf/activemq-protobuf-pom/1.1/activemq-protobuf-pom-1.1.pom
[INFO] Unable to find resource 'org.apache.activemq.protobuf:activemq-protobuf-pom:pom:1.1'
in repository com.springsource.repository.bundles.external (http://repository.springsource.com/maven/bundles/external)
Downloading: http://repo1.maven.org/maven2/org/apache/activemq/protobuf/activemq-protobuf-pom/1.1/activemq-protobuf-pom-1.1.pom

Downloading: http://repository.springsource.com/maven/bundles/external/org/jasypt/jasypt/1.6/jasypt-1.6.pom
[INFO] Unable to find resource 'org.jasypt:jasypt:pom:1.6' in repository com.springsource.repository.bundles.external
(http://repository.springsource.com/maven/bundles/external)
Downloading: http://repo1.maven.org/maven2/org/jasypt/jasypt/1.6/jasypt-1.6.pom

Downloading: http://repository.springsource.com/maven/bundles/external/com/ibm/icu/icu4j/4.0.1/icu4j-4.0.1.pom
[INFO] Unable to find resource 'com.ibm.icu:icu4j:pom:4.0.1' in repository com.springsource.repository.bundles.external
(http://repository.springsource.com/maven/bundles/external)
Downloading: http://repo1.maven.org/maven2/com/ibm/icu/icu4j/4.0.1/icu4j-4.0.1.pom

Downloading: http://repository.springsource.com/maven/bundles/external/org/jasypt/jasypt/1.6/jasypt-1.6.jar
Downloading: http://repo1.maven.org/maven2/org/apache/activemq/activemq-core/5.4.1/activemq-core-5.4.1.jar
Downloading: http://repository.springsource.com/maven/bundles/external/org/apache/activemq/protobuf/activemq-protobuf/1.1/activemq-protobuf-1.1.jar
Downloading: http://repository.springsource.com/maven/bundles/external/com/ibm/icu/icu4j/4.0.1/icu4j-4.0.1.jar
[INFO] Unable to find resource 'org.jasypt:jasypt:jar:1.6' in repository com.springsource.repository.bundles.external
(http://repository.springsource.com/maven/bundles/external)
Downloading: http://repo1.maven.org/maven2/org/jasypt/jasypt/1.6/jasypt-1.6.jar
[INFO] Unable to find resource 'org.apache.activemq.protobuf:activemq-protobuf:jar:1.1' in
repository com.springsource.repository.bundles.external (http://repository.springsource.com/maven/bundles/external)
Downloading: http://repo1.maven.org/maven2/org/apache/activemq/protobuf/activemq-protobuf/1.1/activemq-protobuf-1.1.jar
[INFO] Unable to find resource 'com.ibm.icu:icu4j:jar:4.0.1' in repository com.springsource.repository.bundles.external
(http://repository.springsource.com/maven/bundles/external)
Downloading: http://repo1.maven.org/maven2/com/ibm/icu/icu4j/4.0.1/icu4j-4.0.1.jar



Downloading: http://repository.springsource.com/maven/bundles/external/org/apache/activemq/kahadb/5.4.1/kahadb-5.4.1.jar
[INFO] Unable to find resource 'org.apache.activemq:kahadb:jar:5.4.1' in repository com.springsource.repository.bundles.external
(http://repository.springsource.com/maven/bundles/external)
Downloading: http://repo1.maven.org/maven2/org/apache/activemq/kahadb/5.4.1/kahadb-5.4.1.jar


[INFO] [checkstyle:checkstyle {execution: validate}]
[INFO] Starting audit...
Audit done.

[INFO] Preparing pmd:check
[HUDSON] Archiving <https://hudson.apache.org/hudson/job/cxf-wss4j-1.6-port/ws/testutils/pom.xml>
to /home/hudson/hudson/jobs/cxf-wss4j-1.6-port/modules/org.apache.cxf$cxf-testutils/builds/2010-11-08_18-12-34/archive/org.apache.cxf/cxf-testutils/2.4.0-SNAPSHOT/pom.xml
[INFO] [pmd:pmd {execution: pmd}]
[INFO] [pmd:check {execution: validate}]
[INFO] 
Downloading: http://repo1.maven.org/maven2/org/apache/ant/ant-trax/1.8.0/ant-trax-1.8.0.pom

Downloading: http://repo1.maven.org/maven2/org/apache/ant/ant-parent/1.8.0/ant-parent-1.8.0.pom

Downloading: http://repo1.maven.org/maven2/org/apache/ant/ant-apache-xalan2/1.8.0/ant-apache-xalan2-1.8.0.pom

Downloading: http://repo1.maven.org/maven2/org/apache/ant/ant/1.8.0/ant-1.8.0.pom

Downloading: http://repo1.maven.org/maven2/org/apache/ant/ant-launcher/1.8.0/ant-launcher-1.8.0.pom

Downloading: http://repo1.maven.org/maven2/org/apache/ant/ant-nodeps/1.8.0/ant-nodeps-1.8.0.pom

Downloading: http://repo1.maven.org/maven2/org/apache/ant/ant-trax/1.8.0/ant-trax-1.8.0.jar

Downloading: http://repo1.maven.org/maven2/org/apache/ant/ant-apache-xalan2/1.8.0/ant-apache-xalan2-1.8.0.jar

[WARNING] DEPRECATED [sourceRoot]: Use the build-helper-maven-plugin to bind source directories
[INFO] [antrun:run {execution: validate}]
project.artifactId
[INFO] Executing tasks
    [mkdir] Created dir: <https://hudson.apache.org/hudson/job/cxf-wss4j-1.6-port/ws/testutils/target/generated/src/main/resources/wsdl/type_test>
     [xslt] Processing <https://hudson.apache.org/hudson/job/cxf-wss4j-1.6-port/ws/testutils/src/main/resources/wsdl/type_test/type_test.xsd>
to <https://hudson.apache.org/hudson/job/cxf-wss4j-1.6-port/ws/testutils/target/generated/src/main/resources/wsdl/type_test/type_test_1.xsd>
     [xslt] Loading stylesheet <https://hudson.apache.org/hudson/job/cxf-wss4j-1.6-port/ws/testutils/src/main/resources/wsdl/type_test/type_test_ID_xsd.xsl>
     [xslt] Processing <https://hudson.apache.org/hudson/job/cxf-wss4j-1.6-port/ws/testutils/src/main/resources/wsdl/type_test/type_test.xsd>
to <https://hudson.apache.org/hudson/job/cxf-wss4j-1.6-port/ws/testutils/target/generated/src/main/resources/wsdl/type_test/type_test_2.xsd>
     [xslt] Loading stylesheet <https://hudson.apache.org/hudson/job/cxf-wss4j-1.6-port/ws/testutils/src/main/resources/wsdl/type_test/type_test_ID_xsd.xsl>
     [xslt] Processing <https://hudson.apache.org/hudson/job/cxf-wss4j-1.6-port/ws/testutils/src/main/resources/wsdl/type_test/type_test.xsd>
to <https://hudson.apache.org/hudson/job/cxf-wss4j-1.6-port/ws/testutils/target/generated/src/main/resources/wsdl/type_test/type_test_3.xsd>
     [xslt] Loading stylesheet <https://hudson.apache.org/hudson/job/cxf-wss4j-1.6-port/ws/testutils/src/main/resources/wsdl/type_test/type_test_ID_xsd.xsl>
     [xslt] Processing <https://hudson.apache.org/hudson/job/cxf-wss4j-1.6-port/ws/testutils/src/main/resources/wsdl/type_test/type_test.xsd>
to <https://hudson.apache.org/hudson/job/cxf-wss4j-1.6-port/ws/testutils/target/generated/src/main/resources/wsdl/type_test/type_test_doclit.wsdl>
     [xslt] Loading stylesheet <https://hudson.apache.org/hudson/job/cxf-wss4j-1.6-port/ws/testutils/src/main/resources/wsdl/type_test/type_test_wsdl.xsl>
     [xslt] Processing <https://hudson.apache.org/hudson/job/cxf-wss4j-1.6-port/ws/testutils/src/main/resources/wsdl/type_test/type_test.xsd>
to <https://hudson.apache.org/hudson/job/cxf-wss4j-1.6-port/ws/testutils/target/generated/src/main/resources/wsdl/type_test/type_test_rpclit.wsdl>
     [xslt] Loading stylesheet <https://hudson.apache.org/hudson/job/cxf-wss4j-1.6-port/ws/testutils/src/main/resources/wsdl/type_test/type_test_wsdl.xsl>
     [xslt] Processing <https://hudson.apache.org/hudson/job/cxf-wss4j-1.6-port/ws/testutils/src/main/resources/wsdl/type_test/type_test.xsd>
to <https://hudson.apache.org/hudson/job/cxf-wss4j-1.6-port/ws/testutils/target/generated/src/main/resources/wsdl/type_test/type_test_xml_inc.wsdl>
     [xslt] Loading stylesheet <https://hudson.apache.org/hudson/job/cxf-wss4j-1.6-port/ws/testutils/src/main/resources/wsdl/type_test/type_test_wsdl.xsl>
     [xslt] Processing <https://hudson.apache.org/hudson/job/cxf-wss4j-1.6-port/ws/testutils/src/main/resources/wsdl/type_test/type_test.xsd>
to <https://hudson.apache.org/hudson/job/cxf-wss4j-1.6-port/ws/testutils/target/generated/src/main/resources/wsdl/type_test/type_test_xml.wsdl>
     [xslt] Loading stylesheet <https://hudson.apache.org/hudson/job/cxf-wss4j-1.6-port/ws/testutils/src/main/resources/wsdl/type_test/type_test_xml_wsdl.xsl>
     [xslt] Processing <https://hudson.apache.org/hudson/job/cxf-wss4j-1.6-port/ws/testutils/src/main/resources/wsdl/type_test/type_test.xsd>
to <https://hudson.apache.org/hudson/job/cxf-wss4j-1.6-port/ws/testutils/target/generated/src/main/resources/wsdl/type_test/type_test_doclit_soap.wsdl>
     [xslt] Loading stylesheet <https://hudson.apache.org/hudson/job/cxf-wss4j-1.6-port/ws/testutils/src/main/resources/wsdl/type_test/type_test_soap_wsdl.xsl>
     [xslt] Processing <https://hudson.apache.org/hudson/job/cxf-wss4j-1.6-port/ws/testutils/src/main/resources/wsdl/type_test/type_test.xsd>
to <https://hudson.apache.org/hudson/job/cxf-wss4j-1.6-port/ws/testutils/target/generated/src/main/resources/wsdl/type_test/type_test_rpclit_soap.wsdl>
     [xslt] Loading stylesheet <https://hudson.apache.org/hudson/job/cxf-wss4j-1.6-port/ws/testutils/src/main/resources/wsdl/type_test/type_test_soap_wsdl.xsl>
    [mkdir] Created dir: <https://hudson.apache.org/hudson/job/cxf-wss4j-1.6-port/ws/testutils/target/generated/src/main/java/org/apache/cxf/systest/type_test>
     [xslt] Processing <https://hudson.apache.org/hudson/job/cxf-wss4j-1.6-port/ws/testutils/src/main/resources/wsdl/type_test/type_test.xsd>
to <https://hudson.apache.org/hudson/job/cxf-wss4j-1.6-port/ws/testutils/target/generated/src/main/java/org/apache/cxf/systest/type_test/TypeTestImpl.java>
     [xslt] Loading stylesheet <https://hudson.apache.org/hudson/job/cxf-wss4j-1.6-port/ws/testutils/src/main/resources/wsdl/type_test/type_test_impl_java.xsl>
     [xslt] Processing <https://hudson.apache.org/hudson/job/cxf-wss4j-1.6-port/ws/testutils/src/main/resources/wsdl/type_test/type_test.xsd>
to <https://hudson.apache.org/hudson/job/cxf-wss4j-1.6-port/ws/testutils/target/generated/src/main/java/org/apache/cxf/systest/type_test/TypeTestTester.java>
     [xslt] Loading stylesheet <https://hudson.apache.org/hudson/job/cxf-wss4j-1.6-port/ws/testutils/src/main/resources/wsdl/type_test/type_test_tester_java.xsl>
[INFO] Executed tasks
[INFO] Registering compile source root <https://hudson.apache.org/hudson/job/cxf-wss4j-1.6-port/ws/testutils/target/generated/src/main/java>
[INFO] [cxf-xml2fastinfoset:xml2fastinfoset {execution: xml2fastinfoset}]
[INFO] [cxf-codegen:wsdl2java {execution: generate-sources}]
Nov 8, 2010 6:17:21 PM org.springframework.context.support.AbstractApplicationContext prepareRefresh
INFO: Refreshing org.apache.cxf.bus.spring.BusApplicationContext@a592cc: startup date [Mon
Nov 08 18:17:21 UTC 2010]; root of context hierarchy
Nov 8, 2010 6:17:21 PM org.springframework.beans.factory.xml.XmlBeanDefinitionReader loadBeanDefinitions
INFO: Loading XML bean definitions from class path resource [META-INF/cxf/cxf.xml]
Nov 8, 2010 6:17:22 PM org.springframework.beans.factory.support.DefaultListableBeanFactory
preInstantiateSingletons
INFO: Pre-instantiating singletons in org.springframework.beans.factory.support.DefaultListableBeanFactory@cd1510:
defining beans [cxf,org.apache.cxf.bus.spring.BusApplicationListener,org.apache.cxf.bus.spring.BusWiringBeanFactoryPostProcessor,org.apache.cxf.bus.spring.Jsr250BeanPostProcessor,org.apache.cxf.bus.spring.BusExtensionPostProcessor,org.apache.cxf.resource.ResourceManager,org.apache.cxf.configuration.Configurer,org.apache.cxf.binding.BindingFactoryManager,org.apache.cxf.transport.DestinationFactoryManager,org.apache.cxf.transport.ConduitInitiatorManager,org.apache.cxf.wsdl.WSDLManager,org.apache.cxf.phase.PhaseManager,org.apache.cxf.workqueue.WorkQueueManager,org.apache.cxf.buslifecycle.BusLifeCycleManager,org.apache.cxf.endpoint.ServerRegistry,org.apache.cxf.endpoint.ServerLifeCycleManager,org.apache.cxf.endpoint.ClientLifeCycleManager,org.apache.cxf.transports.http.QueryHandlerRegistry,org.apache.cxf.endpoint.EndpointResolverRegistry,org.apache.cxf.headers.HeaderManager,org.apache.cxf.catalog.OASISCatalogManager,org.apache.cxf.service.factory.FactoryBeanListenerManager,org.apache.cxf.endpoint.ServiceContractResolverRegistry];
root of factory hierarchy
Nov 8, 2010 6:17:31 PM org.springframework.context.support.AbstractApplicationContext doClose
INFO: Closing org.apache.cxf.bus.spring.BusApplicationContext@a592cc: startup date [Mon Nov
08 18:17:21 UTC 2010]; root of context hierarchy
Nov 8, 2010 6:17:31 PM org.springframework.beans.factory.support.DefaultSingletonBeanRegistry
destroySingletons
INFO: Destroying singletons in org.springframework.beans.factory.support.DefaultListableBeanFactory@cd1510:
defining beans [cxf,org.apache.cxf.bus.spring.BusApplicationListener,org.apache.cxf.bus.spring.BusWiringBeanFactoryPostProcessor,org.apache.cxf.bus.spring.Jsr250BeanPostProcessor,org.apache.cxf.bus.spring.BusExtensionPostProcessor,org.apache.cxf.resource.ResourceManager,org.apache.cxf.configuration.Configurer,org.apache.cxf.binding.BindingFactoryManager,org.apache.cxf.transport.DestinationFactoryManager,org.apache.cxf.transport.ConduitInitiatorManager,org.apache.cxf.wsdl.WSDLManager,org.apache.cxf.phase.PhaseManager,org.apache.cxf.workqueue.WorkQueueManager,org.apache.cxf.buslifecycle.BusLifeCycleManager,org.apache.cxf.endpoint.ServerRegistry,org.apache.cxf.endpoint.ServerLifeCycleManager,org.apache.cxf.endpoint.ClientLifeCycleManager,org.apache.cxf.transports.http.QueryHandlerRegistry,org.apache.cxf.endpoint.EndpointResolverRegistry,org.apache.cxf.headers.HeaderManager,org.apache.cxf.catalog.OASISCatalogManager,org.apache.cxf.service.factory.FactoryBeanListenerManager,org.apache.cxf.endpoint.ServiceContractResolverRegistry];
root of factory hierarchy
[INFO] ------------------------------------------------------------------------
[ERROR] BUILD ERROR
[INFO] ------------------------------------------------------------------------
[INFO] Internal error in the plugin manager executing goal 'org.apache.cxf:cxf-codegen-plugin:2.4.0-SNAPSHOT:wsdl2java':
<https://hudson.apache.org/hudson/job/cxf-wss4j-1.6-port/ws/maven-plugins/codegen-plugin/target/classes>
(Is a directory)
[INFO] ------------------------------------------------------------------------
[INFO] Trace
org.apache.maven.lifecycle.LifecycleExecutionException: Internal error in the plugin manager
executing goal 'org.apache.cxf:cxf-codegen-plugin:2.4.0-SNAPSHOT:wsdl2java': <https://hudson.apache.org/hudson/job/cxf-wss4j-1.6-port/ws/maven-plugins/codegen-plugin/target/classes>
(Is a directory)
	at org.apache.maven.lifecycle.DefaultLifecycleExecutor.executeGoals(DefaultLifecycleExecutor.java:698)
	at org.apache.maven.lifecycle.DefaultLifecycleExecutor.executeGoalWithLifecycle(DefaultLifecycleExecutor.java:556)
	at org.apache.maven.lifecycle.DefaultLifecycleExecutor.executeGoal(DefaultLifecycleExecutor.java:535)
	at org.apache.maven.lifecycle.DefaultLifecycleExecutor.executeGoalAndHandleFailures(DefaultLifecycleExecutor.java:387)
	at org.apache.maven.lifecycle.DefaultLifecycleExecutor.executeTaskSegments(DefaultLifecycleExecutor.java:348)
	at org.apache.maven.lifecycle.DefaultLifecycleExecutor.execute(DefaultLifecycleExecutor.java:180)
	at org.apache.maven.lifecycle.LifecycleExecutorInterceptor.execute(LifecycleExecutorInterceptor.java:65)
	at org.apache.maven.DefaultMaven.doExecute(DefaultMaven.java:328)
	at org.apache.maven.DefaultMaven.execute(DefaultMaven.java:138)
	at org.apache.maven.cli.MavenCli.main(MavenCli.java:362)
	at sun.reflect.NativeMethodAccessorImpl.invoke0(Native Method)
	at sun.reflect.NativeMethodAccessorImpl.invoke(NativeMethodAccessorImpl.java:39)
	at sun.reflect.DelegatingMethodAccessorImpl.invoke(DelegatingMethodAccessorImpl.java:25)
	at java.lang.reflect.Method.invoke(Method.java:597)
	at org.codehaus.classworlds.Launcher.launchEnhanced(Launcher.java:315)
	at org.codehaus.classworlds.Launcher.launch(Launcher.java:255)
	at hudson.maven.agent.Main.launch(Main.java:165)
	at hudson.maven.MavenBuilder.call(MavenBuilder.java:165)
	at hudson.maven.MavenModuleSetBuild$Builder.call(MavenModuleSetBuild.java:750)
	at hudson.maven.MavenModuleSetBuild$Builder.call(MavenModuleSetBuild.java:694)
	at hudson.remoting.UserRequest.perform(UserRequest.java:114)
	at hudson.remoting.UserRequest.perform(UserRequest.java:48)
	at hudson.remoting.Request$2.run(Request.java:270)
	at java.util.concurrent.Executors$RunnableAdapter.call(Executors.java:441)
	at java.util.concurrent.FutureTask$Sync.innerRun(FutureTask.java:303)
	at java.util.concurrent.FutureTask.run(FutureTask.java:138)
	at java.util.concurrent.ThreadPoolExecutor$Worker.runTask(ThreadPoolExecutor.java:886)
	at java.util.concurrent.ThreadPoolExecutor$Worker.run(ThreadPoolExecutor.java:908)
	at java.lang.Thread.run(Thread.java:619)
Caused by: org.apache.maven.plugin.PluginManagerException: <https://hudson.apache.org/hudson/job/cxf-wss4j-1.6-port/ws/maven-plugins/codegen-plugin/target/classes>
(Is a directory)
	at hudson.maven.agent.PluginManagerInterceptor.executeMojo(PluginManagerInterceptor.java:196)
	at org.apache.maven.lifecycle.DefaultLifecycleExecutor.executeGoals(DefaultLifecycleExecutor.java:694)
	... 28 more
Caused by: java.io.FileNotFoundException: <https://hudson.apache.org/hudson/job/cxf-wss4j-1.6-port/ws/maven-plugins/codegen-plugin/target/classes>
(Is a directory)
	at java.io.FileInputStream.open(Native Method)
	at java.io.FileInputStream.<init>(FileInputStream.java:106)
	at hudson.maven.ExecutedMojo.<init>(ExecutedMojo.java:96)
	at hudson.maven.MavenModuleSetBuild$Builder.postExecute(MavenModuleSetBuild.java:824)
	at hudson.maven.MavenBuilder$Adapter.postExecute(MavenBuilder.java:300)
	at hudson.maven.agent.PluginManagerInterceptor$1MojoIntercepterImpl.callPost(PluginManagerInterceptor.java:170)
	at hudson.maven.agent.PluginManagerInterceptor.executeMojo(PluginManagerInterceptor.java:183)
	... 29 more
[INFO] ------------------------------------------------------------------------
[INFO] Total time: 4 minutes 48 seconds
[INFO] Finished at: Mon Nov 08 18:17:33 UTC 2010
[INFO] Final Memory: 105M/598M
[INFO] ------------------------------------------------------------------------
Waiting for Hudson to finish collecting data
channel stopped


Mime
View raw message