cxf-notifications mailing list archives

Site index · List index
Message view « Date » · « Thread »
Top « Date » · « Thread »
From Apache Jenkins Server <jenk...@builds.apache.org>
Subject Build failed in Jenkins: CXF » CXF-JDK8-deploy #409
Date Fri, 02 Jul 2021 19:25:23 GMT
See <https://ci-builds.apache.org/job/CXF/job/CXF-JDK8-deploy/409/display/redirect?page=changes>

Changes:

[Jim Ma] Upgrade commons-io to 2.10.0


------------------------------------------
Started by an SCM change
Running as SYSTEM
[EnvInject] - Loading node environment variables.
Building remotely on H30 (ubuntu) in workspace <https://ci-builds.apache.org/job/CXF/job/CXF-JDK8-deploy/ws/>
The recommended git tool is: NONE
No credentials specified
 > git rev-parse --is-inside-work-tree # timeout=10
Fetching changes from the remote Git repository
 > git config remote.origin.url https://gitbox.apache.org/repos/asf/cxf.git # timeout=10
Fetching upstream changes from https://gitbox.apache.org/repos/asf/cxf.git
 > git --version # timeout=10
 > git --version # 'git version 2.17.1'
 > git fetch --tags --progress -- https://gitbox.apache.org/repos/asf/cxf.git +refs/heads/*:refs/remotes/origin/*
# timeout=10
 > git rev-parse refs/remotes/origin/master^{commit} # timeout=10
Checking out Revision 50e4ba6129d7f5fa8a9e91bc60175af3389baba0 (refs/remotes/origin/master)
 > git config core.sparsecheckout # timeout=10
 > git checkout -f 50e4ba6129d7f5fa8a9e91bc60175af3389baba0 # timeout=10
Commit message: "Merge pull request #823 from jimma/commons-io-upgrade"
 > git rev-list --no-walk 2aed55612a1da770d5ef554b551407881a210289 # timeout=10
Parsing POMs
Failed to transfer Could not transfer artifact org.springframework.boot:spring-boot-dependencies:pom:2.5.0
from/to spring-milestones (https://repo.spring.io/milestone): java.lang.RuntimeException:
Unexpected error: java.security.InvalidAlgorithmParameterException: the trustAnchors parameter
must be non-empty
Failed to transfer Could not transfer artifact org.springframework.boot:spring-boot-dependencies:pom:2.5.0
from/to central (https://repo.maven.apache.org/maven2): java.lang.RuntimeException: Unexpected
error: java.security.InvalidAlgorithmParameterException: the trustAnchors parameter must be
non-empty
Failed to transfer Could not transfer artifact org.springframework.cloud:spring-cloud-netflix-dependencies:pom:3.0.3
from/to spring-milestones (https://repo.spring.io/milestone): java.lang.RuntimeException:
Unexpected error: java.security.InvalidAlgorithmParameterException: the trustAnchors parameter
must be non-empty
Failed to transfer Could not transfer artifact org.springframework.cloud:spring-cloud-netflix-dependencies:pom:3.0.3
from/to central (https://repo.maven.apache.org/maven2): java.lang.RuntimeException: Unexpected
error: java.security.InvalidAlgorithmParameterException: the trustAnchors parameter must be
non-empty
ERROR: Failed to parse POMs
hudson.remoting.ProxyException: hudson.maven.MavenModuleSetBuild$MavenExecutionException:
org.apache.maven.project.ProjectBuildingException: Some problems were encountered while processing
the POMs:
[ERROR] Non-resolvable import POM: Could not transfer artifact org.springframework.boot:spring-boot-dependencies:pom:2.5.0
from/to spring-milestones (https://repo.spring.io/milestone): java.lang.RuntimeException:
Unexpected error: java.security.InvalidAlgorithmParameterException: the trustAnchors parameter
must be non-empty @ org.apache.cxf.samples:spring-boot-sample-rs:[unknown-version], <https://ci-builds.apache.org/job/CXF/job/CXF-JDK8-deploy/ws/distribution/src/main/release/samples/jax_rs/spring_boot/pom.xml,>
line 16, column 25
[ERROR] 'dependencies.dependency.version' for org.springframework.boot:spring-boot-starter-test:jar
is missing. @ org.apache.cxf.samples:spring-boot-sample-rs:[unknown-version], <https://ci-builds.apache.org/job/CXF/job/CXF-JDK8-deploy/ws/distribution/src/main/release/samples/jax_rs/spring_boot/pom.xml,>
line 61, column 21
[ERROR] Non-resolvable import POM: Failure to transfer org.springframework.boot:spring-boot-dependencies:pom:2.5.0
from https://repo.spring.io/milestone was cached in the local repository, resolution will
not be reattempted until the update interval of spring-milestones has elapsed or updates are
forced. Original error: Could not transfer artifact org.springframework.boot:spring-boot-dependencies:pom:2.5.0
from/to spring-milestones (https://repo.spring.io/milestone): java.lang.RuntimeException:
Unexpected error: java.security.InvalidAlgorithmParameterException: the trustAnchors parameter
must be non-empty @ org.apache.cxf.samples:spring-boot-sample-rs-scan-app:[unknown-version],
<https://ci-builds.apache.org/job/CXF/job/CXF-JDK8-deploy/ws/distribution/src/main/release/samples/jax_rs/spring_boot_scan/application/pom.xml,>
line 15, column 25
[ERROR] 'dependencies.dependency.version' for org.springframework.boot:spring-boot-starter-test:jar
is missing. @ org.apache.cxf.samples:spring-boot-sample-rs-scan-app:[unknown-version], <https://ci-builds.apache.org/job/CXF/job/CXF-JDK8-deploy/ws/distribution/src/main/release/samples/jax_rs/spring_boot_scan/application/pom.xml,>
line 67, column 21
[ERROR] Non-resolvable import POM: Failure to transfer org.springframework.boot:spring-boot-dependencies:pom:2.5.0
from https://repo.spring.io/milestone was cached in the local repository, resolution will
not be reattempted until the update interval of spring-milestones has elapsed or updates are
forced. Original error: Could not transfer artifact org.springframework.boot:spring-boot-dependencies:pom:2.5.0
from/to spring-milestones (https://repo.spring.io/milestone): java.lang.RuntimeException:
Unexpected error: java.security.InvalidAlgorithmParameterException: the trustAnchors parameter
must be non-empty @ org.apache.cxf.samples:spring-boot-sample-rs-scan-client:[unknown-version],
<https://ci-builds.apache.org/job/CXF/job/CXF-JDK8-deploy/ws/distribution/src/main/release/samples/jax_rs/spring_boot_scan/client/pom.xml,>
line 19, column 25
[ERROR] Non-resolvable import POM: Failure to transfer org.springframework.boot:spring-boot-dependencies:pom:2.5.0
from https://repo.spring.io/milestone was cached in the local repository, resolution will
not be reattempted until the update interval of spring-milestones has elapsed or updates are
forced. Original error: Could not transfer artifact org.springframework.boot:spring-boot-dependencies:pom:2.5.0
from/to spring-milestones (https://repo.spring.io/milestone): java.lang.RuntimeException:
Unexpected error: java.security.InvalidAlgorithmParameterException: the trustAnchors parameter
must be non-empty @ org.apache.cxf.samples:spring-boot-sample-rs-scan-eureka:[unknown-version],
<https://ci-builds.apache.org/job/CXF/job/CXF-JDK8-deploy/ws/distribution/src/main/release/samples/jax_rs/spring_boot_scan/eureka-registry/pom.xml,>
line 18, column 25
[ERROR] Non-resolvable import POM: Could not transfer artifact org.springframework.cloud:spring-cloud-netflix-dependencies:pom:3.0.3
from/to spring-milestones (https://repo.spring.io/milestone): java.lang.RuntimeException:
Unexpected error: java.security.InvalidAlgorithmParameterException: the trustAnchors parameter
must be non-empty @ org.apache.cxf.samples:spring-boot-sample-rs-scan-eureka:[unknown-version],
<https://ci-builds.apache.org/job/CXF/job/CXF-JDK8-deploy/ws/distribution/src/main/release/samples/jax_rs/spring_boot_scan/eureka-registry/pom.xml,>
line 25, column 25
[ERROR] Non-resolvable import POM: Failure to transfer org.springframework.boot:spring-boot-dependencies:pom:2.5.0
from https://repo.spring.io/milestone was cached in the local repository, resolution will
not be reattempted until the update interval of spring-milestones has elapsed or updates are
forced. Original error: Could not transfer artifact org.springframework.boot:spring-boot-dependencies:pom:2.5.0
from/to spring-milestones (https://repo.spring.io/milestone): java.lang.RuntimeException:
Unexpected error: java.security.InvalidAlgorithmParameterException: the trustAnchors parameter
must be non-empty @ org.apache.cxf.samples:jax_rs_tracing_opentracing_camel:[unknown-version],
<https://ci-builds.apache.org/job/CXF/job/CXF-JDK8-deploy/ws/distribution/src/main/release/samples/jax_rs/tracing_opentracing_camel/pom.xml,>
line 111, column 25
[ERROR] Non-resolvable import POM: Failure to transfer org.springframework.boot:spring-boot-dependencies:pom:2.5.0
from https://repo.spring.io/milestone was cached in the local repository, resolution will
not be reattempted until the update interval of spring-milestones has elapsed or updates are
forced. Original error: Could not transfer artifact org.springframework.boot:spring-boot-dependencies:pom:2.5.0
from/to spring-milestones (https://repo.spring.io/milestone): java.lang.RuntimeException:
Unexpected error: java.security.InvalidAlgorithmParameterException: the trustAnchors parameter
must be non-empty @ org.apache.cxf.samples:spring-boot-sample-ws-cxf:[unknown-version], <https://ci-builds.apache.org/job/CXF/job/CXF-JDK8-deploy/ws/distribution/src/main/release/samples/jaxws_spring_boot/pom.xml,>
line 15, column 25
[ERROR] 'dependencies.dependency.version' for org.springframework.boot:spring-boot-starter-test:jar
is missing. @ org.apache.cxf.samples:spring-boot-sample-ws-cxf:[unknown-version], <https://ci-builds.apache.org/job/CXF/job/CXF-JDK8-deploy/ws/distribution/src/main/release/samples/jaxws_spring_boot/pom.xml,>
line 50, column 21
[ERROR] 'dependencies.dependency.version' for org.springframework.boot:spring-boot-starter-web-services:jar
is missing. @ org.apache.cxf.samples:spring-boot-sample-ws-cxf:[unknown-version], <https://ci-builds.apache.org/job/CXF/job/CXF-JDK8-deploy/ws/distribution/src/main/release/samples/jaxws_spring_boot/pom.xml,>
line 66, column 21

	at hudson.maven.MavenModuleSetBuild$PomParser.invoke(MavenModuleSetBuild.java:1388)
	at hudson.maven.MavenModuleSetBuild$PomParser.invoke(MavenModuleSetBuild.java:1124)
	at hudson.FilePath$FileCallableWrapper.call(FilePath.java:3313)
	at hudson.remoting.UserRequest.perform(UserRequest.java:211)
	at hudson.remoting.UserRequest.perform(UserRequest.java:54)
	at hudson.remoting.Request$2.run(Request.java:375)
	at hudson.remoting.InterceptingExecutorService$1.call(InterceptingExecutorService.java:73)
	at java.util.concurrent.FutureTask.run(FutureTask.java:266)
	at java.util.concurrent.ThreadPoolExecutor.runWorker(ThreadPoolExecutor.java:1149)
	at java.util.concurrent.ThreadPoolExecutor$Worker.run(ThreadPoolExecutor.java:624)
	at java.lang.Thread.run(Thread.java:748)
	Suppressed: hudson.remoting.Channel$CallSiteStackTrace: Remote call to H30
		at hudson.remoting.Channel.attachCallSiteStackTrace(Channel.java:1800)
		at hudson.remoting.UserRequest$ExceptionResponse.retrieve(UserRequest.java:357)
		at hudson.remoting.Channel.call(Channel.java:1001)
		at hudson.FilePath.act(FilePath.java:1157)
		at hudson.FilePath.act(FilePath.java:1146)
		at hudson.maven.MavenModuleSetBuild$MavenModuleSetBuildExecution.parsePoms(MavenModuleSetBuild.java:985)
		at hudson.maven.MavenModuleSetBuild$MavenModuleSetBuildExecution.doRun(MavenModuleSetBuild.java:689)
		at hudson.model.AbstractBuild$AbstractBuildExecution.run(AbstractBuild.java:514)
		at hudson.model.Run.execute(Run.java:1907)
		at hudson.maven.MavenModuleSetBuild.run(MavenModuleSetBuild.java:543)
		at hudson.model.ResourceController.execute(ResourceController.java:97)
		at hudson.model.Executor.run(Executor.java:429)
Caused by: hudson.remoting.ProxyException: org.apache.maven.project.ProjectBuildingException:
Some problems were encountered while processing the POMs:
[ERROR] Non-resolvable import POM: Could not transfer artifact org.springframework.boot:spring-boot-dependencies:pom:2.5.0
from/to spring-milestones (https://repo.spring.io/milestone): java.lang.RuntimeException:
Unexpected error: java.security.InvalidAlgorithmParameterException: the trustAnchors parameter
must be non-empty @ org.apache.cxf.samples:spring-boot-sample-rs:[unknown-version], <https://ci-builds.apache.org/job/CXF/job/CXF-JDK8-deploy/ws/distribution/src/main/release/samples/jax_rs/spring_boot/pom.xml,>
line 16, column 25
[ERROR] 'dependencies.dependency.version' for org.springframework.boot:spring-boot-starter-test:jar
is missing. @ org.apache.cxf.samples:spring-boot-sample-rs:[unknown-version], <https://ci-builds.apache.org/job/CXF/job/CXF-JDK8-deploy/ws/distribution/src/main/release/samples/jax_rs/spring_boot/pom.xml,>
line 61, column 21
[ERROR] Non-resolvable import POM: Failure to transfer org.springframework.boot:spring-boot-dependencies:pom:2.5.0
from https://repo.spring.io/milestone was cached in the local repository, resolution will
not be reattempted until the update interval of spring-milestones has elapsed or updates are
forced. Original error: Could not transfer artifact org.springframework.boot:spring-boot-dependencies:pom:2.5.0
from/to spring-milestones (https://repo.spring.io/milestone): java.lang.RuntimeException:
Unexpected error: java.security.InvalidAlgorithmParameterException: the trustAnchors parameter
must be non-empty @ org.apache.cxf.samples:spring-boot-sample-rs-scan-app:[unknown-version],
<https://ci-builds.apache.org/job/CXF/job/CXF-JDK8-deploy/ws/distribution/src/main/release/samples/jax_rs/spring_boot_scan/application/pom.xml,>
line 15, column 25
[ERROR] 'dependencies.dependency.version' for org.springframework.boot:spring-boot-starter-test:jar
is missing. @ org.apache.cxf.samples:spring-boot-sample-rs-scan-app:[unknown-version], <https://ci-builds.apache.org/job/CXF/job/CXF-JDK8-deploy/ws/distribution/src/main/release/samples/jax_rs/spring_boot_scan/application/pom.xml,>
line 67, column 21
[ERROR] Non-resolvable import POM: Failure to transfer org.springframework.boot:spring-boot-dependencies:pom:2.5.0
from https://repo.spring.io/milestone was cached in the local repository, resolution will
not be reattempted until the update interval of spring-milestones has elapsed or updates are
forced. Original error: Could not transfer artifact org.springframework.boot:spring-boot-dependencies:pom:2.5.0
from/to spring-milestones (https://repo.spring.io/milestone): java.lang.RuntimeException:
Unexpected error: java.security.InvalidAlgorithmParameterException: the trustAnchors parameter
must be non-empty @ org.apache.cxf.samples:spring-boot-sample-rs-scan-client:[unknown-version],
<https://ci-builds.apache.org/job/CXF/job/CXF-JDK8-deploy/ws/distribution/src/main/release/samples/jax_rs/spring_boot_scan/client/pom.xml,>
line 19, column 25
[ERROR] Non-resolvable import POM: Failure to transfer org.springframework.boot:spring-boot-dependencies:pom:2.5.0
from https://repo.spring.io/milestone was cached in the local repository, resolution will
not be reattempted until the update interval of spring-milestones has elapsed or updates are
forced. Original error: Could not transfer artifact org.springframework.boot:spring-boot-dependencies:pom:2.5.0
from/to spring-milestones (https://repo.spring.io/milestone): java.lang.RuntimeException:
Unexpected error: java.security.InvalidAlgorithmParameterException: the trustAnchors parameter
must be non-empty @ org.apache.cxf.samples:spring-boot-sample-rs-scan-eureka:[unknown-version],
<https://ci-builds.apache.org/job/CXF/job/CXF-JDK8-deploy/ws/distribution/src/main/release/samples/jax_rs/spring_boot_scan/eureka-registry/pom.xml,>
line 18, column 25
[ERROR] Non-resolvable import POM: Could not transfer artifact org.springframework.cloud:spring-cloud-netflix-dependencies:pom:3.0.3
from/to spring-milestones (https://repo.spring.io/milestone): java.lang.RuntimeException:
Unexpected error: java.security.InvalidAlgorithmParameterException: the trustAnchors parameter
must be non-empty @ org.apache.cxf.samples:spring-boot-sample-rs-scan-eureka:[unknown-version],
<https://ci-builds.apache.org/job/CXF/job/CXF-JDK8-deploy/ws/distribution/src/main/release/samples/jax_rs/spring_boot_scan/eureka-registry/pom.xml,>
line 25, column 25
[ERROR] Non-resolvable import POM: Failure to transfer org.springframework.boot:spring-boot-dependencies:pom:2.5.0
from https://repo.spring.io/milestone was cached in the local repository, resolution will
not be reattempted until the update interval of spring-milestones has elapsed or updates are
forced. Original error: Could not transfer artifact org.springframework.boot:spring-boot-dependencies:pom:2.5.0
from/to spring-milestones (https://repo.spring.io/milestone): java.lang.RuntimeException:
Unexpected error: java.security.InvalidAlgorithmParameterException: the trustAnchors parameter
must be non-empty @ org.apache.cxf.samples:jax_rs_tracing_opentracing_camel:[unknown-version],
<https://ci-builds.apache.org/job/CXF/job/CXF-JDK8-deploy/ws/distribution/src/main/release/samples/jax_rs/tracing_opentracing_camel/pom.xml,>
line 111, column 25
[ERROR] Non-resolvable import POM: Failure to transfer org.springframework.boot:spring-boot-dependencies:pom:2.5.0
from https://repo.spring.io/milestone was cached in the local repository, resolution will
not be reattempted until the update interval of spring-milestones has elapsed or updates are
forced. Original error: Could not transfer artifact org.springframework.boot:spring-boot-dependencies:pom:2.5.0
from/to spring-milestones (https://repo.spring.io/milestone): java.lang.RuntimeException:
Unexpected error: java.security.InvalidAlgorithmParameterException: the trustAnchors parameter
must be non-empty @ org.apache.cxf.samples:spring-boot-sample-ws-cxf:[unknown-version], <https://ci-builds.apache.org/job/CXF/job/CXF-JDK8-deploy/ws/distribution/src/main/release/samples/jaxws_spring_boot/pom.xml,>
line 15, column 25
[ERROR] 'dependencies.dependency.version' for org.springframework.boot:spring-boot-starter-test:jar
is missing. @ org.apache.cxf.samples:spring-boot-sample-ws-cxf:[unknown-version], <https://ci-builds.apache.org/job/CXF/job/CXF-JDK8-deploy/ws/distribution/src/main/release/samples/jaxws_spring_boot/pom.xml,>
line 50, column 21
[ERROR] 'dependencies.dependency.version' for org.springframework.boot:spring-boot-starter-web-services:jar
is missing. @ org.apache.cxf.samples:spring-boot-sample-ws-cxf:[unknown-version], <https://ci-builds.apache.org/job/CXF/job/CXF-JDK8-deploy/ws/distribution/src/main/release/samples/jaxws_spring_boot/pom.xml,>
line 66, column 21

	at org.apache.maven.project.DefaultProjectBuilder.build(DefaultProjectBuilder.java:383)
	at hudson.maven.MavenEmbedder.buildProjects(MavenEmbedder.java:370)
	at hudson.maven.MavenEmbedder.readProjects(MavenEmbedder.java:340)
	at hudson.maven.MavenModuleSetBuild$PomParser.invoke(MavenModuleSetBuild.java:1327)
	... 10 more

Mime
View raw message