db-torque-dev mailing list archives

Site index · List index
Message view « Date » · « Thread »
Top « Date » · « Thread »
From Apache Jenkins Server <jenk...@builds.apache.org>
Subject Build failed in Jenkins: Torque4-trunk #568
Date Wed, 21 Sep 2016 00:24:00 GMT
See <https://builds.apache.org/job/Torque4-trunk/568/changes>

Changes:

[tfischer] Remove unused templates

------------------------------------------
Started by an SCM change
[EnvInject] - Loading node environment variables.
Building remotely on ubuntu-6 (Ubuntu yahoo-not-h2 ubuntu docker) in workspace <https://builds.apache.org/job/Torque4-trunk/ws/>
Cleaning up <https://builds.apache.org/job/Torque4-trunk/ws/torque4-trunk>
Deleting <https://builds.apache.org/job/Torque4-trunk/ws/torque4-trunk/torque-runtime/target>
Deleting <https://builds.apache.org/job/Torque4-trunk/ws/torque4-trunk/target>
Updating http://svn.apache.org/repos/asf/db/torque/torque4/trunk at revision '2016-09-21T00:22:57.800
+0000'
D         torque-templates/src/main/resources/org/apache/torque/templates/om/templates/peer/base/log.vm
U         torque-templates/src/main/resources/org/apache/torque/templates/om/templates/peer/base/basePeerForView.vm
U         torque-templates/src/main/resources/org/apache/torque/templates/om/templates/peer/base/basePeer.vm
D         torque-templates/src/main/resources/org/apache/torque/templates/om/templates/peer/impl/base/doSelect.vm
D         torque-templates/src/main/resources/org/apache/torque/templates/om/templates/peer/impl/base/log.vm
D         torque-templates/src/main/resources/org/apache/torque/templates/om/templates/peer/impl/base/doInsert.vm
U         torque-templates/src/main/resources/org/apache/torque/templates/om/templates/peer/impl/base/basePeerImpl.vm
U         torque-templates/src/main/resources/org/apache/torque/templates/om/templates/peer/impl/base/basePeerForViewImpl.vm
U         torque-templates/src/main/resources/org/apache/torque/templates/om/templates/peer/impl/base/imports.vm
U         torque-templates/src/main/resources/org/apache/torque/templates/om/outlets/peerImpl.xml
U         torque-templates/src/main/resources/org/apache/torque/templates/om/outlets/basePeer.xml
 U        torque-templates
U         torque-runtime/src/main/java/org/apache/torque/TorqueInstance.java
U         torque-runtime/NOTICE
At revision 1761651

Parsing POMs
Established TCP socket on 46259
maven32-agent.jar already up to date
maven32-interceptor.jar already up to date
maven3-interceptor-commons.jar already up to date
[torque4-trunk] $ /home/jenkins/tools/java/latest1.7/bin/java -Xmx2g -Xms256m -XX:MaxPermSize=512m
-cp /home/jenkins/jenkins-slave/maven32-agent.jar:/home/jenkins/tools/maven/latest3/boot/plexus-classworlds-2.5.2.jar:/home/jenkins/tools/maven/latest3/conf/logging
jenkins.maven3.agent.Maven32Main /home/jenkins/tools/maven/latest3/ /home/jenkins/jenkins-slave/slave.jar
/home/jenkins/jenkins-slave/maven32-interceptor.jar /home/jenkins/jenkins-slave/maven3-interceptor-commons.jar
46259
<===[JENKINS REMOTING CAPACITY]===>   channel started
Executing Maven:  -B -f <https://builds.apache.org/job/Torque4-trunk/ws/torque4-trunk/pom.xml>
-Dmaven.repo.local=/home/jenkins/jenkins-slave/maven-repositories/1 clean install cobertura:cobertura
findbugs:findbugs checkstyle:checkstyle pmd:pmd pmd:cpd
[INFO] Scanning for projects...
[INFO] Downloading: https://repo.maven.apache.org/maven2/org/apache/maven/wagon/wagon-ssh-external/2.2/wagon-ssh-external-2.2.pom
[INFO] Downloaded: https://repo.maven.apache.org/maven2/org/apache/maven/wagon/wagon-ssh-external/2.2/wagon-ssh-external-2.2.pom
(5 KB at 7.7 KB/sec)
[INFO] Downloading: https://repo.maven.apache.org/maven2/org/apache/maven/wagon/wagon-ssh-common/2.2/wagon-ssh-common-2.2.pom
[INFO] Downloaded: https://repo.maven.apache.org/maven2/org/apache/maven/wagon/wagon-ssh-common/2.2/wagon-ssh-common-2.2.pom
(2 KB at 22.4 KB/sec)
[INFO] Downloading: https://repo.maven.apache.org/maven2/org/apache/maven/wagon/wagon-ssh-external/2.2/wagon-ssh-external-2.2.jar
[INFO] Downloading: https://repo.maven.apache.org/maven2/org/apache/maven/wagon/wagon-ssh-common/2.2/wagon-ssh-common-2.2.jar
[INFO] Downloaded: https://repo.maven.apache.org/maven2/org/apache/maven/wagon/wagon-ssh-external/2.2/wagon-ssh-external-2.2.jar
(15 KB at 302.0 KB/sec)
[INFO] Downloaded: https://repo.maven.apache.org/maven2/org/apache/maven/wagon/wagon-ssh-common/2.2/wagon-ssh-common-2.2.jar
(25 KB at 339.5 KB/sec)
[INFO] ------------------------------------------------------------------------
[INFO] Reactor Build Order:
[INFO] 
[INFO] Torque Maven Parent
[INFO] Torque Runtime
[INFO] Torque Generator
[INFO] Torque Templates
[INFO] Torque Generator Maven 2 Plugin
[INFO] Torque Generator Ant tasks
[INFO] Torque Site
[INFO] Downloading: https://repo.maven.apache.org/maven2/org/apache/maven/plugins/maven-eclipse-plugin/2.9/maven-eclipse-plugin-2.9.pom
[INFO] Downloaded: https://repo.maven.apache.org/maven2/org/apache/maven/plugins/maven-eclipse-plugin/2.9/maven-eclipse-plugin-2.9.pom
(15 KB at 182.0 KB/sec)
[INFO] Downloading: https://repo.maven.apache.org/maven2/org/apache/maven/plugins/maven-eclipse-plugin/2.9/maven-eclipse-plugin-2.9.jar
[INFO] Downloaded: https://repo.maven.apache.org/maven2/org/apache/maven/plugins/maven-eclipse-plugin/2.9/maven-eclipse-plugin-2.9.jar
(213 KB at 1950.2 KB/sec)
[INFO] Downloading: https://repo.maven.apache.org/maven2/org/codehaus/mojo/cobertura-maven-plugin/2.3/cobertura-maven-plugin-2.3.pom
[INFO] Downloaded: https://repo.maven.apache.org/maven2/org/codehaus/mojo/cobertura-maven-plugin/2.3/cobertura-maven-plugin-2.3.pom
(6 KB at 28.8 KB/sec)
[INFO] Downloading: https://repo.maven.apache.org/maven2/org/codehaus/mojo/cobertura-maven-plugin/2.3/cobertura-maven-plugin-2.3.jar
[INFO] Downloaded: https://repo.maven.apache.org/maven2/org/codehaus/mojo/cobertura-maven-plugin/2.3/cobertura-maven-plugin-2.3.jar
(32 KB at 149.6 KB/sec)
[INFO] Downloading: https://repo.maven.apache.org/maven2/org/codehaus/mojo/findbugs-maven-plugin/3.0.0/findbugs-maven-plugin-3.0.0.pom
[INFO] Downloaded: https://repo.maven.apache.org/maven2/org/codehaus/mojo/findbugs-maven-plugin/3.0.0/findbugs-maven-plugin-3.0.0.pom
(19 KB at 403.4 KB/sec)
[INFO] Downloading: https://repo.maven.apache.org/maven2/org/codehaus/mojo/findbugs-maven-plugin/3.0.0/findbugs-maven-plugin-3.0.0.jar
[INFO] Downloaded: https://repo.maven.apache.org/maven2/org/codehaus/mojo/findbugs-maven-plugin/3.0.0/findbugs-maven-plugin-3.0.0.jar
(130 KB at 2028.9 KB/sec)
[INFO] Downloading: https://repo.maven.apache.org/maven2/org/apache/maven/plugins/maven-jxr-plugin/2.4/maven-jxr-plugin-2.4.pom
[INFO] Downloaded: https://repo.maven.apache.org/maven2/org/apache/maven/plugins/maven-jxr-plugin/2.4/maven-jxr-plugin-2.4.pom
(8 KB at 62.6 KB/sec)
[INFO] Downloading: https://repo.maven.apache.org/maven2/org/apache/maven/jxr/jxr/2.4/jxr-2.4.pom
[INFO] Downloaded: https://repo.maven.apache.org/maven2/org/apache/maven/jxr/jxr/2.4/jxr-2.4.pom
(6 KB at 78.0 KB/sec)
[INFO] Downloading: https://repo.maven.apache.org/maven2/org/apache/maven/plugins/maven-jxr-plugin/2.4/maven-jxr-plugin-2.4.jar
[INFO] Downloaded: https://repo.maven.apache.org/maven2/org/apache/maven/plugins/maven-jxr-plugin/2.4/maven-jxr-plugin-2.4.jar
(33 KB at 795.3 KB/sec)
[INFO]                                                                         
[INFO] ------------------------------------------------------------------------
[INFO] Building Torque Maven Parent 4.1-SNAPSHOT
[INFO] ------------------------------------------------------------------------
[INFO] 
[INFO] --- maven-clean-plugin:3.0.0:clean (default-clean) @ torque ---
[INFO] 
[INFO] --- maven-remote-resources-plugin:1.5:process (process-resource-bundles) @ torque ---
[INFO] 
[INFO] --- maven-site-plugin:3.5.1:attach-descriptor (attach-descriptor) @ torque ---
[INFO] 
[INFO] --- maven-source-plugin:3.0.0:jar-no-fork (attach-sources) @ torque ---
[INFO] 
[INFO] --- apache-rat-plugin:0.11:check (default) @ torque ---
[INFO] 57 implicit excludes (use -debug for more details).
[INFO] Exclude: velocity.log
[INFO] Exclude: .checkstyle
[INFO] Exclude: checkstyle-cache.ccf
[INFO] Exclude: derby.log
[INFO] Exclude: LICENSE-EDL.txt
[INFO] Exclude: DEPENDENCIES
[INFO] Exclude: torque-test/target/**/*
[INFO] Exclude: torque-test/.classpath
[INFO] Exclude: torque-test/.project
[INFO] Exclude: torque-test/.settings/**
[INFO] Exclude: torque-test/src/main/generated-java/**/*
[INFO] Exclude: torque-test/derby.log
[INFO] 120 resources included (use -debug for more details)
[INFO] Rat check: Summary of files. Unapproved: 0 unknown: 0 generated: 0 approved: 115 licence.
[CHECKSTYLE] No report found for mojo check
[PMD] No report found for mojo check[INFO] 
[INFO] --- maven-install-plugin:2.5.2:install (default-install) @ torque ---

[INFO] Installing <https://builds.apache.org/job/Torque4-trunk/ws/torque4-trunk/pom.xml>
to /home/jenkins/jenkins-slave/maven-repositories/1/org/apache/torque/torque/4.1-SNAPSHOT/torque-4.1-SNAPSHOT.pom
[INFO] 
[INFO] >>> cobertura-maven-plugin:2.3:cobertura (default-cli) > [cobertura]test
@ torque >>>
[INFO] 
[INFO] --- maven-remote-resources-plugin:1.5:process (process-resource-bundles) @ torque ---
[INFO] 
[INFO] --- cobertura-maven-plugin:2.3:instrument (default-cli) @ torque ---
[INFO] Downloading: https://repo.maven.apache.org/maven2/net/sourceforge/cobertura/cobertura/1.9.2/cobertura-1.9.2.pom
[INFO] Downloaded: https://repo.maven.apache.org/maven2/net/sourceforge/cobertura/cobertura/1.9.2/cobertura-1.9.2.pom
(2 KB at 7.3 KB/sec)
[INFO] Downloading: https://repo.maven.apache.org/maven2/asm/asm-tree/3.0/asm-tree-3.0.pom
[INFO] Downloaded: https://repo.maven.apache.org/maven2/asm/asm-tree/3.0/asm-tree-3.0.pom
(499 B at 7.3 KB/sec)
[INFO] Downloading: https://repo.maven.apache.org/maven2/log4j/log4j/1.2.9/log4j-1.2.9.pom
[INFO] Downloaded: https://repo.maven.apache.org/maven2/log4j/log4j/1.2.9/log4j-1.2.9.pom
(144 B at 7.8 KB/sec)
[INFO] Downloading: https://repo.maven.apache.org/maven2/net/sourceforge/cobertura/cobertura-runtime/1.9.2/cobertura-runtime-1.9.2.pom
[INFO] Downloaded: https://repo.maven.apache.org/maven2/net/sourceforge/cobertura/cobertura-runtime/1.9.2/cobertura-runtime-1.9.2.pom
(2 KB at 10.5 KB/sec)
[INFO] Downloading: https://repo.maven.apache.org/maven2/net/sourceforge/cobertura/cobertura/1.9.2/cobertura-1.9.2.jar
[INFO] Downloading: https://repo.maven.apache.org/maven2/asm/asm-tree/3.0/asm-tree-3.0.jar
[INFO] Downloading: https://repo.maven.apache.org/maven2/log4j/log4j/1.2.9/log4j-1.2.9.jar
[INFO] Downloaded: https://repo.maven.apache.org/maven2/asm/asm-tree/3.0/asm-tree-3.0.jar
(22 KB at 477.5 KB/sec)
[INFO] Downloaded: https://repo.maven.apache.org/maven2/log4j/log4j/1.2.9/log4j-1.2.9.jar
(345 KB at 5134.8 KB/sec)
[INFO] Downloaded: https://repo.maven.apache.org/maven2/net/sourceforge/cobertura/cobertura/1.9.2/cobertura-1.9.2.jar
(225 KB at 1070.8 KB/sec)
[INFO] Not executing cobertura:instrument as the project is not a Java classpath-capable package
[INFO] 
[INFO] <<< cobertura-maven-plugin:2.3:cobertura (default-cli) < [cobertura]test
@ torque <<<
[INFO] 
[INFO] --- cobertura-maven-plugin:2.3:cobertura (default-cli) @ torque ---
[INFO] Not executing cobertura:report as the cobertura data file (<https://builds.apache.org/job/Torque4-trunk/ws/torque4-trunk/target/cobertura/cobertura.ser)>
could not be found
[INFO] 
[INFO] --- findbugs-maven-plugin:3.0.0:findbugs (default-cli) @ torque ---
[INFO] Downloading: https://repo.maven.apache.org/maven2/com/google/code/findbugs/findbugs/3.0.0/findbugs-3.0.0.pom
[INFO] Downloaded: https://repo.maven.apache.org/maven2/com/google/code/findbugs/findbugs/3.0.0/findbugs-3.0.0.pom
(5 KB at 130.8 KB/sec)
[INFO] Downloading: https://repo.maven.apache.org/maven2/com/google/code/findbugs/jFormatString/3.0.0/jFormatString-3.0.0.pom
[INFO] Downloaded: https://repo.maven.apache.org/maven2/com/google/code/findbugs/jFormatString/3.0.0/jFormatString-3.0.0.pom
(4 KB at 187.4 KB/sec)
[INFO] Downloading: https://repo.maven.apache.org/maven2/com/google/code/findbugs/findbugs/3.0.0/findbugs-3.0.0.jar
[INFO] Downloading: https://repo.maven.apache.org/maven2/com/google/code/findbugs/jFormatString/3.0.0/jFormatString-3.0.0.jar
[INFO] Downloaded: https://repo.maven.apache.org/maven2/com/google/code/findbugs/jFormatString/3.0.0/jFormatString-3.0.0.jar
(34 KB at 771.1 KB/sec)
[INFO] Downloaded: https://repo.maven.apache.org/maven2/com/google/code/findbugs/findbugs/3.0.0/findbugs-3.0.0.jar
(3537 KB at 13498.7 KB/sec)
[INFO] 
[INFO] --- maven-checkstyle-plugin:2.13:checkstyle (default-cli) @ torque ---
[FINDBUGS] No report found for mojo findbugs
[INFO] 
[CHECKSTYLE] Parsing file <https://builds.apache.org/job/Torque4-trunk/ws/torque4-trunk/target/checkstyle-result.xml>
[CHECKSTYLE] Successfully parsed file <https://builds.apache.org/job/Torque4-trunk/ws/torque4-trunk/target/checkstyle-result.xml>
of module Torque Maven Parent with 0 unique warnings and 0 duplicates.
[CHECKSTYLE] Computing warning deltas based on reference build #567
[INFO] 
[INFO] --- maven-pmd-plugin:3.2:pmd (default-cli) @ torque ---
[INFO] Downloading: https://repo.maven.apache.org/maven2/net/sourceforge/pmd/pmd/5.1.2/pmd-5.1.2.pom
[INFO] Downloaded: https://repo.maven.apache.org/maven2/net/sourceforge/pmd/pmd/5.1.2/pmd-5.1.2.pom
(36 KB at 245.2 KB/sec)
[INFO] Downloading: https://repo.maven.apache.org/maven2/net/sourceforge/pmd/pmd/5.1.2/pmd-5.1.2.jar
[INFO] Downloaded: https://repo.maven.apache.org/maven2/net/sourceforge/pmd/pmd/5.1.2/pmd-5.1.2.jar
(2049 KB at 7342.8 KB/sec)
[PMD] No report found for mojo pmd[INFO] 
[INFO] --- maven-pmd-plugin:3.2:cpd (default-cli) @ torque ---

[DRY] No report found for mojo cpd
[INFO]                                                                         
[INFO] ------------------------------------------------------------------------
[INFO] Building Torque Runtime 4.1-SNAPSHOT
[INFO] ------------------------------------------------------------------------
[INFO] Downloading: https://repo.maven.apache.org/maven2/org/apache/fulcrum/fulcrum-testcontainer/1.0.6/fulcrum-testcontainer-1.0.6.pom
[INFO] Downloaded: https://repo.maven.apache.org/maven2/org/apache/fulcrum/fulcrum-testcontainer/1.0.6/fulcrum-testcontainer-1.0.6.pom
(5 KB at 22.0 KB/sec)
[INFO] Downloading: https://repo.maven.apache.org/maven2/org/apache/fulcrum/fulcrum-parent/1/fulcrum-parent-1.pom
[INFO] Downloaded: https://repo.maven.apache.org/maven2/org/apache/fulcrum/fulcrum-parent/1/fulcrum-parent-1.pom
(19 KB at 97.9 KB/sec)
[INFO] Downloading: https://repo.maven.apache.org/maven2/org/apache/fulcrum/fulcrum-yaafi/1.0.6/fulcrum-yaafi-1.0.6.pom
[INFO] Downloaded: https://repo.maven.apache.org/maven2/org/apache/fulcrum/fulcrum-yaafi/1.0.6/fulcrum-yaafi-1.0.6.pom
(3 KB at 15.5 KB/sec)
[INFO] Downloading: https://repo.maven.apache.org/maven2/org/apache/fulcrum/fulcrum-testcontainer/1.0.6/fulcrum-testcontainer-1.0.6.jar
[INFO] Downloading: https://repo.maven.apache.org/maven2/org/apache/fulcrum/fulcrum-yaafi/1.0.6/fulcrum-yaafi-1.0.6.jar
[INFO] Downloaded: https://repo.maven.apache.org/maven2/org/apache/fulcrum/fulcrum-yaafi/1.0.6/fulcrum-yaafi-1.0.6.jar
(128 KB at 480.2 KB/sec)
[INFO] Downloaded: https://repo.maven.apache.org/maven2/org/apache/fulcrum/fulcrum-testcontainer/1.0.6/fulcrum-testcontainer-1.0.6.jar
(14 KB at 37.0 KB/sec)
[INFO] 
[INFO] --- maven-clean-plugin:3.0.0:clean (default-clean) @ torque-runtime ---
[INFO] 
[INFO] --- maven-remote-resources-plugin:1.5:process (process-resource-bundles) @ torque-runtime
---
[INFO] 
[INFO] --- maven-resources-plugin:2.7:resources (default-resources) @ torque-runtime ---
[INFO] Using 'ISO-8859-1' encoding to copy filtered resources.
[INFO] skip non existing resourceDirectory <https://builds.apache.org/job/Torque4-trunk/ws/torque4-trunk/torque-runtime/src/main/resources>
[INFO] Copying 3 resources
[INFO] 
[INFO] --- maven-compiler-plugin:3.5.1:compile (default-compile) @ torque-runtime ---
[INFO] Changes detected - recompiling the module!
[INFO] Compiling 119 source files to <https://builds.apache.org/job/Torque4-trunk/ws/torque4-trunk/torque-runtime/target/classes>
[INFO] ------------------------------------------------------------------------
[INFO] Reactor Summary:
[INFO] 
[INFO] Torque Maven Parent ................................ SUCCESS [ 27.600 s]
[INFO] Torque Runtime ..................................... FAILURE [  2.710 s]
[INFO] Torque Generator ................................... SKIPPED
[INFO] Torque Templates ................................... SKIPPED
[INFO] Torque Generator Maven 2 Plugin .................... SKIPPED
[INFO] Torque Generator Ant tasks ......................... SKIPPED
[INFO] Torque Site ........................................ SKIPPED
[INFO] ------------------------------------------------------------------------
[INFO] BUILD FAILURE
[INFO] ------------------------------------------------------------------------
[INFO] Total time: 43.450 s
[INFO] Finished at: 2016-09-21T00:22:43+00:00
[INFO] Final Memory: 55M/604M
[INFO] ------------------------------------------------------------------------
[ERROR] Failed to execute goal org.apache.maven.plugins:maven-compiler-plugin:3.5.1:compile
(default-compile) on project torque-runtime: Fatal error compiling: invalid target release:
1.8 -> [Help 1]
[ERROR] 
[ERROR] To see the full stack trace of the errors, re-run Maven with the -e switch.
[ERROR] Re-run Maven using the -X switch to enable full debug logging.
[ERROR] 
[ERROR] For more information about the errors and possible solutions, please read the following
articles:
[ERROR] [Help 1] http://cwiki.apache.org/confluence/display/MAVEN/MojoExecutionException
[ERROR] 
[ERROR] After correcting the problems, you can resume the build with the command
[ERROR]   mvn <goals> -rf :torque-runtime
[JENKINS] Archiving <https://builds.apache.org/job/Torque4-trunk/ws/torque4-trunk/torque-maven-plugin/pom.xml>
to org.apache.torque/torque-maven-plugin/4.1-SNAPSHOT/torque-maven-plugin-4.1-SNAPSHOT.pom
[JENKINS] Archiving <https://builds.apache.org/job/Torque4-trunk/ws/torque4-trunk/pom.xml>
to org.apache.torque/torque/4.1-SNAPSHOT/torque-4.1-SNAPSHOT.pom
<https://builds.apache.org/job/Torque4-trunk/ws/torque4-trunk/pom.xml> is not inside
<https://builds.apache.org/job/Torque4-trunk/ws/torque4-trunk/torque4-trunk/;> will
archive in a separate pass
[JENKINS] Archiving <https://builds.apache.org/job/Torque4-trunk/ws/torque4-trunk/torque-site/pom.xml>
to org.apache.torque/torque-site/4.1-SNAPSHOT/torque-site-4.1-SNAPSHOT.pom
[JENKINS] Archiving <https://builds.apache.org/job/Torque4-trunk/ws/torque4-trunk/torque-generator/pom.xml>
to org.apache.torque/torque-generator/4.1-SNAPSHOT/torque-generator-4.1-SNAPSHOT.pom
[JENKINS] Archiving <https://builds.apache.org/job/Torque4-trunk/ws/torque4-trunk/torque-templates/pom.xml>
to org.apache.torque/torque-templates/4.1-SNAPSHOT/torque-templates-4.1-SNAPSHOT.pom
[JENKINS] Archiving <https://builds.apache.org/job/Torque4-trunk/ws/torque4-trunk/torque-runtime/pom.xml>
to org.apache.torque/torque-runtime/4.1-SNAPSHOT/torque-runtime-4.1-SNAPSHOT.pom
[JENKINS] Archiving <https://builds.apache.org/job/Torque4-trunk/ws/torque4-trunk/torque-ant-tasks/pom.xml>
to org.apache.torque/torque-ant-tasks/4.1-SNAPSHOT/torque-ant-tasks-4.1-SNAPSHOT.pom
Sending e-mails to: torque-dev@db.apache.org
channel stopped
Skipping Cobertura coverage report as build was not UNSTABLE or better ...

---------------------------------------------------------------------
To unsubscribe, e-mail: torque-dev-unsubscribe@db.apache.org
For additional commands, e-mail: torque-dev-help@db.apache.org


Mime
View raw message