db-torque-dev mailing list archives

Site index · List index
Message view « Date » · « Thread »
Top « Date » · « Thread »
From Apache Jenkins Server <jenk...@builds.apache.org>
Subject Build failed in Jenkins: torque4-test-project-hsqldb #358
Date Thu, 20 Dec 2018 15:17:26 GMT
See <https://builds.apache.org/job/torque4-test-project-hsqldb/358/display/redirect?page=changes>

Changes:

[tv] Generify ObjectKey

[tv] Generify ObjectKey

[tv] Don't override managed plugin version

[tv] Generify ObjectKey (template adjustments follow)

------------------------------------------
[...truncated 1.44 MB...]
    at sun.reflect.NativeMethodAccessorImpl.invoke (NativeMethodAccessorImpl.java:62)
    at sun.reflect.DelegatingMethodAccessorImpl.invoke (DelegatingMethodAccessorImpl.java:43)
    at java.lang.reflect.Method.invoke (Method.java:498)
    at org.codehaus.plexus.classworlds.launcher.Launcher.launchEnhanced (Launcher.java:289)
    at org.codehaus.plexus.classworlds.launcher.Launcher.launch (Launcher.java:229)
    at jenkins.maven3.agent.Maven35Main.launch (Maven35Main.java:176)
    at sun.reflect.NativeMethodAccessorImpl.invoke0 (Native Method)
    at sun.reflect.NativeMethodAccessorImpl.invoke (NativeMethodAccessorImpl.java:62)
    at sun.reflect.DelegatingMethodAccessorImpl.invoke (DelegatingMethodAccessorImpl.java:43)
    at java.lang.reflect.Method.invoke (Method.java:498)
    at hudson.maven.Maven3Builder.call (Maven3Builder.java:139)
    at hudson.maven.Maven3Builder.call (Maven3Builder.java:70)
    at hudson.remoting.UserRequest.perform (UserRequest.java:212)
    at hudson.remoting.UserRequest.perform (UserRequest.java:54)
    at hudson.remoting.Request$2.run (Request.java:369)
    at hudson.remoting.InterceptingExecutorService$1.call (InterceptingExecutorService.java:72)
    at java.util.concurrent.FutureTask.run (FutureTask.java:266)
    at java.util.concurrent.ThreadPoolExecutor.runWorker (ThreadPoolExecutor.java:1149)
    at java.util.concurrent.ThreadPoolExecutor$Worker.run (ThreadPoolExecutor.java:624)
    at java.lang.Thread.run (Thread.java:748)
Caused by: org.hsqldb.HsqlException: user lacks privilege or object not found: BOOK
    at org.hsqldb.error.Error.error (Unknown Source)
    at org.hsqldb.error.Error.error (Unknown Source)
    at org.hsqldb.ParserDQL.readTableName (Unknown Source)
    at org.hsqldb.ParserDQL.readTableOrSubquery (Unknown Source)
    at org.hsqldb.ParserDQL.XreadTableReference (Unknown Source)
    at org.hsqldb.ParserDQL.XreadFromClause (Unknown Source)
    at org.hsqldb.ParserDQL.XreadTableExpression (Unknown Source)
    at org.hsqldb.ParserDQL.XreadQuerySpecification (Unknown Source)
    at org.hsqldb.ParserDQL.XreadSimpleTable (Unknown Source)
    at org.hsqldb.ParserDQL.XreadQueryPrimary (Unknown Source)
    at org.hsqldb.ParserDQL.XreadQueryTerm (Unknown Source)
    at org.hsqldb.ParserDQL.XreadQueryExpressionBody (Unknown Source)
    at org.hsqldb.ParserDQL.XreadQueryExpression (Unknown Source)
    at org.hsqldb.ParserDQL.compileCursorSpecification (Unknown Source)
    at org.hsqldb.ParserCommand.compilePart (Unknown Source)
    at org.hsqldb.ParserCommand.compileStatements (Unknown Source)
    at org.hsqldb.Session.executeDirectStatement (Unknown Source)
    at org.hsqldb.Session.execute (Unknown Source)
    at org.hsqldb.jdbc.JDBCStatement.fetchResult (Unknown Source)
    at org.hsqldb.jdbc.JDBCStatement.execute (Unknown Source)
    at org.apache.tools.ant.taskdefs.SQLExec.execSQL (SQLExec.java:794)
    at org.apache.tools.ant.taskdefs.SQLExec.runStatements (SQLExec.java:764)
    at org.apache.tools.ant.taskdefs.SQLExec$Transaction.runTransaction (SQLExec.java:1062)
    at org.apache.tools.ant.taskdefs.SQLExec$Transaction.access$000 (SQLExec.java:1004)
    at org.apache.tools.ant.taskdefs.SQLExec.execute (SQLExec.java:672)
    at org.apache.tools.ant.UnknownElement.execute (UnknownElement.java:292)
    at sun.reflect.NativeMethodAccessorImpl.invoke0 (Native Method)
    at sun.reflect.NativeMethodAccessorImpl.invoke (NativeMethodAccessorImpl.java:62)
    at sun.reflect.DelegatingMethodAccessorImpl.invoke (DelegatingMethodAccessorImpl.java:43)
    at java.lang.reflect.Method.invoke (Method.java:498)
    at org.apache.tools.ant.dispatch.DispatchUtils.execute (DispatchUtils.java:106)
    at org.apache.tools.ant.Task.perform (Task.java:348)
    at org.apache.tools.ant.Target.execute (Target.java:435)
    at org.apache.tools.ant.Target.performTasks (Target.java:456)
    at org.apache.tools.ant.Project.executeSortedTargets (Project.java:1393)
    at org.apache.tools.ant.Project.executeTarget (Project.java:1364)
    at org.apache.maven.plugin.antrun.AntRunMojo.execute (AntRunMojo.java:313)
    at org.apache.maven.plugin.DefaultBuildPluginManager.executeMojo (DefaultBuildPluginManager.java:137)
    at org.apache.maven.lifecycle.internal.MojoExecutor.execute (MojoExecutor.java:208)
    at org.apache.maven.lifecycle.internal.MojoExecutor.execute (MojoExecutor.java:154)
    at org.apache.maven.lifecycle.internal.MojoExecutor.execute (MojoExecutor.java:146)
    at org.apache.maven.lifecycle.internal.LifecycleModuleBuilder.buildProject (LifecycleModuleBuilder.java:117)
    at org.apache.maven.lifecycle.internal.LifecycleModuleBuilder.buildProject (LifecycleModuleBuilder.java:81)
    at org.apache.maven.lifecycle.internal.builder.singlethreaded.SingleThreadedBuilder.build
(SingleThreadedBuilder.java:56)
    at org.apache.maven.lifecycle.internal.LifecycleStarter.execute (LifecycleStarter.java:128)
    at org.apache.maven.DefaultMaven.doExecute (DefaultMaven.java:305)
    at org.apache.maven.DefaultMaven.doExecute (DefaultMaven.java:192)
    at org.apache.maven.DefaultMaven.execute (DefaultMaven.java:105)
    at org.jvnet.hudson.maven3.launcher.Maven35Launcher.main (Maven35Launcher.java:130)
    at sun.reflect.NativeMethodAccessorImpl.invoke0 (Native Method)
    at sun.reflect.NativeMethodAccessorImpl.invoke (NativeMethodAccessorImpl.java:62)
    at sun.reflect.DelegatingMethodAccessorImpl.invoke (DelegatingMethodAccessorImpl.java:43)
    at java.lang.reflect.Method.invoke (Method.java:498)
    at org.codehaus.plexus.classworlds.launcher.Launcher.launchEnhanced (Launcher.java:289)
    at org.codehaus.plexus.classworlds.launcher.Launcher.launch (Launcher.java:229)
    at jenkins.maven3.agent.Maven35Main.launch (Maven35Main.java:176)
    at sun.reflect.NativeMethodAccessorImpl.invoke0 (Native Method)
    at sun.reflect.NativeMethodAccessorImpl.invoke (NativeMethodAccessorImpl.java:62)
    at sun.reflect.DelegatingMethodAccessorImpl.invoke (DelegatingMethodAccessorImpl.java:43)
    at java.lang.reflect.Method.invoke (Method.java:498)
    at hudson.maven.Maven3Builder.call (Maven3Builder.java:139)
    at hudson.maven.Maven3Builder.call (Maven3Builder.java:70)
    at hudson.remoting.UserRequest.perform (UserRequest.java:212)
    at hudson.remoting.UserRequest.perform (UserRequest.java:54)
    at hudson.remoting.Request$2.run (Request.java:369)
    at hudson.remoting.InterceptingExecutorService$1.call (InterceptingExecutorService.java:72)
    at java.util.concurrent.FutureTask.run (FutureTask.java:266)
    at java.util.concurrent.ThreadPoolExecutor.runWorker (ThreadPoolExecutor.java:1149)
    at java.util.concurrent.ThreadPoolExecutor$Worker.run (ThreadPoolExecutor.java:624)
    at java.lang.Thread.run (Thread.java:748)
[INFO] 
[INFO] --- maven-antrun-plugin:1.8:run (shutdown-db-after-test-database) @ torque-test ---
[INFO] Skipping Antrun execution
[INFO] 
[INFO] --- torque-maven-plugin:4.1-SNAPSHOT:generate (generate-sources) @ torque-test ---
INFO  org.apache.torque.generator.control.Controller - readConfiguration() : Starting to read
configuration files
INFO  org.apache.torque.generator.configuration.controller.Log4jLoggingAdapter - apply() :
Setting loglevel to ERROR
INFO  org.apache.torque.generator.control.Controller - readConfiguration() : Configuration
read.
INFO  org.apache.torque.generator.configuration.controller.Log4jLoggingAdapter - apply() :
Setting loglevel to ERROR
[INFO] Generation successful
[INFO] 
[INFO] --- torque-maven-plugin:4.1-SNAPSHOT:generate (generate-sql) @ torque-test ---
INFO  org.apache.torque.generator.control.Controller - readConfiguration() : Starting to read
configuration files
INFO  org.apache.torque.generator.configuration.controller.Log4jLoggingAdapter - apply() :
Setting loglevel to ERROR
[INFO] Generation successful
[INFO] 
[INFO] --- torque-maven-plugin:4.1-SNAPSHOT:generate (generate-createdb-sql) @ torque-test
---
INFO  org.apache.torque.generator.control.Controller - readConfiguration() : Starting to read
configuration files
INFO  org.apache.torque.generator.configuration.controller.Log4jLoggingAdapter - apply() :
Setting loglevel to ERROR
[INFO] Generation successful
[INFO] 
[INFO] --- torque-maven-plugin:4.1-SNAPSHOT:generate (generate-idtable-sql) @ torque-test
---
INFO  org.apache.torque.generator.control.Controller - readConfiguration() : Starting to read
configuration files
INFO  org.apache.torque.generator.configuration.controller.Log4jLoggingAdapter - apply() :
Setting loglevel to ERROR
[INFO] Generation successful
[INFO] 
[INFO] --- torque-maven-plugin:4.1-SNAPSHOT:generate (generate-html-doc) @ torque-test ---
INFO  org.apache.torque.generator.control.Controller - readConfiguration() : Starting to read
configuration files
INFO  org.apache.torque.generator.configuration.controller.Log4jLoggingAdapter - apply() :
Setting loglevel to ERROR
[INFO] Generation successful
[INFO] 
[INFO] --- maven-remote-resources-plugin:1.5:process (process-resource-bundles) @ torque-test
---
[INFO] 
[INFO] --- maven-resources-plugin:3.1.0:resources (default-resources) @ torque-test ---
[INFO] Using 'ISO-8859-1' encoding to copy filtered resources.
[INFO] skip non existing resourceDirectory <https://builds.apache.org/job/torque4-test-project-hsqldb/ws/torque-test/src/main/resources>
[INFO] Copying 3 resources
[INFO] 
[INFO] --- maven-compiler-plugin:3.7.0:compile (default-compile) @ torque-test ---
[INFO] Changes detected - recompiling the module!
[INFO] Compiling 1012 source files to <https://builds.apache.org/job/torque4-test-project-hsqldb/ws/torque-test/target/classes>
[INFO] <https://builds.apache.org/job/torque4-test-project-hsqldb/ws/torque-test/target/generated-sources/org/apache/torque/test/dbobject/base/BaseDatePk.java>:
Some input files use or override a deprecated API.
[INFO] <https://builds.apache.org/job/torque4-test-project-hsqldb/ws/torque-test/target/generated-sources/org/apache/torque/test/dbobject/base/BaseDatePk.java>:
Recompile with -Xlint:deprecation for details.
[INFO] <https://builds.apache.org/job/torque4-test-project-hsqldb/ws/torque-test/target/generated-sources/org/apache/torque/test/manager/base/BaseMultipleIndexManager.java>:
Some input files use unchecked or unsafe operations.
[INFO] <https://builds.apache.org/job/torque4-test-project-hsqldb/ws/torque-test/target/generated-sources/org/apache/torque/test/manager/base/BaseMultipleIndexManager.java>:
Recompile with -Xlint:unchecked for details.
[INFO] 
[INFO] --- sql-maven-plugin:1.4:execute (execute-ext-ddl) @ torque-test ---
[INFO] Downloading from central: https://repo.maven.apache.org/maven2/org/apache/maven/shared/maven-filtering/1.0-beta-3/maven-filtering-1.0-beta-3.pom
[INFO] Downloaded from central: https://repo.maven.apache.org/maven2/org/apache/maven/shared/maven-filtering/1.0-beta-3/maven-filtering-1.0-beta-3.pom
(5.5 kB at 157 kB/s)
[INFO] Downloading from central: https://repo.maven.apache.org/maven2/org/apache/maven/shared/maven-filtering/1.0-beta-3/maven-filtering-1.0-beta-3.jar
[INFO] Downloaded from central: https://repo.maven.apache.org/maven2/org/apache/maven/shared/maven-filtering/1.0-beta-3/maven-filtering-1.0-beta-3.jar
(34 kB at 2.0 MB/s)
[INFO] Executing file: <https://builds.apache.org/job/torque4-test-project-hsqldb/ws/torque-test/target/generated-sql/extext-schema.sql>
0 rows affected
[INFO] Executing file: <https://builds.apache.org/job/torque4-test-project-hsqldb/ws/torque-test/target/generated-sql/ext-schema.sql>
0 rows affected
Dec 20, 2018 3:15:59 PM org.hsqldb.persist.Logger logInfoEvent
INFO: Database closed
[INFO] 2 of 2 SQL statements executed successfully
[INFO] 
[INFO] --- sql-maven-plugin:1.4:execute (execute-ddl) @ torque-test ---
[INFO] Executing file: <https://builds.apache.org/job/torque4-test-project-hsqldb/ws/torque-test/target/generated-sql/bookstore-schema.sql>
[INFO] Executing file: <https://builds.apache.org/job/torque4-test-project-hsqldb/ws/torque-test/target/generated-sql/databaseMapInit-schema.sql>
[INFO] Executing file: <https://builds.apache.org/job/torque4-test-project-hsqldb/ws/torque-test/target/generated-sql/default-value-schema.sql>
[INFO] Executing file: <https://builds.apache.org/job/torque4-test-project-hsqldb/ws/torque-test/target/generated-sql/foreign-key-schema.sql>
[INFO] Executing file: <https://builds.apache.org/job/torque4-test-project-hsqldb/ws/torque-test/target/generated-sql/id-table-schema.sql>
[INFO] Executing file: <https://builds.apache.org/job/torque4-test-project-hsqldb/ws/torque-test/target/generated-sql/index.sql>
[INFO] Executing file: <https://builds.apache.org/job/torque4-test-project-hsqldb/ws/torque-test/target/generated-sql/pk-schema.sql>
[INFO] Executing file: <https://builds.apache.org/job/torque4-test-project-hsqldb/ws/torque-test/target/generated-sql/qualified-table-name-schema.sql>
[INFO] Executing file: <https://builds.apache.org/job/torque4-test-project-hsqldb/ws/torque-test/target/generated-sql/save-method-in-peer-schema.sql>
[INFO] Executing file: <https://builds.apache.org/job/torque4-test-project-hsqldb/ws/torque-test/target/generated-sql/test-schema.sql>
[INFO] Executing file: <https://builds.apache.org/job/torque4-test-project-hsqldb/ws/torque-test/target/generated-sql/types-schema.sql>
Dec 20, 2018 3:15:59 PM org.hsqldb.persist.Logger logInfoEvent
INFO: Database closed
[INFO] 123 of 123 SQL statements executed successfully
[INFO] 
[INFO] --- sql-maven-plugin:1.4:execute (execute-idtable-sql) @ torque-test ---
[INFO] Executing file: <https://builds.apache.org/job/torque4-test-project-hsqldb/ws/torque-test/target/generated-sql/bookstore-schema-idtable-init.sql>
[INFO] Executing file: <https://builds.apache.org/job/torque4-test-project-hsqldb/ws/torque-test/target/generated-sql/databaseMapInit-schema-idtable-init.sql>
[INFO] Executing file: <https://builds.apache.org/job/torque4-test-project-hsqldb/ws/torque-test/target/generated-sql/default-value-schema-idtable-init.sql>
[INFO] Executing file: <https://builds.apache.org/job/torque4-test-project-hsqldb/ws/torque-test/target/generated-sql/ext-schema-idtable-init.sql>
[INFO] Executing file: <https://builds.apache.org/job/torque4-test-project-hsqldb/ws/torque-test/target/generated-sql/extext-schema-idtable-init.sql>
[INFO] Executing file: <https://builds.apache.org/job/torque4-test-project-hsqldb/ws/torque-test/target/generated-sql/foreign-key-schema-idtable-init.sql>
[INFO] Executing file: <https://builds.apache.org/job/torque4-test-project-hsqldb/ws/torque-test/target/generated-sql/pk-schema-idtable-init.sql>
[INFO] Executing file: <https://builds.apache.org/job/torque4-test-project-hsqldb/ws/torque-test/target/generated-sql/qualified-table-name-schema-idtable-init.sql>
[INFO] Executing file: <https://builds.apache.org/job/torque4-test-project-hsqldb/ws/torque-test/target/generated-sql/save-method-in-peer-schema-idtable-init.sql>
[INFO] Executing file: <https://builds.apache.org/job/torque4-test-project-hsqldb/ws/torque-test/target/generated-sql/test-schema-idtable-init.sql>
[INFO] Executing file: <https://builds.apache.org/job/torque4-test-project-hsqldb/ws/torque-test/target/generated-sql/types-schema-idtable-init.sql>
Dec 20, 2018 3:16:00 PM org.hsqldb.persist.Logger logInfoEvent
INFO: Database closed
[INFO] 76 of 76 SQL statements executed successfully
[INFO] 
[INFO] --- sql-maven-plugin:1.4:execute (shutdown-db-after-ddl) @ torque-test ---
[INFO] Skip sql execution
[INFO] 
[INFO] --- maven-resources-plugin:3.1.0:testResources (default-testResources) @ torque-test
---
[INFO] Using 'ISO-8859-1' encoding to copy filtered resources.
[INFO] Copying 6 resources
[INFO] Copying 3 resources
[INFO] 
[INFO] --- maven-compiler-plugin:3.7.0:testCompile (default-testCompile) @ torque-test ---
[INFO] Changes detected - recompiling the module!
[INFO] Compiling 62 source files to <https://builds.apache.org/job/torque4-test-project-hsqldb/ws/torque-test/target/test-classes>
[INFO] Some messages have been simplified; recompile with -Xdiags:verbose to get full output
[INFO] -------------------------------------------------------------
[ERROR] COMPILATION ERROR : 
[INFO] -------------------------------------------------------------
[ERROR] <https://builds.apache.org/job/torque4-test-project-hsqldb/ws/torque-test/src/test/java/org/apache/torque/ManagerTestConditional.java>:[96,59]
incompatible types: java.util.List<org.apache.torque.om.ObjectKey> cannot be converted
to java.util.List<? extends org.apache.torque.om.ObjectKey<?>>
[ERROR] <https://builds.apache.org/job/torque4-test-project-hsqldb/ws/torque-test/src/test/java/org/apache/torque/ManagerTestConditional.java>:[122,46]
incompatible types: java.util.ArrayList<org.apache.torque.om.ObjectKey> cannot be converted
to java.util.List<? extends org.apache.torque.om.ObjectKey<?>>
[INFO] 2 errors 
[INFO] -------------------------------------------------------------
[INFO] ------------------------------------------------------------------------
[INFO] Reactor Summary:
[INFO] 
[INFO] Torque Maven Parent 4.1-SNAPSHOT ................... SUCCESS [ 23.061 s]
[INFO] Torque Runtime ..................................... SUCCESS [04:00 min]
[INFO] Torque Generator ................................... SUCCESS [ 47.801 s]
[INFO] Torque Templates ................................... SUCCESS [ 47.384 s]
[INFO] Torque Generator Maven 2 Plugin .................... SUCCESS [ 24.841 s]
[INFO] Torque Generator Ant tasks ......................... SUCCESS [  6.578 s]
[INFO] Torque Site ........................................ SUCCESS [ 21.858 s]
[INFO] Torque Test Project 4.1-SNAPSHOT ................... FAILURE [ 59.504 s]
[INFO] ------------------------------------------------------------------------
[INFO] BUILD FAILURE
[INFO] ------------------------------------------------------------------------
[INFO] Total time: 10:02 min
[INFO] Finished at: 2018-12-20T15:16:17Z
[INFO] ------------------------------------------------------------------------
Waiting for Jenkins to finish collecting data
[ERROR] Failed to execute goal org.apache.maven.plugins:maven-compiler-plugin:3.7.0:testCompile
(default-testCompile) on project torque-test: Compilation failure: Compilation failure:
[ERROR] <https://builds.apache.org/job/torque4-test-project-hsqldb/ws/torque-test/src/test/java/org/apache/torque/ManagerTestConditional.java>:[96,59]
incompatible types: java.util.List<org.apache.torque.om.ObjectKey> cannot be converted
to java.util.List<? extends org.apache.torque.om.ObjectKey<?>>
[ERROR] <https://builds.apache.org/job/torque4-test-project-hsqldb/ws/torque-test/src/test/java/org/apache/torque/ManagerTestConditional.java>:[122,46]
incompatible types: java.util.ArrayList<org.apache.torque.om.ObjectKey> cannot be converted
to java.util.List<? extends org.apache.torque.om.ObjectKey<?>>
[ERROR] -> [Help 1]
[ERROR] 
[ERROR] To see the full stack trace of the errors, re-run Maven with the -e switch.
[ERROR] Re-run Maven using the -X switch to enable full debug logging.
[ERROR] 
[ERROR] For more information about the errors and possible solutions, please read the following
articles:
[ERROR] [Help 1] http://cwiki.apache.org/confluence/display/MAVEN/MojoFailureException
[ERROR] 
[ERROR] After correcting the problems, you can resume the build with the command
[ERROR]   mvn <goals> -rf :torque-test
[JENKINS] Archiving <https://builds.apache.org/job/torque4-test-project-hsqldb/ws/torque-maven-plugin/pom.xml>
to org.apache.torque/torque-maven-plugin/4.1-SNAPSHOT/torque-maven-plugin-4.1-SNAPSHOT.pom
[JENKINS] Archiving <https://builds.apache.org/job/torque4-test-project-hsqldb/ws/torque-maven-plugin/target/torque-maven-plugin-4.1-SNAPSHOT.jar>
to org.apache.torque/torque-maven-plugin/4.1-SNAPSHOT/torque-maven-plugin-4.1-SNAPSHOT.jar
[JENKINS] Archiving <https://builds.apache.org/job/torque4-test-project-hsqldb/ws/pom.xml>
to org.apache.torque/torque/4.1-SNAPSHOT/torque-4.1-SNAPSHOT.pom
[JENKINS] Archiving <https://builds.apache.org/job/torque4-test-project-hsqldb/ws/torque-site/pom.xml>
to org.apache.torque/torque-site/4.1-SNAPSHOT/torque-site-4.1-SNAPSHOT.pom
[JENKINS] Archiving <https://builds.apache.org/job/torque4-test-project-hsqldb/ws/torque-site/target/torque-site-4.1-SNAPSHOT-site.xml>
to org.apache.torque/torque-site/4.1-SNAPSHOT/torque-site-4.1-SNAPSHOT-site.xml
[JENKINS] Archiving <https://builds.apache.org/job/torque4-test-project-hsqldb/ws/torque-generator/pom.xml>
to org.apache.torque/torque-generator/4.1-SNAPSHOT/torque-generator-4.1-SNAPSHOT.pom
[JENKINS] Archiving <https://builds.apache.org/job/torque4-test-project-hsqldb/ws/torque-generator/target/torque-generator-4.1-SNAPSHOT.jar>
to org.apache.torque/torque-generator/4.1-SNAPSHOT/torque-generator-4.1-SNAPSHOT.jar
[JENKINS] Archiving <https://builds.apache.org/job/torque4-test-project-hsqldb/ws/torque-templates/pom.xml>
to org.apache.torque/torque-templates/4.1-SNAPSHOT/torque-templates-4.1-SNAPSHOT.pom
[JENKINS] Archiving <https://builds.apache.org/job/torque4-test-project-hsqldb/ws/torque-templates/target/torque-templates-4.1-SNAPSHOT.jar>
to org.apache.torque/torque-templates/4.1-SNAPSHOT/torque-templates-4.1-SNAPSHOT.jar
[JENKINS] Archiving <https://builds.apache.org/job/torque4-test-project-hsqldb/ws/torque-test/pom.xml>
to org.apache.torque/torque-test/4.1-SNAPSHOT/torque-test-4.1-SNAPSHOT.pom
[Fast Archiver] Compressed 52.05 KB of artifacts by 61.5% relative to #357
[JENKINS] Archiving <https://builds.apache.org/job/torque4-test-project-hsqldb/ws/torque-runtime/pom.xml>
to org.apache.torque/torque-runtime/4.1-SNAPSHOT/torque-runtime-4.1-SNAPSHOT.pom
[JENKINS] Archiving <https://builds.apache.org/job/torque4-test-project-hsqldb/ws/torque-runtime/target/torque-runtime-4.1-SNAPSHOT.jar>
to org.apache.torque/torque-runtime/4.1-SNAPSHOT/torque-runtime-4.1-SNAPSHOT.jar
[JENKINS] Archiving <https://builds.apache.org/job/torque4-test-project-hsqldb/ws/torque-ant-tasks/pom.xml>
to org.apache.torque/torque-ant-tasks/4.1-SNAPSHOT/torque-ant-tasks-4.1-SNAPSHOT.pom
[JENKINS] Archiving <https://builds.apache.org/job/torque4-test-project-hsqldb/ws/torque-ant-tasks/target/torque-ant-tasks-4.1-SNAPSHOT.jar>
to org.apache.torque/torque-ant-tasks/4.1-SNAPSHOT/torque-ant-tasks-4.1-SNAPSHOT.jar
Sending e-mails to: torque-dev@db.apache.org
channel stopped

---------------------------------------------------------------------
To unsubscribe, e-mail: torque-dev-unsubscribe@db.apache.org
For additional commands, e-mail: torque-dev-help@db.apache.org


Mime
View raw message