db-torque-dev mailing list archives

Site index · List index
Message view « Date » · « Thread »
Top « Date » · « Thread »
From Apache Jenkins Server <jenk...@builds.apache.org>
Subject Build failed in Jenkins: DB » Torque » Torque4-trunk #2
Date Fri, 19 Feb 2021 19:54:08 GMT
See <https://ci-builds.apache.org/job/DB/job/Torque/job/Torque4-trunk/2/display/redirect>

Changes:


------------------------------------------
[...truncated 2.20 MB...]
		at hudson.maven.Maven3Builder.call(Maven3Builder.java:146)
		at hudson.maven.Maven3Builder.call(Maven3Builder.java:70)
		at hudson.remoting.UserRequest.perform(UserRequest.java:211)
		at hudson.remoting.UserRequest.perform(UserRequest.java:54)
		at hudson.remoting.Request$2.run(Request.java:369)
		at hudson.remoting.InterceptingExecutorService$1.call(InterceptingExecutorService.java:72)
		... 4 more
ERROR: Asynchronous execution failure
java.util.concurrent.ExecutionException: java.io.IOException: Unexpected Fingerprint type.
Expected class hudson.model.Fingerprint or subclass but got class hudson.model.Fingerprint$RangeSet
	at hudson.remoting.Channel$2.adapt(Channel.java:1035)
	at hudson.remoting.Channel$2.adapt(Channel.java:1029)
	at hudson.remoting.FutureAdapter.get(FutureAdapter.java:55)
	at hudson.maven.AbstractMavenBuilder.waitForAsynchronousExecutions(AbstractMavenBuilder.java:186)
	at hudson.maven.Maven3Builder.call(Maven3Builder.java:146)
	at hudson.maven.Maven3Builder.call(Maven3Builder.java:70)
	at hudson.remoting.UserRequest.perform(UserRequest.java:211)
	at hudson.remoting.UserRequest.perform(UserRequest.java:54)
	at hudson.remoting.Request$2.run(Request.java:369)
	at hudson.remoting.InterceptingExecutorService$1.call(InterceptingExecutorService.java:72)
	at java.util.concurrent.FutureTask.run(FutureTask.java:266)
	at java.util.concurrent.ThreadPoolExecutor.runWorker(ThreadPoolExecutor.java:1149)
	at java.util.concurrent.ThreadPoolExecutor$Worker.run(ThreadPoolExecutor.java:624)
	at java.lang.Thread.run(Thread.java:748)
Caused by: java.io.IOException: Unexpected Fingerprint type. Expected class hudson.model.Fingerprint
or subclass but got class hudson.model.Fingerprint$RangeSet
	at hudson.model.Fingerprint.load(Fingerprint.java:1387)
	at hudson.model.Fingerprint.load(Fingerprint.java:1372)
	at hudson.model.FingerprintMap.load(FingerprintMap.java:97)
	at hudson.model.FingerprintMap.load(FingerprintMap.java:47)
	at hudson.util.KeyedDataStorage.get(KeyedDataStorage.java:161)
	at hudson.model.FingerprintMap.get(FingerprintMap.java:82)
	at hudson.model.FingerprintMap.get(FingerprintMap.java:47)
	at hudson.util.KeyedDataStorage.getOrCreate(KeyedDataStorage.java:111)
	at hudson.model.FingerprintMap.getOrCreate(FingerprintMap.java:68)
	at hudson.maven.reporters.MavenFingerprinter$PostBuildCallable.call(MavenFingerprinter.java:249)
	at hudson.maven.reporters.MavenFingerprinter$PostBuildCallable.call(MavenFingerprinter.java:236)
	at hudson.maven.MavenBuild$ProxyImpl.execute(MavenBuild.java:454)
	at hudson.maven.MavenBuild$ProxyImpl2.execute(MavenBuild.java:586)
	at sun.reflect.GeneratedMethodAccessor4078.invoke(Unknown Source)
	at sun.reflect.DelegatingMethodAccessorImpl.invoke(DelegatingMethodAccessorImpl.java:43)
	at java.lang.reflect.Method.invoke(Method.java:498)
	at hudson.model.Executor$2.call(Executor.java:932)
	at hudson.util.InterceptingProxy$1.invoke(InterceptingProxy.java:23)
	at com.sun.proxy.$Proxy209.execute(Unknown Source)
	at hudson.maven.MavenBuildProxy$Filter$AsyncInvoker.call(MavenBuildProxy.java:294)
	at hudson.remoting.UserRequest.perform(UserRequest.java:211)
	at hudson.remoting.UserRequest.perform(UserRequest.java:54)
	at hudson.remoting.Request$2.run(Request.java:369)
	at hudson.remoting.InterceptingExecutorService$1.call(InterceptingExecutorService.java:72)
	at org.jenkinsci.remoting.CallableDecorator.call(CallableDecorator.java:18)
	at hudson.remoting.CallableDecoratorList$1.call(CallableDecoratorList.java:21)
	at jenkins.util.ContextResettingExecutorService$2.call(ContextResettingExecutorService.java:46)
	at jenkins.security.ImpersonatingExecutorService$2.call(ImpersonatingExecutorService.java:71)
	... 4 more
	Suppressed: hudson.remoting.Channel$CallSiteStackTrace: Remote call to channel
		at hudson.remoting.Channel.attachCallSiteStackTrace(Channel.java:1788)
		at hudson.remoting.UserRequest$ExceptionResponse.retrieve(UserRequest.java:356)
		at hudson.remoting.Channel$2.adapt(Channel.java:1033)
		at hudson.remoting.Channel$2.adapt(Channel.java:1029)
		at hudson.remoting.FutureAdapter.get(FutureAdapter.java:55)
		at hudson.maven.AbstractMavenBuilder.waitForAsynchronousExecutions(AbstractMavenBuilder.java:186)
		at hudson.maven.Maven3Builder.call(Maven3Builder.java:146)
		at hudson.maven.Maven3Builder.call(Maven3Builder.java:70)
		at hudson.remoting.UserRequest.perform(UserRequest.java:211)
		at hudson.remoting.UserRequest.perform(UserRequest.java:54)
		at hudson.remoting.Request$2.run(Request.java:369)
		at hudson.remoting.InterceptingExecutorService$1.call(InterceptingExecutorService.java:72)
		... 4 more
ERROR: Asynchronous execution failure
java.util.concurrent.ExecutionException: java.io.IOException: Unexpected Fingerprint type.
Expected class hudson.model.Fingerprint or subclass but got class hudson.model.Fingerprint$RangeSet
	at hudson.remoting.Channel$2.adapt(Channel.java:1035)
	at hudson.remoting.Channel$2.adapt(Channel.java:1029)
	at hudson.remoting.FutureAdapter.get(FutureAdapter.java:55)
	at hudson.maven.AbstractMavenBuilder.waitForAsynchronousExecutions(AbstractMavenBuilder.java:186)
	at hudson.maven.Maven3Builder.call(Maven3Builder.java:146)
	at hudson.maven.Maven3Builder.call(Maven3Builder.java:70)
	at hudson.remoting.UserRequest.perform(UserRequest.java:211)
	at hudson.remoting.UserRequest.perform(UserRequest.java:54)
	at hudson.remoting.Request$2.run(Request.java:369)
	at hudson.remoting.InterceptingExecutorService$1.call(InterceptingExecutorService.java:72)
	at java.util.concurrent.FutureTask.run(FutureTask.java:266)
	at java.util.concurrent.ThreadPoolExecutor.runWorker(ThreadPoolExecutor.java:1149)
	at java.util.concurrent.ThreadPoolExecutor$Worker.run(ThreadPoolExecutor.java:624)
	at java.lang.Thread.run(Thread.java:748)
Caused by: java.io.IOException: Unexpected Fingerprint type. Expected class hudson.model.Fingerprint
or subclass but got class hudson.model.Fingerprint$RangeSet
	at hudson.model.Fingerprint.load(Fingerprint.java:1387)
	at hudson.model.Fingerprint.load(Fingerprint.java:1372)
	at hudson.model.FingerprintMap.load(FingerprintMap.java:97)
	at hudson.model.FingerprintMap.load(FingerprintMap.java:47)
	at hudson.util.KeyedDataStorage.get(KeyedDataStorage.java:161)
	at hudson.model.FingerprintMap.get(FingerprintMap.java:82)
	at hudson.model.FingerprintMap.get(FingerprintMap.java:47)
	at hudson.util.KeyedDataStorage.getOrCreate(KeyedDataStorage.java:111)
	at hudson.model.FingerprintMap.getOrCreate(FingerprintMap.java:68)
	at hudson.maven.reporters.MavenFingerprinter$PostBuildCallable.call(MavenFingerprinter.java:249)
	at hudson.maven.reporters.MavenFingerprinter$PostBuildCallable.call(MavenFingerprinter.java:236)
	at hudson.maven.MavenBuild$ProxyImpl.execute(MavenBuild.java:454)
	at hudson.maven.MavenBuild$ProxyImpl2.execute(MavenBuild.java:586)
	at sun.reflect.GeneratedMethodAccessor4078.invoke(Unknown Source)
	at sun.reflect.DelegatingMethodAccessorImpl.invoke(DelegatingMethodAccessorImpl.java:43)
	at java.lang.reflect.Method.invoke(Method.java:498)
	at hudson.model.Executor$2.call(Executor.java:932)
	at hudson.util.InterceptingProxy$1.invoke(InterceptingProxy.java:23)
	at com.sun.proxy.$Proxy209.execute(Unknown Source)
	at hudson.maven.MavenBuildProxy$Filter$AsyncInvoker.call(MavenBuildProxy.java:294)
	at hudson.remoting.UserRequest.perform(UserRequest.java:211)
	at hudson.remoting.UserRequest.perform(UserRequest.java:54)
	at hudson.remoting.Request$2.run(Request.java:369)
	at hudson.remoting.InterceptingExecutorService$1.call(InterceptingExecutorService.java:72)
	at org.jenkinsci.remoting.CallableDecorator.call(CallableDecorator.java:18)
	at hudson.remoting.CallableDecoratorList$1.call(CallableDecoratorList.java:21)
	at jenkins.util.ContextResettingExecutorService$2.call(ContextResettingExecutorService.java:46)
	at jenkins.security.ImpersonatingExecutorService$2.call(ImpersonatingExecutorService.java:71)
	... 4 more
	Suppressed: hudson.remoting.Channel$CallSiteStackTrace: Remote call to channel
		at hudson.remoting.Channel.attachCallSiteStackTrace(Channel.java:1788)
		at hudson.remoting.UserRequest$ExceptionResponse.retrieve(UserRequest.java:356)
		at hudson.remoting.Channel$2.adapt(Channel.java:1033)
		at hudson.remoting.Channel$2.adapt(Channel.java:1029)
		at hudson.remoting.FutureAdapter.get(FutureAdapter.java:55)
		at hudson.maven.AbstractMavenBuilder.waitForAsynchronousExecutions(AbstractMavenBuilder.java:186)
		at hudson.maven.Maven3Builder.call(Maven3Builder.java:146)
		at hudson.maven.Maven3Builder.call(Maven3Builder.java:70)
		at hudson.remoting.UserRequest.perform(UserRequest.java:211)
		at hudson.remoting.UserRequest.perform(UserRequest.java:54)
		at hudson.remoting.Request$2.run(Request.java:369)
		at hudson.remoting.InterceptingExecutorService$1.call(InterceptingExecutorService.java:72)
		... 4 more
ERROR: Asynchronous execution failure
java.util.concurrent.ExecutionException: java.io.IOException: Unexpected Fingerprint type.
Expected class hudson.model.Fingerprint or subclass but got class hudson.model.Fingerprint$RangeSet
	at hudson.remoting.Channel$2.adapt(Channel.java:1035)
	at hudson.remoting.Channel$2.adapt(Channel.java:1029)
	at hudson.remoting.FutureAdapter.get(FutureAdapter.java:55)
	at hudson.maven.AbstractMavenBuilder.waitForAsynchronousExecutions(AbstractMavenBuilder.java:186)
	at hudson.maven.Maven3Builder.call(Maven3Builder.java:146)
	at hudson.maven.Maven3Builder.call(Maven3Builder.java:70)
	at hudson.remoting.UserRequest.perform(UserRequest.java:211)
	at hudson.remoting.UserRequest.perform(UserRequest.java:54)
	at hudson.remoting.Request$2.run(Request.java:369)
	at hudson.remoting.InterceptingExecutorService$1.call(InterceptingExecutorService.java:72)
	at java.util.concurrent.FutureTask.run(FutureTask.java:266)
	at java.util.concurrent.ThreadPoolExecutor.runWorker(ThreadPoolExecutor.java:1149)
	at java.util.concurrent.ThreadPoolExecutor$Worker.run(ThreadPoolExecutor.java:624)
	at java.lang.Thread.run(Thread.java:748)
Caused by: java.io.IOException: Unexpected Fingerprint type. Expected class hudson.model.Fingerprint
or subclass but got class hudson.model.Fingerprint$RangeSet
	at hudson.model.Fingerprint.load(Fingerprint.java:1387)
	at hudson.model.Fingerprint.load(Fingerprint.java:1372)
	at hudson.model.FingerprintMap.load(FingerprintMap.java:97)
	at hudson.model.FingerprintMap.load(FingerprintMap.java:47)
	at hudson.util.KeyedDataStorage.get(KeyedDataStorage.java:161)
	at hudson.model.FingerprintMap.get(FingerprintMap.java:82)
	at hudson.model.FingerprintMap.get(FingerprintMap.java:47)
	at hudson.util.KeyedDataStorage.getOrCreate(KeyedDataStorage.java:111)
	at hudson.model.FingerprintMap.getOrCreate(FingerprintMap.java:68)
	at hudson.maven.reporters.MavenFingerprinter$PostBuildCallable.call(MavenFingerprinter.java:249)
	at hudson.maven.reporters.MavenFingerprinter$PostBuildCallable.call(MavenFingerprinter.java:236)
	at hudson.maven.MavenBuild$ProxyImpl.execute(MavenBuild.java:454)
	at hudson.maven.MavenBuild$ProxyImpl2.execute(MavenBuild.java:586)
	at sun.reflect.GeneratedMethodAccessor4078.invoke(Unknown Source)
	at sun.reflect.DelegatingMethodAccessorImpl.invoke(DelegatingMethodAccessorImpl.java:43)
	at java.lang.reflect.Method.invoke(Method.java:498)
	at hudson.model.Executor$2.call(Executor.java:932)
	at hudson.util.InterceptingProxy$1.invoke(InterceptingProxy.java:23)
	at com.sun.proxy.$Proxy209.execute(Unknown Source)
	at hudson.maven.MavenBuildProxy$Filter$AsyncInvoker.call(MavenBuildProxy.java:294)
	at hudson.remoting.UserRequest.perform(UserRequest.java:211)
	at hudson.remoting.UserRequest.perform(UserRequest.java:54)
	at hudson.remoting.Request$2.run(Request.java:369)
	at hudson.remoting.InterceptingExecutorService$1.call(InterceptingExecutorService.java:72)
	at org.jenkinsci.remoting.CallableDecorator.call(CallableDecorator.java:18)
	at hudson.remoting.CallableDecoratorList$1.call(CallableDecoratorList.java:21)
	at jenkins.util.ContextResettingExecutorService$2.call(ContextResettingExecutorService.java:46)
	at jenkins.security.ImpersonatingExecutorService$2.call(ImpersonatingExecutorService.java:71)
	... 4 more
	Suppressed: hudson.remoting.Channel$CallSiteStackTrace: Remote call to channel
		at hudson.remoting.Channel.attachCallSiteStackTrace(Channel.java:1788)
		at hudson.remoting.UserRequest$ExceptionResponse.retrieve(UserRequest.java:356)
		at hudson.remoting.Channel$2.adapt(Channel.java:1033)
		at hudson.remoting.Channel$2.adapt(Channel.java:1029)
		at hudson.remoting.FutureAdapter.get(FutureAdapter.java:55)
		at hudson.maven.AbstractMavenBuilder.waitForAsynchronousExecutions(AbstractMavenBuilder.java:186)
		at hudson.maven.Maven3Builder.call(Maven3Builder.java:146)
		at hudson.maven.Maven3Builder.call(Maven3Builder.java:70)
		at hudson.remoting.UserRequest.perform(UserRequest.java:211)
		at hudson.remoting.UserRequest.perform(UserRequest.java:54)
		at hudson.remoting.Request$2.run(Request.java:369)
		at hudson.remoting.InterceptingExecutorService$1.call(InterceptingExecutorService.java:72)
		... 4 more
[JENKINS] Archiving <https://ci-builds.apache.org/job/DB/job/Torque/job/Torque4-trunk/ws/torque4-trunk/torque-maven-plugin/pom.xml>
to org.apache.torque/torque-maven-plugin/5.1-SNAPSHOT/torque-maven-plugin-5.1-SNAPSHOT.pom
[JENKINS] Archiving <https://ci-builds.apache.org/job/DB/job/Torque/job/Torque4-trunk/ws/torque4-trunk/torque-maven-plugin/target/torque-maven-plugin-5.1-SNAPSHOT.jar>
to org.apache.torque/torque-maven-plugin/5.1-SNAPSHOT/torque-maven-plugin-5.1-SNAPSHOT.jar
[Fast Archiver] No prior successful build to compare, so performing full copy of artifacts
[JENKINS] Archiving <https://ci-builds.apache.org/job/DB/job/Torque/job/Torque4-trunk/ws/torque4-trunk/pom.xml>
to org.apache.torque/torque/5.1-SNAPSHOT/torque-5.1-SNAPSHOT.pom
[Fast Archiver] No prior successful build to compare, so performing full copy of artifacts
[JENKINS] Archiving <https://ci-builds.apache.org/job/DB/job/Torque/job/Torque4-trunk/ws/torque4-trunk/torque-site/pom.xml>
to org.apache.torque/torque-site/5.1-SNAPSHOT/torque-site-5.1-SNAPSHOT.pom
[JENKINS] Archiving <https://ci-builds.apache.org/job/DB/job/Torque/job/Torque4-trunk/ws/torque4-trunk/torque-site/target/torque-site-5.1-SNAPSHOT-site.xml>
to org.apache.torque/torque-site/5.1-SNAPSHOT/torque-site-5.1-SNAPSHOT-site.xml
[Fast Archiver] No prior successful build to compare, so performing full copy of artifacts
[JENKINS] Archiving <https://ci-builds.apache.org/job/DB/job/Torque/job/Torque4-trunk/ws/torque4-trunk/torque-generator/pom.xml>
to org.apache.torque/torque-generator/5.1-SNAPSHOT/torque-generator-5.1-SNAPSHOT.pom
[JENKINS] Archiving <https://ci-builds.apache.org/job/DB/job/Torque/job/Torque4-trunk/ws/torque4-trunk/torque-generator/target/torque-generator-5.1-SNAPSHOT.jar>
to org.apache.torque/torque-generator/5.1-SNAPSHOT/torque-generator-5.1-SNAPSHOT.jar
[Fast Archiver] No prior successful build to compare, so performing full copy of artifacts
[JENKINS] Archiving <https://ci-builds.apache.org/job/DB/job/Torque/job/Torque4-trunk/ws/torque4-trunk/torque-templates/pom.xml>
to org.apache.torque/torque-templates/5.1-SNAPSHOT/torque-templates-5.1-SNAPSHOT.pom
[JENKINS] Archiving <https://ci-builds.apache.org/job/DB/job/Torque/job/Torque4-trunk/ws/torque4-trunk/torque-templates/target/torque-templates-5.1-SNAPSHOT.jar>
to org.apache.torque/torque-templates/5.1-SNAPSHOT/torque-templates-5.1-SNAPSHOT.jar
[Fast Archiver] No prior successful build to compare, so performing full copy of artifacts
[JENKINS] Archiving <https://ci-builds.apache.org/job/DB/job/Torque/job/Torque4-trunk/ws/torque4-trunk/torque-runtime/pom.xml>
to org.apache.torque/torque-runtime/5.1-SNAPSHOT/torque-runtime-5.1-SNAPSHOT.pom
[JENKINS] Archiving <https://ci-builds.apache.org/job/DB/job/Torque/job/Torque4-trunk/ws/torque4-trunk/torque-runtime/target/torque-runtime-5.1-SNAPSHOT.jar>
to org.apache.torque/torque-runtime/5.1-SNAPSHOT/torque-runtime-5.1-SNAPSHOT.jar
[Fast Archiver] No prior successful build to compare, so performing full copy of artifacts
[JENKINS] Archiving <https://ci-builds.apache.org/job/DB/job/Torque/job/Torque4-trunk/ws/torque4-trunk/torque-ant-tasks/pom.xml>
to org.apache.torque/torque-ant-tasks/5.1-SNAPSHOT/torque-ant-tasks-5.1-SNAPSHOT.pom
[JENKINS] Archiving <https://ci-builds.apache.org/job/DB/job/Torque/job/Torque4-trunk/ws/torque4-trunk/torque-ant-tasks/target/torque-ant-tasks-5.1-SNAPSHOT.jar>
to org.apache.torque/torque-ant-tasks/5.1-SNAPSHOT/torque-ant-tasks-5.1-SNAPSHOT.jar
[Fast Archiver] No prior successful build to compare, so performing full copy of artifacts
channel stopped
[torque4-trunk] $ mvn -Powasp -Dtest=false -DfailIfNoTests=false clean verify
FATAL: command execution failed
java.io.IOException: error=2, No such file or directory
	at java.lang.UNIXProcess.forkAndExec(Native Method)
	at java.lang.UNIXProcess.<init>(UNIXProcess.java:247)
	at java.lang.ProcessImpl.start(ProcessImpl.java:134)
	at java.lang.ProcessBuilder.start(ProcessBuilder.java:1029)
Also:   hudson.remoting.Channel$CallSiteStackTrace: Remote call to H29
		at hudson.remoting.Channel.attachCallSiteStackTrace(Channel.java:1788)
		at hudson.remoting.UserRequest$ExceptionResponse.retrieve(UserRequest.java:356)
		at hudson.remoting.Channel.call(Channel.java:998)
		at hudson.Launcher$RemoteLauncher.launch(Launcher.java:1057)
		at hudson.Launcher$ProcStarter.start(Launcher.java:454)
		at hudson.Launcher$ProcStarter.join(Launcher.java:465)
		at hudson.tasks.Maven.perform(Maven.java:368)
		at hudson.tasks.BuildStepMonitor$1.perform(BuildStepMonitor.java:20)
		at hudson.model.AbstractBuild$AbstractBuildExecution.perform(AbstractBuild.java:741)
		at hudson.maven.MavenModuleSetBuild$MavenModuleSetBuildExecution.build(MavenModuleSetBuild.java:946)
		at hudson.maven.MavenModuleSetBuild$MavenModuleSetBuildExecution.doRun(MavenModuleSetBuild.java:896)
		at hudson.model.AbstractBuild$AbstractBuildExecution.run(AbstractBuild.java:504)
		at hudson.model.Run.execute(Run.java:1880)
		at hudson.maven.MavenModuleSetBuild.run(MavenModuleSetBuild.java:543)
		at hudson.model.ResourceController.execute(ResourceController.java:97)
		at hudson.model.Executor.run(Executor.java:428)
Caused: java.io.IOException: Cannot run program "mvn" (in directory "<https://ci-builds.apache.org/job/DB/job/Torque/job/Torque4-trunk/ws/torque4-trunk")>:
error=2, No such file or directory
	at java.lang.ProcessBuilder.start(ProcessBuilder.java:1048)
	at hudson.Proc$LocalProc.<init>(Proc.java:252)
	at hudson.Proc$LocalProc.<init>(Proc.java:221)
	at hudson.Launcher$LocalLauncher.launch(Launcher.java:936)
	at hudson.Launcher$ProcStarter.start(Launcher.java:454)
	at hudson.Launcher$RemoteLaunchCallable.call(Launcher.java:1316)
	at hudson.Launcher$RemoteLaunchCallable.call(Launcher.java:1269)
	at hudson.remoting.UserRequest.perform(UserRequest.java:211)
	at hudson.remoting.UserRequest.perform(UserRequest.java:54)
	at hudson.remoting.Request$2.run(Request.java:369)
	at hudson.remoting.InterceptingExecutorService$1.call(InterceptingExecutorService.java:72)
	at java.util.concurrent.FutureTask.run(FutureTask.java:266)
	at java.util.concurrent.ThreadPoolExecutor.runWorker(ThreadPoolExecutor.java:1149)
	at java.util.concurrent.ThreadPoolExecutor$Worker.run(ThreadPoolExecutor.java:624)
	at java.lang.Thread.run(Thread.java:748)
Build step 'Invoke top-level Maven targets' marked build as failure

---------------------------------------------------------------------
To unsubscribe, e-mail: torque-dev-unsubscribe@db.apache.org
For additional commands, e-mail: torque-dev-help@db.apache.org


Mime
View raw message