falcon-dev mailing list archives

Site index · List index
Message view « Date » · « Thread »
Top « Date » · « Thread »
From Apache Jenkins Server <jenk...@builds.apache.org>
Subject Build failed in Jenkins: Apache-falcon #352
Date Fri, 25 Jul 2014 00:28:04 GMT
See <https://builds.apache.org/job/Apache-falcon/352/changes>

Changes:

[srikanth.sundarrajan] FALCON-554 Extend time functions available in Falcon to support current
& last week. Contributed by Srikanth Sundarrajan)

------------------------------------------
[...truncated 356 lines...]
96/96 KB   54/54 KB   55/55 KB   62/70 KB   
96/96 KB   54/54 KB   55/55 KB   62/70 KB   1/37 KB   
96/96 KB   54/54 KB   55/55 KB   62/70 KB   5/37 KB   
96/96 KB   54/54 KB   55/55 KB   62/70 KB   9/37 KB   
96/96 KB   54/54 KB   55/55 KB   62/70 KB   13/37 KB   
96/96 KB   54/54 KB   55/55 KB   62/70 KB   16/37 KB   
96/96 KB   54/54 KB   55/55 KB   64/70 KB   16/37 KB   
96/96 KB   54/54 KB   55/55 KB   68/70 KB   16/37 KB   
96/96 KB   54/54 KB   55/55 KB   70/70 KB   16/37 KB   
                                                       
Downloaded: http://repo.maven.apache.org/maven2/org/apache/maven/scm/maven-scm-provider-gitexe/1.5/maven-scm-provider-gitexe-1.5.jar
(55 KB at 298.0 KB/sec)
Downloading: http://repo.maven.apache.org/maven2/org/apache/maven/scm/maven-scm-provider-svn-commons/1.5/maven-scm-provider-svn-commons-1.5.jar
                                                       
Downloaded: http://repo.maven.apache.org/maven2/org/apache/maven/scm/maven-scm-api/1.5/maven-scm-api-1.5.jar
(96 KB at 507.9 KB/sec)
Downloading: http://repo.maven.apache.org/maven2/org/apache/maven/scm/maven-scm-provider-cvsexe/1.5/maven-scm-provider-cvsexe-1.5.jar
54/54 KB   70/70 KB   17/37 KB                         
54/54 KB   70/70 KB   21/37 KB   
54/54 KB   70/70 KB   25/37 KB   
54/54 KB   70/70 KB   29/37 KB   
54/54 KB   70/70 KB   33/37 KB   
54/54 KB   70/70 KB   35/37 KB   
                                 
Downloaded: http://repo.maven.apache.org/maven2/org/apache/maven/scm/maven-scm-provider-bazaar/1.5/maven-scm-provider-bazaar-1.5.jar
(54 KB at 265.3 KB/sec)
Downloading: http://repo.maven.apache.org/maven2/org/apache/maven/scm/maven-scm-provider-cvs-commons/1.5/maven-scm-provider-cvs-commons-1.5.jar
                                 
Downloaded: http://repo.maven.apache.org/maven2/org/apache/maven/scm/maven-scm-provider-svnexe/1.5/maven-scm-provider-svnexe-1.5.jar
(70 KB at 325.0 KB/sec)
Downloading: http://repo.maven.apache.org/maven2/org/apache/maven/scm/maven-scm-provider-starteam/1.5/maven-scm-provider-starteam-1.5.jar
3/40 KB   35/37 KB               
3/40 KB   37/37 KB   
7/40 KB   37/37 KB   
11/40 KB   37/37 KB   
1/30 KB   11/40 KB   37/37 KB   
5/30 KB   11/40 KB   37/37 KB   
5/30 KB   15/40 KB   37/37 KB   
9/30 KB   15/40 KB   37/37 KB   
9/30 KB   19/40 KB   37/37 KB   
13/30 KB   19/40 KB   37/37 KB   
13/30 KB   23/40 KB   37/37 KB   
17/30 KB   23/40 KB   37/37 KB   
17/30 KB   27/40 KB   37/37 KB   
21/30 KB   27/40 KB   37/37 KB   
21/30 KB   27/40 KB   37/37 KB   
25/30 KB   27/40 KB   37/37 KB   
28/30 KB   27/40 KB   37/37 KB   
28/30 KB   27/40 KB   3/79 KB   37/37 KB   
28/30 KB   27/40 KB   7/79 KB   37/37 KB   
28/30 KB   27/40 KB   11/79 KB   37/37 KB   
28/30 KB   27/40 KB   15/79 KB   37/37 KB   
28/30 KB   27/40 KB   19/79 KB   37/37 KB   
28/30 KB   27/40 KB   23/79 KB   37/37 KB   
28/30 KB   27/40 KB   27/79 KB   37/37 KB   
28/30 KB   27/40 KB   31/79 KB   37/37 KB   
28/30 KB   27/40 KB   35/79 KB   37/37 KB   
28/30 KB   27/40 KB   38/79 KB   37/37 KB   
28/30 KB   27/40 KB   1/73 KB   38/79 KB   37/37 KB   
28/30 KB   27/40 KB   5/73 KB   38/79 KB   37/37 KB   
28/30 KB   27/40 KB   9/73 KB   38/79 KB   37/37 KB   
28/30 KB   27/40 KB   13/73 KB   38/79 KB   37/37 KB   
28/30 KB   28/40 KB   13/73 KB   38/79 KB   37/37 KB   
28/30 KB   32/40 KB   13/73 KB   38/79 KB   37/37 KB   
28/30 KB   32/40 KB   17/73 KB   38/79 KB   37/37 KB   
28/30 KB   36/40 KB   17/73 KB   38/79 KB   37/37 KB   
30/30 KB   36/40 KB   17/73 KB   38/79 KB   37/37 KB   
30/30 KB   36/40 KB   21/73 KB   38/79 KB   37/37 KB   
30/30 KB   40/40 KB   21/73 KB   38/79 KB   37/37 KB   
30/30 KB   40/40 KB   25/73 KB   38/79 KB   37/37 KB   
30/30 KB   40/40 KB   29/73 KB   38/79 KB   37/37 KB   
30/30 KB   40/40 KB   33/73 KB   38/79 KB   37/37 KB   
                                                       
Downloaded: http://repo.maven.apache.org/maven2/org/apache/maven/scm/maven-scm-provider-git-commons/1.5/maven-scm-provider-git-commons-1.5.jar
(37 KB at 250.3 KB/sec)
Downloading: http://repo.maven.apache.org/maven2/org/apache/maven/scm/maven-scm-provider-clearcase/1.5/maven-scm-provider-clearcase-1.5.jar
30/30 KB   40/40 KB   33/73 KB   40/79 KB              
30/30 KB   40/40 KB   33/73 KB   43/79 KB   
30/30 KB   40/40 KB   33/73 KB   44/79 KB   
30/30 KB   40/40 KB   33/73 KB   48/79 KB   
30/30 KB   40/40 KB   33/73 KB   52/79 KB   
30/30 KB   40/40 KB   33/73 KB   56/79 KB   
30/30 KB   40/40 KB   33/73 KB   60/79 KB   
30/30 KB   40/40 KB   33/73 KB   64/79 KB   
30/30 KB   40/40 KB   33/73 KB   68/79 KB   
30/30 KB   40/40 KB   33/73 KB   72/79 KB   
30/30 KB   40/40 KB   33/73 KB   76/79 KB   
30/30 KB   40/40 KB   33/73 KB   79/79 KB   
30/30 KB   40/40 KB   37/73 KB   79/79 KB   
30/30 KB   40/40 KB   41/73 KB   79/79 KB   
30/30 KB   40/40 KB   45/73 KB   79/79 KB   
30/30 KB   40/40 KB   49/73 KB   79/79 KB   
30/30 KB   40/40 KB   53/73 KB   79/79 KB   
30/30 KB   40/40 KB   57/73 KB   79/79 KB   
30/30 KB   40/40 KB   61/73 KB   79/79 KB   
30/30 KB   40/40 KB   65/73 KB   79/79 KB   
30/30 KB   40/40 KB   67/73 KB   79/79 KB   
                                            
Downloaded: http://repo.maven.apache.org/maven2/org/apache/maven/scm/maven-scm-provider-cvsexe/1.5/maven-scm-provider-cvsexe-1.5.jar
(30 KB at 262.4 KB/sec)
Downloading: http://repo.maven.apache.org/maven2/org/apache/maven/scm/maven-scm-provider-perforce/1.5/maven-scm-provider-perforce-1.5.jar
                                            
Downloaded: http://repo.maven.apache.org/maven2/org/apache/maven/scm/maven-scm-provider-svn-commons/1.5/maven-scm-provider-svn-commons-1.5.jar
(40 KB at 348.3 KB/sec)
Downloading: http://repo.maven.apache.org/maven2/org/apache/maven/scm/maven-scm-provider-hg/1.5/maven-scm-provider-hg-1.5.jar
4/70 KB   67/73 KB   79/79 KB               
8/70 KB   67/73 KB   79/79 KB   
12/70 KB   67/73 KB   79/79 KB   
16/70 KB   67/73 KB   79/79 KB   
20/70 KB   67/73 KB   79/79 KB   
21/70 KB   67/73 KB   79/79 KB   
                                 
Downloaded: http://repo.maven.apache.org/maven2/org/apache/maven/scm/maven-scm-provider-cvs-commons/1.5/maven-scm-provider-cvs-commons-1.5.jar
(79 KB at 662.1 KB/sec)
Downloading: http://repo.maven.apache.org/maven2/com/google/code/maven-scm-provider-svnjava/maven-scm-provider-svnjava/1.13/maven-scm-provider-svnjava-1.13.jar
21/70 KB   68/73 KB              
21/70 KB   72/73 KB   
21/70 KB   73/73 KB   
21/70 KB   1/80 KB   73/73 KB   
21/70 KB   5/80 KB   73/73 KB   
25/70 KB   5/80 KB   73/73 KB   
25/70 KB   9/80 KB   73/73 KB   
25/70 KB   1/64 KB   9/80 KB   73/73 KB   
25/70 KB   5/64 KB   9/80 KB   73/73 KB   
25/70 KB   5/64 KB   13/80 KB   73/73 KB   
29/70 KB   5/64 KB   13/80 KB   73/73 KB   
29/70 KB   9/64 KB   13/80 KB   73/73 KB   
33/70 KB   9/64 KB   13/80 KB   73/73 KB   
33/70 KB   9/64 KB   17/80 KB   73/73 KB   
33/70 KB   13/64 KB   17/80 KB   73/73 KB   
37/70 KB   13/64 KB   17/80 KB   73/73 KB   
37/70 KB   13/64 KB   21/80 KB   73/73 KB   
37/70 KB   17/64 KB   21/80 KB   73/73 KB   
41/70 KB   17/64 KB   21/80 KB   73/73 KB   
41/70 KB   17/64 KB   25/80 KB   73/73 KB   
41/70 KB   21/64 KB   25/80 KB   73/73 KB   
45/70 KB   21/64 KB   25/80 KB   73/73 KB   
48/70 KB   25/64 KB   25/80 KB   73/73 KB   
48/70 KB   25/64 KB   25/80 KB   73/73 KB   
48/70 KB   25/64 KB   29/80 KB   73/73 KB   
48/70 KB   29/64 KB   29/80 KB   73/73 KB   
48/70 KB   29/64 KB   30/80 KB   73/73 KB   
48/70 KB   30/64 KB   30/80 KB   73/73 KB   
                                            
Downloaded: http://repo.maven.apache.org/maven2/org/apache/maven/scm/maven-scm-provider-starteam/1.5/maven-scm-provider-starteam-1.5.jar
(73 KB at 494.2 KB/sec)
Downloading: http://repo.maven.apache.org/maven2/org/tmatesoft/svnkit/svnkit/1.3.5/svnkit-1.3.5.jar
48/70 KB   30/64 KB   31/80 KB              
48/70 KB   34/64 KB   31/80 KB   
48/70 KB   34/64 KB   35/80 KB   
48/70 KB   37/64 KB   35/80 KB   
48/70 KB   37/64 KB   39/80 KB   
48/70 KB   37/64 KB   43/80 KB   
48/70 KB   37/64 KB   47/80 KB   
48/70 KB   41/64 KB   47/80 KB   
48/70 KB   41/64 KB   51/80 KB   
50/70 KB   41/64 KB   51/80 KB   
50/70 KB   45/64 KB   51/80 KB   
50/70 KB   45/64 KB   55/80 KB   
54/70 KB   45/64 KB   55/80 KB   
54/70 KB   49/64 KB   55/80 KB   
54/70 KB   49/64 KB   59/80 KB   
55/70 KB   49/64 KB   59/80 KB   
55/70 KB   53/64 KB   61/80 KB   
55/70 KB   53/64 KB   61/80 KB   
55/70 KB   57/64 KB   61/80 KB   
57/70 KB   57/64 KB   61/80 KB   
57/70 KB   61/64 KB   61/80 KB   
61/70 KB   61/64 KB   61/80 KB   
61/70 KB   62/64 KB   61/80 KB   
65/70 KB   62/64 KB   61/80 KB   
69/70 KB   62/64 KB   61/80 KB   
70/70 KB   62/64 KB   61/80 KB   
70/70 KB   64/64 KB   61/80 KB   
70/70 KB   64/64 KB   64/80 KB   
70/70 KB   64/64 KB   68/80 KB   
70/70 KB   64/64 KB   72/80 KB   
70/70 KB   64/64 KB   76/80 KB   
70/70 KB   64/64 KB   80/80 KB   
70/70 KB   64/64 KB   80/80 KB   
                                 
Downloaded: http://repo.maven.apache.org/maven2/org/apache/maven/scm/maven-scm-provider-clearcase/1.5/maven-scm-provider-clearcase-1.5.jar
(70 KB at 468.9 KB/sec)
Downloading: http://repo.maven.apache.org/maven2/org/tmatesoft/svnkit/trilead-ssh2/build213-svnkit-1.3-patch/trilead-ssh2-build213-svnkit-1.3-patch.jar
                                 
Downloaded: http://repo.maven.apache.org/maven2/org/apache/maven/scm/maven-scm-provider-hg/1.5/maven-scm-provider-hg-1.5.jar
(64 KB at 438.5 KB/sec)
Downloading: http://repo.maven.apache.org/maven2/org/tmatesoft/sqljet/sqljet/1.0.4/sqljet-1.0.4.jar
                                 
Downloaded: http://repo.maven.apache.org/maven2/org/apache/maven/scm/maven-scm-provider-perforce/1.5/maven-scm-provider-perforce-1.5.jar
(80 KB at 541.1 KB/sec)
Downloading: http://repo.maven.apache.org/maven2/org/antlr/antlr-runtime/3.1.3/antlr-runtime-3.1.3.jar
                                 
Downloaded: http://repo.maven.apache.org/maven2/com/google/code/maven-scm-provider-svnjava/maven-scm-provider-svnjava/1.13/maven-scm-provider-svnjava-1.13.jar
(0 B at 0.0 KB/sec)
Downloading: http://repo.maven.apache.org/maven2/org/antlr/stringtemplate/3.2/stringtemplate-3.2.jar
                                 
Downloading: http://repo.maven.apache.org/maven2/net/java/dev/jna/jna/3.2.2/jna-3.2.2.jar
                                 
                                 
Downloaded: http://repo.maven.apache.org/maven2/org/antlr/stringtemplate/3.2/stringtemplate-3.2.jar
(0 B at 0.0 KB/sec)
                                 
Downloaded: http://repo.maven.apache.org/maven2/net/java/dev/jna/jna/3.2.2/jna-3.2.2.jar (0
B at 0.0 KB/sec)
                                 
Downloaded: http://repo.maven.apache.org/maven2/org/tmatesoft/svnkit/svnkit/1.3.5/svnkit-1.3.5.jar
(0 B at 0.0 KB/sec)
                                 
Downloaded: http://repo.maven.apache.org/maven2/org/antlr/antlr-runtime/3.1.3/antlr-runtime-3.1.3.jar
(0 B at 0.0 KB/sec)
Downloading: http://antlr.org/antlr-snapshot/org/antlr/stringtemplate/3.2/stringtemplate-3.2.jar
                                 
Downloaded: http://antlr.org/antlr-snapshot/org/antlr/stringtemplate/3.2/stringtemplate-3.2.jar
(0 B at 0.0 KB/sec)
[INFO] ------------------------------------------------------------------------
[INFO] Reactor Summary:
[INFO] 
[INFO] Checkstyle ........................................ SUCCESS [  1.092 s]
[INFO] Apache Falcon ..................................... FAILURE [ 29.713 s]
[INFO] Build Tools ....................................... SKIPPED
[INFO] Apache Falcon CLI client .......................... SKIPPED
[INFO] Apache Falcon Metrics ............................. SKIPPED
[INFO] Apache Falcon Hadoop Dependencies ................. SKIPPED
[INFO] Apache Falcon Test Utility ........................ SKIPPED
[INFO] Apache Falcon Commons ............................. SKIPPED
[INFO] Apache Falcon Oozie EL Extension .................. SKIPPED
[INFO] Apache Falcon Embedded Hadoop - Test Cluster ...... SKIPPED
[INFO] Apache Falcon Messaging ........................... SKIPPED
[INFO] Apache Falcon Oozie Adaptor ....................... SKIPPED
[INFO] Apache Falcon Acquisition ......................... SKIPPED
[INFO] Apache Falcon Replication ......................... SKIPPED
[INFO] Apache Falcon Retention ........................... SKIPPED
[INFO] Apache Falcon Archival ............................ SKIPPED
[INFO] Apache Falcon Rerun ............................... SKIPPED
[INFO] Apache Falcon Prism ............................... SKIPPED
[INFO] Apache Falcon Web Application ..................... SKIPPED
[INFO] Apache Falcon Documentation ....................... SKIPPED
[INFO] ------------------------------------------------------------------------
[INFO] BUILD FAILURE
[INFO] ------------------------------------------------------------------------
[INFO] Total time: 31.516 s
[INFO] Finished at: 2014-07-25T00:26:14+00:00
[INFO] Final Memory: 15M/723M
[INFO] ------------------------------------------------------------------------
[ERROR] Failed to execute goal org.codehaus.mojo:buildnumber-maven-plugin:1.0:create (default)
on project falcon-main: Execution default of goal org.codehaus.mojo:buildnumber-maven-plugin:1.0:create
failed: Plugin org.codehaus.mojo:buildnumber-maven-plugin:1.0 or one of its dependencies could
not be resolved: The following artifacts could not be resolved: org.tmatesoft.svnkit:trilead-ssh2:jar:build213-svnkit-1.3-patch,
org.tmatesoft.sqljet:sqljet:jar:1.0.4: Could not transfer artifact org.tmatesoft.svnkit:trilead-ssh2:jar:build213-svnkit-1.3-patch
from/to central (http://repo.maven.apache.org/maven2): Failed to transfer file: http://repo.maven.apache.org/maven2/org/tmatesoft/svnkit/trilead-ssh2/build213-svnkit-1.3-patch/trilead-ssh2-build213-svnkit-1.3-patch.jar.
Return code is: 503, ReasonPhrase: Backend is unhealthy. -> [Help 1]
[ERROR] 
[ERROR] To see the full stack trace of the errors, re-run Maven with the -e switch.
[ERROR] Re-run Maven using the -X switch to enable full debug logging.
[ERROR] 
[ERROR] For more information about the errors and possible solutions, please read the following
articles:
[ERROR] [Help 1] http://cwiki.apache.org/confluence/display/MAVEN/PluginResolutionException
[ERROR] 
[ERROR] After correcting the problems, you can resume the build with the command
[ERROR]   mvn <goals> -rf :falcon-main
Build step 'Execute shell' marked build as failure
[CHECKSTYLE] Collecting checkstyle analysis files...
[CHECKSTYLE] Finding all files that match the pattern **/target/checkstyle-result.xml
[CHECKSTYLE] Computing warning deltas based on reference build #334
[FINDBUGS] Collecting findbugs analysis files...
[FINDBUGS] Finding all files that match the pattern **/target/findbugs.xml
[FINDBUGS] Computing warning deltas based on reference build #334
Archiving artifacts
Recording test results
TestNG Reports Processing: START
Looking for TestNG results report in workspace using pattern: **/target/testng-results.xml
Did not find any matching files.

Mime
View raw message