flink-issues mailing list archives

Site index · List index
Message view « Date » · « Thread »
Top « Date » · « Thread »
From "Guowei Ma (Jira)" <j...@apache.org>
Subject [jira] [Commented] (FLINK-22457) KafkaSourceLegacyITCase.testMultipleSourcesOnePartition fails because of timeout
Date Mon, 10 May 2021 06:21:00 GMT

    [ https://issues.apache.org/jira/browse/FLINK-22457?page=com.atlassian.jira.plugin.system.issuetabpanels:comment-tabpanel&focusedCommentId=17341690#comment-17341690
] 

Guowei Ma commented on FLINK-22457:
-----------------------------------

https://dev.azure.com/apache-flink/apache-flink/_build/results?buildId=17761&view=logs&j=1fc6e7bf-633c-5081-c32a-9dea24b05730&t=80a658d1-f7f6-5d93-2758-53ac19fd5b19&l=7045

> KafkaSourceLegacyITCase.testMultipleSourcesOnePartition fails because of timeout
> --------------------------------------------------------------------------------
>
>                 Key: FLINK-22457
>                 URL: https://issues.apache.org/jira/browse/FLINK-22457
>             Project: Flink
>          Issue Type: Bug
>          Components: Connectors / Kafka
>    Affects Versions: 1.13.0, 1.14.0
>            Reporter: Guowei Ma
>            Priority: Major
>              Labels: test-stability
>
> https://dev.azure.com/apache-flink/apache-flink/_build/results?buildId=17140&view=logs&j=1fc6e7bf-633c-5081-c32a-9dea24b05730&t=80a658d1-f7f6-5d93-2758-53ac19fd5b19&l=7045
> {code:java}
> Apr 24 23:47:33 [ERROR] Tests run: 21, Failures: 0, Errors: 1, Skipped: 0, Time elapsed:
174.335 s <<< FAILURE! - in org.apache.flink.connector.kafka.source.KafkaSourceLegacyITCase
> Apr 24 23:47:33 [ERROR] testMultipleSourcesOnePartition(org.apache.flink.connector.kafka.source.KafkaSourceLegacyITCase)
 Time elapsed: 60.019 s  <<< ERROR!
> Apr 24 23:47:33 org.junit.runners.model.TestTimedOutException: test timed out after 60000
milliseconds
> Apr 24 23:47:33 	at sun.misc.Unsafe.park(Native Method)
> Apr 24 23:47:33 	at java.util.concurrent.locks.LockSupport.park(LockSupport.java:175)
> Apr 24 23:47:33 	at java.util.concurrent.CompletableFuture$Signaller.block(CompletableFuture.java:1707)
> Apr 24 23:47:33 	at java.util.concurrent.ForkJoinPool.managedBlock(ForkJoinPool.java:3323)
> Apr 24 23:47:33 	at java.util.concurrent.CompletableFuture.waitingGet(CompletableFuture.java:1742)
> Apr 24 23:47:33 	at java.util.concurrent.CompletableFuture.get(CompletableFuture.java:1908)
> Apr 24 23:47:33 	at org.apache.flink.test.util.TestUtils.tryExecute(TestUtils.java:49)
> Apr 24 23:47:33 	at org.apache.flink.streaming.connectors.kafka.KafkaConsumerTestBase.runMultipleSourcesOnePartitionExactlyOnceTest(KafkaConsumerTestBase.java:1112)
> Apr 24 23:47:33 	at org.apache.flink.connector.kafka.source.KafkaSourceLegacyITCase.testMultipleSourcesOnePartition(KafkaSourceLegacyITCase.java:87)
> Apr 24 23:47:33 	at sun.reflect.NativeMethodAccessorImpl.invoke0(Native Method)
> Apr 24 23:47:33 	at sun.reflect.NativeMethodAccessorImpl.invoke(NativeMethodAccessorImpl.java:62)
> Apr 24 23:47:33 	at sun.reflect.DelegatingMethodAccessorImpl.invoke(DelegatingMethodAccessorImpl.java:43)
> Apr 24 23:47:33 	at java.lang.reflect.Method.invoke(Method.java:498)
> Apr 24 23:47:33 	at org.junit.runners.model.FrameworkMethod$1.runReflectiveCall(FrameworkMethod.java:50)
> Apr 24 23:47:33 	at org.junit.internal.runners.model.ReflectiveCallable.run(ReflectiveCallable.java:12)
> Apr 24 23:47:33 	at org.junit.runners.model.FrameworkMethod.invokeExplosively(FrameworkMethod.java:47)
> Apr 24 23:47:33 	at org.junit.internal.runners.statements.InvokeMethod.evaluate(InvokeMethod.java:17)
> Apr 24 23:47:33 	at org.junit.internal.runners.statements.FailOnTimeout$CallableStatement.call(FailOnTimeout.java:298)
> Apr 24 23:47:33 	at org.junit.internal.runners.statements.FailOnTimeout$CallableStatement.call(FailOnTimeout.java:292)
> Apr 24 23:47:33 	at java.util.concurrent.FutureTask.run(FutureTask.java:266)
> Apr 24 23:47:33 	at java.lang.Thread.run(Thread.java:748)
> {code}



--
This message was sent by Atlassian Jira
(v8.3.4#803005)

Mime
View raw message