gora-dev mailing list archives

Site index · List index
Message view « Date » · « Thread »
Top « Date » · « Thread »
From Apache Jenkins Server <jenk...@builds.apache.org>
Subject Build failed in Jenkins: gora-trunk #330
Date Sun, 01 Jul 2012 06:06:33 GMT
See <https://builds.apache.org/job/gora-trunk/330/>

------------------------------------------
[...truncated 13775 lines...]
[INFO] Copying ftpserver-core-1.0.0.jar to <https://builds.apache.org/job/gora-trunk/ws/trunk./gora-tutorial/lib/ftpserver-core-1.0.0.jar>
[INFO] Copying xml-apis-1.3.02.jar to <https://builds.apache.org/job/gora-trunk/ws/trunk./gora-tutorial/lib/xml-apis-1.3.02.jar>
[INFO] Copying spring-aop-3.0.6.RELEASE.jar to <https://builds.apache.org/job/gora-trunk/ws/trunk./gora-tutorial/lib/spring-aop-3.0.6.RELEASE.jar>
[INFO] Copying jersey-core-1.4.jar to <https://builds.apache.org/job/gora-trunk/ws/trunk./gora-tutorial/lib/jersey-core-1.4.jar>
[INFO] Copying speed4j-0.9.jar to <https://builds.apache.org/job/gora-trunk/ws/trunk./gora-tutorial/lib/speed4j-0.9.jar>
[INFO] Copying paranamer-2.2.jar to <https://builds.apache.org/job/gora-trunk/ws/trunk./gora-tutorial/lib/paranamer-2.2.jar>
[INFO] Copying jsr305-1.3.9.jar to <https://builds.apache.org/job/gora-trunk/ws/trunk./gora-tutorial/lib/jsr305-1.3.9.jar>
[INFO] Copying mysql-connector-java-5.1.18.jar to <https://builds.apache.org/job/gora-trunk/ws/trunk./gora-tutorial/lib/mysql-connector-java-5.1.18.jar>
[INFO] Copying servlet-api-2.5-6.1.14.jar to <https://builds.apache.org/job/gora-trunk/ws/trunk./gora-tutorial/lib/servlet-api-2.5-6.1.14.jar>
[INFO] Copying paranamer-ant-2.2.jar to <https://builds.apache.org/job/gora-trunk/ws/trunk./gora-tutorial/lib/paranamer-ant-2.2.jar>
[INFO] Copying ftplet-api-1.0.0.jar to <https://builds.apache.org/job/gora-trunk/ws/trunk./gora-tutorial/lib/ftplet-api-1.0.0.jar>
[INFO] Copying spring-core-3.0.6.RELEASE.jar to <https://builds.apache.org/job/gora-trunk/ws/trunk./gora-tutorial/lib/spring-core-3.0.6.RELEASE.jar>
[INFO] Copying jaxen-1.1.3.jar to <https://builds.apache.org/job/gora-trunk/ws/trunk./gora-tutorial/lib/jaxen-1.1.3.jar>
[INFO] Copying gora-core-0.3-SNAPSHOT.jar to <https://builds.apache.org/job/gora-trunk/ws/trunk./gora-tutorial/lib/gora-core-0.3-SNAPSHOT.jar>
[INFO] Copying jsp-api-2.1-6.1.14.jar to <https://builds.apache.org/job/gora-trunk/ws/trunk./gora-tutorial/lib/jsp-api-2.1-6.1.14.jar>
[INFO] Copying jasper-runtime-5.5.12.jar to <https://builds.apache.org/job/gora-trunk/ws/trunk./gora-tutorial/lib/jasper-runtime-5.5.12.jar>
[INFO] Copying commons-collections-3.2.1.jar to <https://builds.apache.org/job/gora-trunk/ws/trunk./gora-tutorial/lib/commons-collections-3.2.1.jar>
[INFO] Copying xercesImpl-2.9.1.jar to <https://builds.apache.org/job/gora-trunk/ws/trunk./gora-tutorial/lib/xercesImpl-2.9.1.jar>
[INFO] Copying jackson-mapper-asl-1.4.2.jar to <https://builds.apache.org/job/gora-trunk/ws/trunk./gora-tutorial/lib/jackson-mapper-asl-1.4.2.jar>
[INFO] Copying qdox-1.10.1.jar to <https://builds.apache.org/job/gora-trunk/ws/trunk./gora-tutorial/lib/qdox-1.10.1.jar>
[INFO] Copying ant-launcher-1.7.1.jar to <https://builds.apache.org/job/gora-trunk/ws/trunk./gora-tutorial/lib/ant-launcher-1.7.1.jar>
[INFO] Copying paranamer-generator-2.2.jar to <https://builds.apache.org/job/gora-trunk/ws/trunk./gora-tutorial/lib/paranamer-generator-2.2.jar>
[INFO] Copying cxf-common-utilities-2.5.2.jar to <https://builds.apache.org/job/gora-trunk/ws/trunk./gora-tutorial/lib/cxf-common-utilities-2.5.2.jar>
[INFO] Copying commons-configuration-1.6.jar to <https://builds.apache.org/job/gora-trunk/ws/trunk./gora-tutorial/lib/commons-configuration-1.6.jar>
[INFO] Copying jackson-core-asl-1.4.2.jar to <https://builds.apache.org/job/gora-trunk/ws/trunk./gora-tutorial/lib/jackson-core-asl-1.4.2.jar>
[INFO] Copying slf4j-simple-1.5.8.jar to <https://builds.apache.org/job/gora-trunk/ws/trunk./gora-tutorial/lib/slf4j-simple-1.5.8.jar>
[INFO] Copying commons-math-2.1.jar to <https://builds.apache.org/job/gora-trunk/ws/trunk./gora-tutorial/lib/commons-math-2.1.jar>
[INFO] Copying jdom-1.0.jar to <https://builds.apache.org/job/gora-trunk/ws/trunk./gora-tutorial/lib/jdom-1.0.jar>
[INFO] Copying jruby-complete-1.6.0.jar to <https://builds.apache.org/job/gora-trunk/ws/trunk./gora-tutorial/lib/jruby-complete-1.6.0.jar>
[INFO] Copying wsdl4j-1.6.2.jar to <https://builds.apache.org/job/gora-trunk/ws/trunk./gora-tutorial/lib/wsdl4j-1.6.2.jar>
[INFO] Copying jetty-6.1.26.jar to <https://builds.apache.org/job/gora-trunk/ws/trunk./gora-tutorial/lib/jetty-6.1.26.jar>
[INFO] Copying protobuf-java-2.3.0.jar to <https://builds.apache.org/job/gora-trunk/ws/trunk./gora-tutorial/lib/protobuf-java-2.3.0.jar>
mojoSucceeded org.apache.maven.plugins:maven-dependency-plugin:2.4(default)
mojoStarted org.apache.maven.plugins:maven-jar-plugin:2.4(default)
[INFO] 
[INFO] --- maven-jar-plugin:2.4:jar (default) @ gora-tutorial ---
[INFO] Building jar: <https://builds.apache.org/job/gora-trunk/ws/trunk./gora-tutorial/target/gora-tutorial-0.3-SNAPSHOT.jar>
[INFO] META-INF/maven/org.apache.gora/gora-tutorial/pom.xml already added, skipping
[INFO] META-INF/maven/org.apache.gora/gora-tutorial/pom.properties already added, skipping
mojoSucceeded org.apache.maven.plugins:maven-jar-plugin:2.4(default)
mojoStarted org.apache.maven.plugins:maven-jar-plugin:2.4(default)
[INFO] [INFO] Building jar: <https://builds.apache.org/job/gora-trunk/ws/trunk./gora-tutorial/target/gora-tutorial-0.3-SNAPSHOT-tests.jar>

[INFO] --- maven-jar-plugin:2.4:test-jar (default) @ gora-tutorial ---
mojoSucceeded org.apache.maven.plugins:maven-jar-plugin:2.4(default)
mojoStarted org.apache.maven.plugins:maven-install-plugin:2.3.1(default-install)[INFO] Installing
<https://builds.apache.org/job/gora-trunk/ws/trunk./gora-tutorial/target/gora-tutorial-0.3-SNAPSHOT.jar>
to /home/hudson/hudson-slave/maven-repositories/0/org/apache/gora/gora-tutorial/0.3-SNAPSHOT/gora-tutorial-0.3-SNAPSHOT.jar

[INFO] 
[INFO] --- maven-install-plugin:2.3.1:install (default-install) @ gora-tutorial ---
[INFO] Installing <https://builds.apache.org/job/gora-trunk/ws/trunk./gora-tutorial/pom.xml>
to /home/hudson/hudson-slave/maven-repositories/0/org/apache/gora/gora-tutorial/0.3-SNAPSHOT/gora-tutorial-0.3-SNAPSHOT.pom
[INFO] Installing <https://builds.apache.org/job/gora-trunk/ws/trunk./gora-tutorial/target/gora-tutorial-0.3-SNAPSHOT-tests.jar>
to /home/hudson/hudson-slave/maven-repositories/0/org/apache/gora/gora-tutorial/0.3-SNAPSHOT/gora-tutorial-0.3-SNAPSHOT-tests.jar
mojoSucceeded org.apache.maven.plugins:maven-install-plugin:2.3.1(default-install)
mojoStarted org.apache.felix:maven-bundle-plugin:2.3.7(default-install)
[INFO] 
[INFO] --- maven-bundle-plugin:2.3.7:install (default-install) @ gora-tutorial ---
[INFO] Installing org/apache/gora/gora-tutorial/0.3-SNAPSHOT/gora-tutorial-0.3-SNAPSHOT.jar
[INFO] Writing OBR metadata
mojoSucceeded org.apache.felix:maven-bundle-plugin:2.3.7(default-install)
projectSucceeded org.apache.gora:gora-tutorial:0.3-SNAPSHOT
projectStarted org.apache.gora:sources-dist:0.3-SNAPSHOT
[INFO]                                                                         
[INFO] ------------------------------------------------------------------------
[INFO] Building Apache Gora :: Sources-Dist 0.3-SNAPSHOT
[INFO] ------------------------------------------------------------------------
mojoStarted org.apache.maven.plugins:maven-remote-resources-plugin:1.2.1(default)
[INFO] 
[INFO] --- maven-remote-resources-plugin:1.2.1:process (default) @ sources-dist ---
mojoSucceeded org.apache.maven.plugins:maven-remote-resources-plugin:1.2.1(default)
mojoStarted org.apache.maven.plugins:maven-resources-plugin:2.5(default-resources)[debug]
execute contextualize
[INFO] Using 'UTF-8' encoding to copy filtered resources.
[INFO] skip non existing resourceDirectory <https://builds.apache.org/job/gora-trunk/ws/trunk./sources-dist/src/main/resources>
[INFO] Copying 3 resources

[INFO] 
[INFO] --- maven-resources-plugin:2.5:resources (default-resources) @ sources-dist ---
mojoSucceeded org.apache.maven.plugins:maven-resources-plugin:2.5(default-resources)
mojoStarted org.apache.maven.plugins:maven-compiler-plugin:2.3.2(default-compile)[INFO] No
sources to compile

[INFO] 
[INFO] --- maven-compiler-plugin:2.3.2:compile (default-compile) @ sources-dist ---
mojoSucceeded org.apache.maven.plugins:maven-compiler-plugin:2.3.2(default-compile)
mojoStarted org.apache.felix:maven-bundle-plugin:2.3.7(bundle-manifest)
[INFO] 
[INFO] --- maven-bundle-plugin:2.3.7:manifest (bundle-manifest) @ sources-dist ---
mojoSucceeded org.apache.felix:maven-bundle-plugin:2.3.7(bundle-manifest)
mojoStarted org.apache.maven.plugins:maven-resources-plugin:2.5(default-testResources)[debug]
execute contextualize
[INFO] Using 'UTF-8' encoding to copy filtered resources.
[INFO] skip non existing resourceDirectory <https://builds.apache.org/job/gora-trunk/ws/trunk./sources-dist/src/test/resources>
[INFO] Copying 3 resources

[INFO] 
[INFO] --- maven-resources-plugin:2.5:testResources (default-testResources) @ sources-dist
---
mojoSucceeded org.apache.maven.plugins:maven-resources-plugin:2.5(default-testResources)
mojoStarted org.apache.maven.plugins:maven-compiler-plugin:2.3.2(default-testCompile)[INFO]
No sources to compile

[INFO] 
[INFO] --- maven-compiler-plugin:2.3.2:testCompile (default-testCompile) @ sources-dist ---
mojoSucceeded org.apache.maven.plugins:maven-compiler-plugin:2.3.2(default-testCompile)
mojoStarted org.apache.maven.plugins:maven-surefire-plugin:2.12(default-test)[INFO] Surefire
report directory: <https://builds.apache.org/job/gora-trunk/ws/trunk./sources-dist/target/surefire-reports>

[INFO] 
[INFO] --- maven-surefire-plugin:2.12:test (default-test) @ sources-dist ---

-------------------------------------------------------
 T E S T S
-------------------------------------------------------

-------------------------------------------------------
 T E S T S
-------------------------------------------------------

Results :

Tests run: 0, Failures: 0, Errors: 0, Skipped: 0

mojoSucceeded org.apache.maven.plugins:maven-surefire-plugin:2.12(default-test)
[JENKINS] Recording test results
mojoStarted org.apache.maven.plugins:maven-jar-plugin:2.4(default-jar)
[INFO] 
[INFO] --- maven-jar-plugin:2.4:jar (default-jar) @ sources-dist ---
[INFO] Building jar: <https://builds.apache.org/job/gora-trunk/ws/trunk./sources-dist/target/sources-dist-0.3-SNAPSHOT.jar>
[INFO] META-INF/maven/org.apache.gora/sources-dist/pom.xml already added, skipping
[INFO] META-INF/maven/org.apache.gora/sources-dist/pom.properties already added, skipping
mojoSucceeded org.apache.maven.plugins:maven-jar-plugin:2.4(default-jar)
mojoStarted org.apache.maven.plugins:maven-site-plugin:3.0(attach-descriptor)
[INFO] 
[INFO] --- maven-site-plugin:3.0:attach-descriptor (attach-descriptor) @ sources-dist ---
mojoSucceeded org.apache.maven.plugins:maven-site-plugin:3.0(attach-descriptor)
mojoStarted org.apache.maven.plugins:maven-dependency-plugin:2.4(default)
[INFO] 
[INFO] --- maven-dependency-plugin:2.4:copy-dependencies (default) @ sources-dist ---
mojoSucceeded org.apache.maven.plugins:maven-dependency-plugin:2.4(default)
mojoStarted org.apache.maven.plugins:maven-jar-plugin:2.4(default)
[INFO] 
[INFO] --- maven-jar-plugin:2.4:jar (default) @ sources-dist ---
mojoSucceeded org.apache.maven.plugins:maven-jar-plugin:2.4(default)
mojoStarted org.apache.maven.plugins:maven-jar-plugin:2.4(default)
[INFO] [INFO] Building jar: <https://builds.apache.org/job/gora-trunk/ws/trunk./sources-dist/target/sources-dist-0.3-SNAPSHOT-tests.jar>

[INFO] --- maven-jar-plugin:2.4:test-jar (default) @ sources-dist ---
mojoSucceeded org.apache.maven.plugins:maven-jar-plugin:2.4(default)
mojoStarted org.apache.maven.plugins:maven-assembly-plugin:2.2.2(assembly)
[INFO] 
[INFO] --- maven-assembly-plugin:2.2.2:single (assembly) @ sources-dist ---
[INFO] Reading assembly descriptor: <https://builds.apache.org/job/gora-trunk/ws/trunk./sources-dist/src/main/assembly/src.xml>
[INFO] Building tar : <https://builds.apache.org/job/gora-trunk/ws/trunk./sources-dist/target/apache-gora-0.3-SNAPSHOT-src.tar.gz>
[INFO] Building zip: <https://builds.apache.org/job/gora-trunk/ws/trunk./sources-dist/target/apache-gora-0.3-SNAPSHOT-src.zip>
mojoSucceeded org.apache.maven.plugins:maven-assembly-plugin:2.2.2(assembly)
mojoStarted org.apache.maven.plugins:maven-install-plugin:2.3.1(default-install)[INFO] Installing
<https://builds.apache.org/job/gora-trunk/ws/trunk./sources-dist/target/sources-dist-0.3-SNAPSHOT.jar>
to /home/hudson/hudson-slave/maven-repositories/0/org/apache/gora/sources-dist/0.3-SNAPSHOT/sources-dist-0.3-SNAPSHOT.jar
[INFO] Installing <https://builds.apache.org/job/gora-trunk/ws/trunk./sources-dist/pom.xml>
to /home/hudson/hudson-slave/maven-repositories/0/org/apache/gora/sources-dist/0.3-SNAPSHOT/sources-dist-0.3-SNAPSHOT.pom
[INFO] Installing <https://builds.apache.org/job/gora-trunk/ws/trunk./sources-dist/target/sources-dist-0.3-SNAPSHOT-tests.jar>
to /home/hudson/hudson-slave/maven-repositories/0/org/apache/gora/sources-dist/0.3-SNAPSHOT/sources-dist-0.3-SNAPSHOT-tests.jar
[INFO] Installing <https://builds.apache.org/job/gora-trunk/ws/trunk./sources-dist/target/apache-gora-0.3-SNAPSHOT-src.tar.gz>
to /home/hudson/hudson-slave/maven-repositories/0/org/apache/gora/sources-dist/0.3-SNAPSHOT/sources-dist-0.3-SNAPSHOT-src.tar.gz
[INFO] Installing <https://builds.apache.org/job/gora-trunk/ws/trunk./sources-dist/target/apache-gora-0.3-SNAPSHOT-src.zip>
to /home/hudson/hudson-slave/maven-repositories/0/org/apache/gora/sources-dist/0.3-SNAPSHOT/sources-dist-0.3-SNAPSHOT-src.zip

[INFO] 
[INFO] --- maven-install-plugin:2.3.1:install (default-install) @ sources-dist ---
mojoSucceeded org.apache.maven.plugins:maven-install-plugin:2.3.1(default-install)
projectSucceeded org.apache.gora:sources-dist:0.3-SNAPSHOT
sessionEnded
[INFO] ------------------------------------------------------------------------
[INFO] Reactor Summary:
[INFO] 
[INFO] Apache Gora ....................................... SUCCESS [20.190s]
[INFO] Apache Gora :: Core ............................... SUCCESS [1:07.260s]
[INFO] Apache Gora :: Hbase .............................. SUCCESS [32:27.436s]
[INFO] Apache Gora :: Accumulo ........................... SUCCESS [10.118s]
[INFO] Apache Gora :: Cassandra .......................... SUCCESS [10.656s]
[INFO] Apache Gora :: SQL ................................ SUCCESS [10.020s]
[INFO] Apache Gora :: Tutorial ........................... SUCCESS [7.868s]
[INFO] Apache Gora :: Sources-Dist ....................... SUCCESS [6.551s]
[INFO] ------------------------------------------------------------------------
[INFO] BUILD SUCCESS
[INFO] ------------------------------------------------------------------------
[INFO] Total time: 34:43.287s
[INFO] Finished at: Sun Jul 01 06:06:15 UTC 2012
[INFO] Final Memory: 58M/320M
[INFO] ------------------------------------------------------------------------
Projects to build: [MavenProject: org.apache.gora:gora:0.3-SNAPSHOT @ <https://builds.apache.org/job/gora-trunk/ws/trunk./pom.xml,>
MavenProject: org.apache.gora:gora-core:0.3-SNAPSHOT @ <https://builds.apache.org/job/gora-trunk/ws/trunk./gora-core/pom.xml,>
MavenProject: org.apache.gora:gora-hbase:0.3-SNAPSHOT @ <https://builds.apache.org/job/gora-trunk/ws/trunk./gora-hbase/pom.xml,>
MavenProject: org.apache.gora:gora-accumulo:0.3-SNAPSHOT @ <https://builds.apache.org/job/gora-trunk/ws/trunk./gora-accumulo/pom.xml,>
MavenProject: org.apache.gora:gora-cassandra:0.3-SNAPSHOT @ <https://builds.apache.org/job/gora-trunk/ws/trunk./gora-cassandra/pom.xml,>
MavenProject: org.apache.gora:gora-sql:0.3-SNAPSHOT @ <https://builds.apache.org/job/gora-trunk/ws/trunk./gora-sql/pom.xml,>
MavenProject: org.apache.gora:gora-tutorial:0.3-SNAPSHOT @ <https://builds.apache.org/job/gora-trunk/ws/trunk./gora-tutorial/pom.xml,>
MavenProject: org.apache.gora:sources-dist:0.3-SNAPSHOT @ <https://builds.apache.org/job/gora-trunk/ws/trunk./sources-dist/pom.xml]>
[JENKINS] Archiving <https://builds.apache.org/job/gora-trunk/ws/trunk./gora-core/pom.xml>
to /home/hudson/hudson/jobs/gora-trunk/modules/org.apache.gora$gora-core/builds/2012-07-01_05-31-16/archive/org.apache.gora/gora-core/0.3-SNAPSHOT/gora-core-0.3-SNAPSHOT.pom
[JENKINS] Archiving <https://builds.apache.org/job/gora-trunk/ws/trunk./gora-core/target/gora-core-0.3-SNAPSHOT.jar>
to /home/hudson/hudson/jobs/gora-trunk/modules/org.apache.gora$gora-core/builds/2012-07-01_05-31-16/archive/org.apache.gora/gora-core/0.3-SNAPSHOT/gora-core-0.3-SNAPSHOT.jar
[JENKINS] Archiving <https://builds.apache.org/job/gora-trunk/ws/trunk./gora-core/target/gora-core-0.3-SNAPSHOT-tests.jar>
to /home/hudson/hudson/jobs/gora-trunk/modules/org.apache.gora$gora-core/builds/2012-07-01_05-31-16/archive/org.apache.gora/gora-core/0.3-SNAPSHOT/gora-core-0.3-SNAPSHOT-tests.jar
[JENKINS] Archiving <https://builds.apache.org/job/gora-trunk/ws/trunk./sources-dist/pom.xml>
to /home/hudson/hudson/jobs/gora-trunk/modules/org.apache.gora$sources-dist/builds/2012-07-01_05-31-16/archive/org.apache.gora/sources-dist/0.3-SNAPSHOT/sources-dist-0.3-SNAPSHOT.pom
[JENKINS] Archiving <https://builds.apache.org/job/gora-trunk/ws/trunk./sources-dist/target/sources-dist-0.3-SNAPSHOT.jar>
to /home/hudson/hudson/jobs/gora-trunk/modules/org.apache.gora$sources-dist/builds/2012-07-01_05-31-16/archive/org.apache.gora/sources-dist/0.3-SNAPSHOT/sources-dist-0.3-SNAPSHOT.jar
[JENKINS] Archiving <https://builds.apache.org/job/gora-trunk/ws/trunk./sources-dist/target/sources-dist-0.3-SNAPSHOT-tests.jar>
to /home/hudson/hudson/jobs/gora-trunk/modules/org.apache.gora$sources-dist/builds/2012-07-01_05-31-16/archive/org.apache.gora/sources-dist/0.3-SNAPSHOT/sources-dist-0.3-SNAPSHOT-tests.jar
[JENKINS] Archiving <https://builds.apache.org/job/gora-trunk/ws/trunk./sources-dist/target/apache-gora-0.3-SNAPSHOT-src.tar.gz>
to /home/hudson/hudson/jobs/gora-trunk/modules/org.apache.gora$sources-dist/builds/2012-07-01_05-31-16/archive/org.apache.gora/sources-dist/0.3-SNAPSHOT/sources-dist-0.3-SNAPSHOT-src.tar.gz
[JENKINS] Archiving <https://builds.apache.org/job/gora-trunk/ws/trunk./sources-dist/target/apache-gora-0.3-SNAPSHOT-src.zip>
to /home/hudson/hudson/jobs/gora-trunk/modules/org.apache.gora$sources-dist/builds/2012-07-01_05-31-16/archive/org.apache.gora/sources-dist/0.3-SNAPSHOT/sources-dist-0.3-SNAPSHOT-src.zip
[JENKINS] Archiving <https://builds.apache.org/job/gora-trunk/ws/trunk./gora-cassandra/pom.xml>
to /home/hudson/hudson/jobs/gora-trunk/modules/org.apache.gora$gora-cassandra/builds/2012-07-01_05-31-16/archive/org.apache.gora/gora-cassandra/0.3-SNAPSHOT/gora-cassandra-0.3-SNAPSHOT.pom
[JENKINS] Archiving <https://builds.apache.org/job/gora-trunk/ws/trunk./gora-cassandra/target/gora-cassandra-0.3-SNAPSHOT.jar>
to /home/hudson/hudson/jobs/gora-trunk/modules/org.apache.gora$gora-cassandra/builds/2012-07-01_05-31-16/archive/org.apache.gora/gora-cassandra/0.3-SNAPSHOT/gora-cassandra-0.3-SNAPSHOT.jar
[JENKINS] Archiving <https://builds.apache.org/job/gora-trunk/ws/trunk./gora-cassandra/target/gora-cassandra-0.3-SNAPSHOT-tests.jar>
to /home/hudson/hudson/jobs/gora-trunk/modules/org.apache.gora$gora-cassandra/builds/2012-07-01_05-31-16/archive/org.apache.gora/gora-cassandra/0.3-SNAPSHOT/gora-cassandra-0.3-SNAPSHOT-tests.jar
[JENKINS] Archiving <https://builds.apache.org/job/gora-trunk/ws/trunk./gora-hbase/pom.xml>
to /home/hudson/hudson/jobs/gora-trunk/modules/org.apache.gora$gora-hbase/builds/2012-07-01_05-31-16/archive/org.apache.gora/gora-hbase/0.3-SNAPSHOT/gora-hbase-0.3-SNAPSHOT.pom
[JENKINS] Archiving <https://builds.apache.org/job/gora-trunk/ws/trunk./gora-hbase/target/gora-hbase-0.3-SNAPSHOT.jar>
to /home/hudson/hudson/jobs/gora-trunk/modules/org.apache.gora$gora-hbase/builds/2012-07-01_05-31-16/archive/org.apache.gora/gora-hbase/0.3-SNAPSHOT/gora-hbase-0.3-SNAPSHOT.jar
[JENKINS] Archiving <https://builds.apache.org/job/gora-trunk/ws/trunk./gora-hbase/target/gora-hbase-0.3-SNAPSHOT-tests.jar>
to /home/hudson/hudson/jobs/gora-trunk/modules/org.apache.gora$gora-hbase/builds/2012-07-01_05-31-16/archive/org.apache.gora/gora-hbase/0.3-SNAPSHOT/gora-hbase-0.3-SNAPSHOT-tests.jar
[JENKINS] Archiving <https://builds.apache.org/job/gora-trunk/ws/trunk./gora-sql/pom.xml>
to /home/hudson/hudson/jobs/gora-trunk/modules/org.apache.gora$gora-sql/builds/2012-07-01_05-31-16/archive/org.apache.gora/gora-sql/0.3-SNAPSHOT/gora-sql-0.3-SNAPSHOT.pom
[JENKINS] Archiving <https://builds.apache.org/job/gora-trunk/ws/trunk./gora-sql/target/gora-sql-0.3-SNAPSHOT.jar>
to /home/hudson/hudson/jobs/gora-trunk/modules/org.apache.gora$gora-sql/builds/2012-07-01_05-31-16/archive/org.apache.gora/gora-sql/0.3-SNAPSHOT/gora-sql-0.3-SNAPSHOT.jar
[JENKINS] Archiving <https://builds.apache.org/job/gora-trunk/ws/trunk./gora-sql/target/gora-sql-0.3-SNAPSHOT-tests.jar>
to /home/hudson/hudson/jobs/gora-trunk/modules/org.apache.gora$gora-sql/builds/2012-07-01_05-31-16/archive/org.apache.gora/gora-sql/0.3-SNAPSHOT/gora-sql-0.3-SNAPSHOT-tests.jar
[JENKINS] Archiving <https://builds.apache.org/job/gora-trunk/ws/trunk./pom.xml> to
/home/hudson/hudson/jobs/gora-trunk/modules/org.apache.gora$gora/builds/2012-07-01_05-31-16/archive/org.apache.gora/gora/0.3-SNAPSHOT/gora-0.3-SNAPSHOT.pom
[JENKINS] Re-archiving <https://builds.apache.org/job/gora-trunk/ws/trunk./target/gora-0.3-SNAPSHOT.jar>
[JENKINS] Archiving <https://builds.apache.org/job/gora-trunk/ws/trunk./target/gora-0.3-SNAPSHOT-tests.jar>
to /home/hudson/hudson/jobs/gora-trunk/modules/org.apache.gora$gora/builds/2012-07-01_05-31-16/archive/org.apache.gora/gora/0.3-SNAPSHOT/gora-0.3-SNAPSHOT-tests.jar
[JENKINS] Archiving <https://builds.apache.org/job/gora-trunk/ws/trunk./gora-tutorial/pom.xml>
to /home/hudson/hudson/jobs/gora-trunk/modules/org.apache.gora$gora-tutorial/builds/2012-07-01_05-31-16/archive/org.apache.gora/gora-tutorial/0.3-SNAPSHOT/gora-tutorial-0.3-SNAPSHOT.pom
[JENKINS] Archiving <https://builds.apache.org/job/gora-trunk/ws/trunk./gora-tutorial/target/gora-tutorial-0.3-SNAPSHOT.jar>
to /home/hudson/hudson/jobs/gora-trunk/modules/org.apache.gora$gora-tutorial/builds/2012-07-01_05-31-16/archive/org.apache.gora/gora-tutorial/0.3-SNAPSHOT/gora-tutorial-0.3-SNAPSHOT.jar
[JENKINS] Archiving <https://builds.apache.org/job/gora-trunk/ws/trunk./gora-tutorial/target/gora-tutorial-0.3-SNAPSHOT-tests.jar>
to /home/hudson/hudson/jobs/gora-trunk/modules/org.apache.gora$gora-tutorial/builds/2012-07-01_05-31-16/archive/org.apache.gora/gora-tutorial/0.3-SNAPSHOT/gora-tutorial-0.3-SNAPSHOT-tests.jar
[JENKINS] Archiving <https://builds.apache.org/job/gora-trunk/ws/trunk./gora-accumulo/pom.xml>
to /home/hudson/hudson/jobs/gora-trunk/modules/org.apache.gora$gora-accumulo/builds/2012-07-01_05-31-16/archive/org.apache.gora/gora-accumulo/0.3-SNAPSHOT/gora-accumulo-0.3-SNAPSHOT.pom
[JENKINS] Archiving <https://builds.apache.org/job/gora-trunk/ws/trunk./gora-accumulo/target/gora-accumulo-0.3-SNAPSHOT.jar>
to /home/hudson/hudson/jobs/gora-trunk/modules/org.apache.gora$gora-accumulo/builds/2012-07-01_05-31-16/archive/org.apache.gora/gora-accumulo/0.3-SNAPSHOT/gora-accumulo-0.3-SNAPSHOT.jar
[JENKINS] Archiving <https://builds.apache.org/job/gora-trunk/ws/trunk./gora-accumulo/target/gora-accumulo-0.3-SNAPSHOT-tests.jar>
to /home/hudson/hudson/jobs/gora-trunk/modules/org.apache.gora$gora-accumulo/builds/2012-07-01_05-31-16/archive/org.apache.gora/gora-accumulo/0.3-SNAPSHOT/gora-accumulo-0.3-SNAPSHOT-tests.jar
Waiting for Jenkins to finish collecting data
channel stopped
Maven RedeployPublished use remote ubuntu2 maven settings from : /home/hudson/.m2/settings.xml
[ERROR] uniqueVersion == false is not anymore supported in maven 3
[INFO] Deployment in https://repository.apache.org/content/repositories/snapshots (id=apache.snapshots.https,uniqueVersion=false)
Deploying the main artifact gora-0.3-SNAPSHOT.pom
Downloading: https://repository.apache.org/content/repositories/snapshots/org/apache/gora/gora/0.3-SNAPSHOT/maven-metadata.xml
ERROR: Failed to retrieve remote metadata org.apache.gora:gora:0.3-SNAPSHOT/maven-metadata.xml:
Could not transfer metadata org.apache.gora:gora:0.3-SNAPSHOT/maven-metadata.xml from/to apache.snapshots.https
(https://repository.apache.org/content/repositories/snapshots): Failed to transfer file: https://repository.apache.org/content/repositories/snapshots/org/apache/gora/gora/0.3-SNAPSHOT/maven-metadata.xml.
Return code is: 503, ReasonPhrase:Service Temporarily Unavailable.
org.apache.maven.artifact.deployer.ArtifactDeploymentException: Failed to retrieve remote
metadata org.apache.gora:gora:0.3-SNAPSHOT/maven-metadata.xml: Could not transfer metadata
org.apache.gora:gora:0.3-SNAPSHOT/maven-metadata.xml from/to apache.snapshots.https (https://repository.apache.org/content/repositories/snapshots):
Failed to transfer file: https://repository.apache.org/content/repositories/snapshots/org/apache/gora/gora/0.3-SNAPSHOT/maven-metadata.xml.
Return code is: 503, ReasonPhrase:Service Temporarily Unavailable.
	at org.apache.maven.artifact.deployer.DefaultArtifactDeployer.deploy(DefaultArtifactDeployer.java:141)
	at hudson.maven.reporters.MavenArtifactRecord.deploy(MavenArtifactRecord.java:182)
	at hudson.maven.RedeployPublisher.perform(RedeployPublisher.java:174)
	at hudson.tasks.BuildStepMonitor$1.perform(BuildStepMonitor.java:19)
	at hudson.model.AbstractBuild$AbstractBuildExecution.perform(AbstractBuild.java:717)
	at hudson.model.AbstractBuild$AbstractBuildExecution.performAllBuildSteps(AbstractBuild.java:692)
	at hudson.maven.MavenModuleSetBuild$MavenModuleSetBuildExecution.post2(MavenModuleSetBuild.java:994)
	at hudson.model.AbstractBuild$AbstractBuildExecution.post(AbstractBuild.java:639)
	at hudson.model.Run.execute(Run.java:1485)
	at hudson.maven.MavenModuleSetBuild.run(MavenModuleSetBuild.java:477)
	at hudson.model.ResourceController.execute(ResourceController.java:88)
	at hudson.model.Executor.run(Executor.java:239)
Caused by: org.sonatype.aether.deployment.DeploymentException: Failed to retrieve remote metadata
org.apache.gora:gora:0.3-SNAPSHOT/maven-metadata.xml: Could not transfer metadata org.apache.gora:gora:0.3-SNAPSHOT/maven-metadata.xml
from/to apache.snapshots.https (https://repository.apache.org/content/repositories/snapshots):
Failed to transfer file: https://repository.apache.org/content/repositories/snapshots/org/apache/gora/gora/0.3-SNAPSHOT/maven-metadata.xml.
Return code is: 503, ReasonPhrase:Service Temporarily Unavailable.
	at org.sonatype.aether.impl.internal.DefaultDeployer.upload(DefaultDeployer.java:403)
	at org.sonatype.aether.impl.internal.DefaultDeployer.deploy(DefaultDeployer.java:256)
	at org.sonatype.aether.impl.internal.DefaultDeployer.deploy(DefaultDeployer.java:211)
	at org.sonatype.aether.impl.internal.DefaultRepositorySystem.deploy(DefaultRepositorySystem.java:443)
	at org.apache.maven.artifact.deployer.DefaultArtifactDeployer.deploy(DefaultArtifactDeployer.java:137)
	... 11 more
Caused by: org.sonatype.aether.transfer.MetadataTransferException: Could not transfer metadata
org.apache.gora:gora:0.3-SNAPSHOT/maven-metadata.xml from/to apache.snapshots.https (https://repository.apache.org/content/repositories/snapshots):
Failed to transfer file: https://repository.apache.org/content/repositories/snapshots/org/apache/gora/gora/0.3-SNAPSHOT/maven-metadata.xml.
Return code is: 503, ReasonPhrase:Service Temporarily Unavailable.
	at org.sonatype.aether.connector.wagon.WagonRepositoryConnector$3.wrap(WagonRepositoryConnector.java:930)
	at org.sonatype.aether.connector.wagon.WagonRepositoryConnector$3.wrap(WagonRepositoryConnector.java:920)
	at org.sonatype.aether.connector.wagon.WagonRepositoryConnector$GetTask.run(WagonRepositoryConnector.java:669)
	at org.sonatype.aether.util.concurrency.RunnableErrorForwarder$1.run(RunnableErrorForwarder.java:60)
	at java.util.concurrent.ThreadPoolExecutor.runWorker(ThreadPoolExecutor.java:1110)
	at java.util.concurrent.ThreadPoolExecutor$Worker.run(ThreadPoolExecutor.java:603)
	at java.lang.Thread.run(Thread.java:722)
Caused by: org.apache.maven.wagon.TransferFailedException: Failed to transfer file: https://repository.apache.org/content/repositories/snapshots/org/apache/gora/gora/0.3-SNAPSHOT/maven-metadata.xml.
Return code is: 503, ReasonPhrase:Service Temporarily Unavailable.
	at org.apache.maven.wagon.shared.http4.AbstractHttpClientWagon.fillInputData(AbstractHttpClientWagon.java:852)
	at org.apache.maven.wagon.StreamWagon.getInputStream(StreamWagon.java:116)
	at org.apache.maven.wagon.StreamWagon.getIfNewer(StreamWagon.java:88)
	at org.apache.maven.wagon.StreamWagon.get(StreamWagon.java:61)
	at org.sonatype.aether.connector.wagon.WagonRepositoryConnector$GetTask.run(WagonRepositoryConnector.java:601)
	... 4 more
[INFO] Deployment failed after 1.2 sec
Build step 'Deploy artifacts to Maven repository' changed build result to FAILURE

Mime
View raw message