gora-dev mailing list archives

Site index · List index
Message view « Date » · « Thread »
Top « Date » · « Thread »
From Apache Jenkins Server <jenk...@builds.apache.org>
Subject Build failed in Jenkins: goraamazon_branch » Apache Gora :: Core #87
Date Fri, 14 Sep 2012 05:15:10 GMT
See <https://builds.apache.org/job/goraamazon_branch/org.apache.gora$gora-core/87/>

------------------------------------------
[INFO] ------------------------------------------------------------------------
[INFO] Building Apache Gora :: Core
[INFO]    task-segment: [install]
[INFO] ------------------------------------------------------------------------
[INFO] [build-helper:add-source {execution: default}]
[INFO] Source directory: <https://builds.apache.org/job/goraamazon_branch/org.apache.gora$gora-core/ws/src/examples/java>
added.
[INFO] [remote-resources:process {execution: default}]
[debug] execute contextualize
[INFO] [resources:resources {execution: default-resources}]
[INFO] Using 'UTF-8' encoding to copy filtered resources.
[INFO] skip non existing resourceDirectory <https://builds.apache.org/job/goraamazon_branch/org.apache.gora$gora-core/ws/src/main/resources>
[INFO] Copying 3 resources
[INFO] [compiler:compile {execution: default-compile}]
[INFO] Compiling 77 source files to <https://builds.apache.org/job/goraamazon_branch/org.apache.gora$gora-core/ws/target/classes>
[debug] execute contextualize
[INFO] [resources:testResources {execution: default-testResources}]
[INFO] Using 'UTF-8' encoding to copy filtered resources.
[INFO] Copying 3 resources
[INFO] Copying 3 resources
[INFO] [compiler:testCompile {execution: default-testCompile}]
[INFO] Compiling 24 source files to <https://builds.apache.org/job/goraamazon_branch/org.apache.gora$gora-core/ws/target/test-classes>
[INFO] [surefire:test {execution: default-test}]
[INFO] Surefire report directory: <https://builds.apache.org/job/goraamazon_branch/org.apache.gora$gora-core/ws/target/surefire-reports>

-------------------------------------------------------
 T E S T S
-------------------------------------------------------

-------------------------------------------------------
 T E S T S
-------------------------------------------------------

Results :

Tests run: 0, Failures: 0, Errors: 0, Skipped: 0

[JENKINS] Recording test results
[JENKINS] Archiving <https://builds.apache.org/job/goraamazon_branch/org.apache.gora$gora-core/ws/pom.xml>
to /home/hudson/hudson/jobs/goraamazon_branch/modules/org.apache.gora$gora-core/builds/2012-09-14_05-01-52/archive/org.apache.gora/gora-core/0.3-SNAPSHOT/gora-core-0.3-SNAPSHOT.pom
[INFO] ------------------------------------------------------------------------
[ERROR] BUILD ERROR
[INFO] ------------------------------------------------------------------------
[INFO] ExecutionException; nested exception is java.util.concurrent.ExecutionException: org.apache.maven.surefire.booter.SurefireBooterForkException:
Error while executing forked tests.; nested exception is java.io.IOException: Cannot run program
"/bin/sh" (in directory "<https://builds.apache.org/job/goraamazon_branch/org.apache.gora$gora-core/ws/")>:
error=12, Not enough space

[INFO] ------------------------------------------------------------------------
[INFO] For more information, run Maven with the -e switch
[INFO] ------------------------------------------------------------------------
[INFO] Total time: 10 minutes 9 seconds
[INFO] Finished at: Fri Sep 14 05:15:39 GMT+00:00 2012
[INFO] Final Memory: 70M/389M
[INFO] ------------------------------------------------------------------------

Mime
View raw message