hadoop-common-dev mailing list archives

Site index · List index
Message view « Date » · « Thread »
Top « Date » · « Thread »
From Apache Jenkins Server <jenk...@builds.apache.org>
Subject Build failed in Jenkins: Hadoop-Common-trunk #1423
Date Tue, 03 Mar 2015 09:32:16 GMT
See <https://builds.apache.org/job/Hadoop-Common-trunk/1423/changes>

Changes:

[gera] HDFS-7789. DFSck should resolve the path to support cross-FS symlinks. (gera)

[aajisaka] HADOOP-11658. Externalize io.compression.codecs property. Contributed by Kai Zheng.

[jianhe] YARN-3281. Added RMStateStore to StateMachine visualization list. Contributed by
Chengbing Liu

[wheat9] HDFS-7785. Improve diagnostics information for HttpPutFailedException. Contributed
by Chengbing Liu.

[wangda] YARN-3270. Fix node label expression not getting set in ApplicationSubmissionContext
(Rohit Agarwal via wangda)

[vinodkv] YARN-3265. Fixed a deadlock in CapacityScheduler by always passing a queue's available
resource-limit from the parent queue. Contributed by Wangda Tan.

[szetszwo] HDFS-7302. Remove "downgrade" from "namenode -rollingUpgrade" startup option since
it may incorrectly finalize an ongoing rolling upgrade.

[gera] HADOOP-11605. FilterFileSystem#create with ChecksumOpt should propagate it to wrapped
FS. (gera)

[jing9] HDFS-7871. NameNodeEditLogRoller can keep printing 'Swallowing exception' message.
Contributed by Jing Zhao.

[ozawa] HADOOP-11602. Fix toUpperCase/toLowerCase to use Locale.ENGLISH. (ozawa)

[ozawa] MAPREDUCE-6268. Fix typo in Task Attempt API's URL. Contributed by Ryu Kobayashi.

------------------------------------------
[...truncated 4930 lines...]
Running org.apache.hadoop.util.TestIndexedSort
Tests run: 2, Failures: 0, Errors: 0, Skipped: 0, Time elapsed: 0.78 sec - in org.apache.hadoop.util.TestIndexedSort
Running org.apache.hadoop.util.bloom.TestBloomFilters
Tests run: 6, Failures: 0, Errors: 0, Skipped: 0, Time elapsed: 0.473 sec - in org.apache.hadoop.util.bloom.TestBloomFilters
Running org.apache.hadoop.util.TestStopWatch
Tests run: 3, Failures: 0, Errors: 0, Skipped: 0, Time elapsed: 0.071 sec - in org.apache.hadoop.util.TestStopWatch
Running org.apache.hadoop.util.TestMachineList
Tests run: 13, Failures: 0, Errors: 0, Skipped: 0, Time elapsed: 92.979 sec - in org.apache.hadoop.util.TestMachineList
Running org.apache.hadoop.util.TestFileBasedIPList
Tests run: 8, Failures: 0, Errors: 0, Skipped: 0, Time elapsed: 0.176 sec - in org.apache.hadoop.util.TestFileBasedIPList
Running org.apache.hadoop.util.TestGenericsUtil
Tests run: 6, Failures: 0, Errors: 0, Skipped: 0, Time elapsed: 0.343 sec - in org.apache.hadoop.util.TestGenericsUtil
Running org.apache.hadoop.util.TestFindClass
Tests run: 16, Failures: 0, Errors: 0, Skipped: 0, Time elapsed: 0.786 sec - in org.apache.hadoop.util.TestFindClass
Running org.apache.hadoop.util.TestLightWeightGSet
Tests run: 2, Failures: 0, Errors: 0, Skipped: 0, Time elapsed: 0.174 sec - in org.apache.hadoop.util.TestLightWeightGSet
Running org.apache.hadoop.util.TestPureJavaCrc32
Tests run: 1, Failures: 0, Errors: 0, Skipped: 0, Time elapsed: 0.577 sec - in org.apache.hadoop.util.TestPureJavaCrc32
Running org.apache.hadoop.util.TestStringUtils
Tests run: 14, Failures: 0, Errors: 0, Skipped: 0, Time elapsed: 0.33 sec - in org.apache.hadoop.util.TestStringUtils
Running org.apache.hadoop.util.TestProtoUtil
Tests run: 2, Failures: 0, Errors: 0, Skipped: 0, Time elapsed: 0.259 sec - in org.apache.hadoop.util.TestProtoUtil
Running org.apache.hadoop.util.TestSignalLogger
Tests run: 1, Failures: 0, Errors: 0, Skipped: 0, Time elapsed: 0.181 sec - in org.apache.hadoop.util.TestSignalLogger
Running org.apache.hadoop.util.TestDiskChecker
Tests run: 14, Failures: 0, Errors: 0, Skipped: 0, Time elapsed: 1.164 sec - in org.apache.hadoop.util.TestDiskChecker
Running org.apache.hadoop.util.TestShutdownThreadsHelper
Tests run: 2, Failures: 0, Errors: 0, Skipped: 0, Time elapsed: 3.171 sec - in org.apache.hadoop.util.TestShutdownThreadsHelper
Running org.apache.hadoop.util.TestCacheableIPList
Tests run: 4, Failures: 0, Errors: 0, Skipped: 0, Time elapsed: 1.278 sec - in org.apache.hadoop.util.TestCacheableIPList
Running org.apache.hadoop.util.TestLineReader
Tests run: 1, Failures: 0, Errors: 0, Skipped: 0, Time elapsed: 0.194 sec - in org.apache.hadoop.util.TestLineReader
Running org.apache.hadoop.util.TestIdentityHashStore
Tests run: 3, Failures: 0, Errors: 0, Skipped: 0, Time elapsed: 0.191 sec - in org.apache.hadoop.util.TestIdentityHashStore
Running org.apache.hadoop.util.TestClasspath
Tests run: 7, Failures: 0, Errors: 0, Skipped: 0, Time elapsed: 0.323 sec - in org.apache.hadoop.util.TestClasspath
Running org.apache.hadoop.util.TestApplicationClassLoader
Tests run: 4, Failures: 0, Errors: 0, Skipped: 0, Time elapsed: 0.238 sec - in org.apache.hadoop.util.TestApplicationClassLoader
Running org.apache.hadoop.util.TestShell
Tests run: 4, Failures: 0, Errors: 0, Skipped: 0, Time elapsed: 5.233 sec - in org.apache.hadoop.util.TestShell
Running org.apache.hadoop.util.TestShutdownHookManager
Tests run: 1, Failures: 0, Errors: 0, Skipped: 0, Time elapsed: 0.163 sec - in org.apache.hadoop.util.TestShutdownHookManager
Running org.apache.hadoop.util.TestHttpExceptionUtils
Tests run: 7, Failures: 0, Errors: 0, Skipped: 0, Time elapsed: 0.668 sec - in org.apache.hadoop.util.TestHttpExceptionUtils
Running org.apache.hadoop.util.TestJarFinder
Tests run: 4, Failures: 0, Errors: 0, Skipped: 0, Time elapsed: 0.735 sec - in org.apache.hadoop.util.TestJarFinder
Running org.apache.hadoop.util.hash.TestHash
Tests run: 1, Failures: 0, Errors: 0, Skipped: 0, Time elapsed: 0.428 sec - in org.apache.hadoop.util.hash.TestHash
Running org.apache.hadoop.util.TestLightWeightCache
Tests run: 1, Failures: 0, Errors: 0, Skipped: 0, Time elapsed: 10.214 sec - in org.apache.hadoop.util.TestLightWeightCache
Running org.apache.hadoop.util.TestNativeCodeLoader
Tests run: 1, Failures: 0, Errors: 0, Skipped: 0, Time elapsed: 0.164 sec - in org.apache.hadoop.util.TestNativeCodeLoader
Running org.apache.hadoop.util.TestReflectionUtils
Tests run: 5, Failures: 0, Errors: 0, Skipped: 0, Time elapsed: 0.638 sec - in org.apache.hadoop.util.TestReflectionUtils
Running org.apache.hadoop.crypto.TestCryptoStreams
Tests run: 14, Failures: 0, Errors: 0, Skipped: 0, Time elapsed: 21.486 sec - in org.apache.hadoop.crypto.TestCryptoStreams
Running org.apache.hadoop.crypto.TestCryptoStreamsForLocalFS
Tests run: 14, Failures: 0, Errors: 0, Skipped: 5, Time elapsed: 11.785 sec - in org.apache.hadoop.crypto.TestCryptoStreamsForLocalFS
Running org.apache.hadoop.crypto.TestOpensslCipher
Tests run: 3, Failures: 0, Errors: 0, Skipped: 0, Time elapsed: 0.198 sec - in org.apache.hadoop.crypto.TestOpensslCipher
Running org.apache.hadoop.crypto.TestCryptoStreamsWithOpensslAesCtrCryptoCodec
Tests run: 14, Failures: 0, Errors: 0, Skipped: 0, Time elapsed: 21.947 sec - in org.apache.hadoop.crypto.TestCryptoStreamsWithOpensslAesCtrCryptoCodec
Running org.apache.hadoop.crypto.TestCryptoStreamsNormal
Tests run: 14, Failures: 0, Errors: 0, Skipped: 8, Time elapsed: 6.88 sec - in org.apache.hadoop.crypto.TestCryptoStreamsNormal
Running org.apache.hadoop.crypto.TestCryptoCodec
Tests run: 3, Failures: 0, Errors: 0, Skipped: 0, Time elapsed: 13.774 sec - in org.apache.hadoop.crypto.TestCryptoCodec
Running org.apache.hadoop.crypto.random.TestOsSecureRandom
Tests run: 6, Failures: 0, Errors: 0, Skipped: 0, Time elapsed: 0.576 sec - in org.apache.hadoop.crypto.random.TestOsSecureRandom
Running org.apache.hadoop.crypto.random.TestOpensslSecureRandom
Tests run: 5, Failures: 0, Errors: 0, Skipped: 0, Time elapsed: 0.175 sec - in org.apache.hadoop.crypto.random.TestOpensslSecureRandom
Running org.apache.hadoop.crypto.key.TestKeyProviderDelegationTokenExtension
Tests run: 1, Failures: 0, Errors: 0, Skipped: 0, Time elapsed: 0.704 sec - in org.apache.hadoop.crypto.key.TestKeyProviderDelegationTokenExtension
Running org.apache.hadoop.crypto.key.TestCachingKeyProvider
Tests run: 5, Failures: 0, Errors: 0, Skipped: 0, Time elapsed: 2.086 sec - in org.apache.hadoop.crypto.key.TestCachingKeyProvider
Running org.apache.hadoop.crypto.key.TestKeyProviderFactory
Tests run: 8, Failures: 0, Errors: 0, Skipped: 0, Time elapsed: 1.38 sec - in org.apache.hadoop.crypto.key.TestKeyProviderFactory
Running org.apache.hadoop.crypto.key.TestValueQueue
Tests run: 8, Failures: 0, Errors: 0, Skipped: 0, Time elapsed: 1.171 sec - in org.apache.hadoop.crypto.key.TestValueQueue
Running org.apache.hadoop.crypto.key.kms.TestLoadBalancingKMSClientProvider
Tests run: 4, Failures: 0, Errors: 0, Skipped: 0, Time elapsed: 0.9 sec - in org.apache.hadoop.crypto.key.kms.TestLoadBalancingKMSClientProvider
Running org.apache.hadoop.crypto.key.TestKeyProvider
Tests run: 8, Failures: 0, Errors: 0, Skipped: 0, Time elapsed: 0.734 sec - in org.apache.hadoop.crypto.key.TestKeyProvider
Running org.apache.hadoop.crypto.key.TestKeyShell
Tests run: 9, Failures: 0, Errors: 0, Skipped: 0, Time elapsed: 1.415 sec - in org.apache.hadoop.crypto.key.TestKeyShell
Running org.apache.hadoop.crypto.key.TestKeyProviderCryptoExtension
Tests run: 2, Failures: 0, Errors: 0, Skipped: 0, Time elapsed: 0.946 sec - in org.apache.hadoop.crypto.key.TestKeyProviderCryptoExtension
Running org.apache.hadoop.io.TestSequenceFile
Tests run: 8, Failures: 0, Errors: 0, Skipped: 0, Time elapsed: 9.465 sec - in org.apache.hadoop.io.TestSequenceFile
Running org.apache.hadoop.io.TestSecureIOUtils
Tests run: 4, Failures: 0, Errors: 0, Skipped: 0, Time elapsed: 0.72 sec - in org.apache.hadoop.io.TestSecureIOUtils
Running org.apache.hadoop.io.nativeio.TestSharedFileDescriptorFactory
Tests run: 3, Failures: 0, Errors: 0, Skipped: 0, Time elapsed: 0.198 sec - in org.apache.hadoop.io.nativeio.TestSharedFileDescriptorFactory
Running org.apache.hadoop.io.nativeio.TestNativeIO
Tests run: 18, Failures: 0, Errors: 0, Skipped: 0, Time elapsed: 7.085 sec - in org.apache.hadoop.io.nativeio.TestNativeIO
Running org.apache.hadoop.io.TestWritable
Tests run: 7, Failures: 0, Errors: 0, Skipped: 0, Time elapsed: 0.459 sec - in org.apache.hadoop.io.TestWritable
Running org.apache.hadoop.io.TestIOUtils
Tests run: 12, Failures: 0, Errors: 0, Skipped: 0, Time elapsed: 0.427 sec - in org.apache.hadoop.io.TestIOUtils
Running org.apache.hadoop.io.TestTextNonUTF8
Tests run: 1, Failures: 0, Errors: 0, Skipped: 0, Time elapsed: 0.163 sec - in org.apache.hadoop.io.TestTextNonUTF8
Running org.apache.hadoop.io.TestMD5Hash
Tests run: 2, Failures: 0, Errors: 0, Skipped: 0, Time elapsed: 0.184 sec - in org.apache.hadoop.io.TestMD5Hash
Running org.apache.hadoop.io.TestMapFile
Tests run: 21, Failures: 0, Errors: 0, Skipped: 0, Time elapsed: 1.353 sec - in org.apache.hadoop.io.TestMapFile
Running org.apache.hadoop.io.TestWritableName
Tests run: 4, Failures: 0, Errors: 0, Skipped: 0, Time elapsed: 0.165 sec - in org.apache.hadoop.io.TestWritableName
Running org.apache.hadoop.io.TestSortedMapWritable
Tests run: 4, Failures: 0, Errors: 0, Skipped: 0, Time elapsed: 0.21 sec - in org.apache.hadoop.io.TestSortedMapWritable
Running org.apache.hadoop.io.TestSequenceFileSync
Tests run: 1, Failures: 0, Errors: 0, Skipped: 0, Time elapsed: 0.955 sec - in org.apache.hadoop.io.TestSequenceFileSync
Running org.apache.hadoop.io.retry.TestFailoverProxy
Tests run: 9, Failures: 0, Errors: 0, Skipped: 0, Time elapsed: 11.126 sec - in org.apache.hadoop.io.retry.TestFailoverProxy
Running org.apache.hadoop.io.retry.TestRetryProxy
Tests run: 10, Failures: 0, Errors: 0, Skipped: 0, Time elapsed: 1.201 sec - in org.apache.hadoop.io.retry.TestRetryProxy
Running org.apache.hadoop.io.TestDefaultStringifier
Tests run: 4, Failures: 0, Errors: 0, Skipped: 0, Time elapsed: 0.371 sec - in org.apache.hadoop.io.TestDefaultStringifier
Running org.apache.hadoop.io.TestBloomMapFile
Tests run: 7, Failures: 0, Errors: 0, Skipped: 0, Time elapsed: 1.453 sec - in org.apache.hadoop.io.TestBloomMapFile
Running org.apache.hadoop.io.TestBytesWritable
Tests run: 6, Failures: 0, Errors: 0, Skipped: 0, Time elapsed: 0.19 sec - in org.apache.hadoop.io.TestBytesWritable
Running org.apache.hadoop.io.TestWritableUtils
Tests run: 1, Failures: 0, Errors: 0, Skipped: 0, Time elapsed: 0.144 sec - in org.apache.hadoop.io.TestWritableUtils
Running org.apache.hadoop.io.TestBooleanWritable
Tests run: 2, Failures: 0, Errors: 0, Skipped: 0, Time elapsed: 0.188 sec - in org.apache.hadoop.io.TestBooleanWritable
Running org.apache.hadoop.io.TestDataByteBuffers
Tests run: 5, Failures: 0, Errors: 0, Skipped: 0, Time elapsed: 0.376 sec - in org.apache.hadoop.io.TestDataByteBuffers
Running org.apache.hadoop.io.TestVersionedWritable
Tests run: 3, Failures: 0, Errors: 0, Skipped: 0, Time elapsed: 0.155 sec - in org.apache.hadoop.io.TestVersionedWritable
Running org.apache.hadoop.io.TestEnumSetWritable
Tests run: 6, Failures: 0, Errors: 0, Skipped: 0, Time elapsed: 0.472 sec - in org.apache.hadoop.io.TestEnumSetWritable
Running org.apache.hadoop.io.TestMapWritable
Tests run: 4, Failures: 0, Errors: 0, Skipped: 0, Time elapsed: 0.191 sec - in org.apache.hadoop.io.TestMapWritable
Running org.apache.hadoop.io.TestArrayPrimitiveWritable
Tests run: 3, Failures: 0, Errors: 0, Skipped: 0, Time elapsed: 0.17 sec - in org.apache.hadoop.io.TestArrayPrimitiveWritable
Running org.apache.hadoop.io.TestSetFile
Tests run: 2, Failures: 0, Errors: 0, Skipped: 0, Time elapsed: 1.906 sec - in org.apache.hadoop.io.TestSetFile
Running org.apache.hadoop.io.TestUTF8
Tests run: 8, Failures: 0, Errors: 0, Skipped: 0, Time elapsed: 0.75 sec - in org.apache.hadoop.io.TestUTF8
Running org.apache.hadoop.io.TestBoundedByteArrayOutputStream
Tests run: 2, Failures: 0, Errors: 0, Skipped: 0, Time elapsed: 0.053 sec - in org.apache.hadoop.io.TestBoundedByteArrayOutputStream
Running org.apache.hadoop.io.compress.TestCodecPool
Tests run: 6, Failures: 0, Errors: 0, Skipped: 0, Time elapsed: 0.644 sec - in org.apache.hadoop.io.compress.TestCodecPool
Running org.apache.hadoop.io.compress.lz4.TestLz4CompressorDecompressor
Tests run: 12, Failures: 0, Errors: 0, Skipped: 0, Time elapsed: 0.267 sec - in org.apache.hadoop.io.compress.lz4.TestLz4CompressorDecompressor
Running org.apache.hadoop.io.compress.TestBlockDecompressorStream
Tests run: 2, Failures: 0, Errors: 0, Skipped: 0, Time elapsed: 0.075 sec - in org.apache.hadoop.io.compress.TestBlockDecompressorStream
Running org.apache.hadoop.io.compress.TestCodec
Tests run: 24, Failures: 0, Errors: 0, Skipped: 0, Time elapsed: 134.793 sec - in org.apache.hadoop.io.compress.TestCodec
Running org.apache.hadoop.io.compress.TestCompressorStream
Tests run: 1, Failures: 0, Errors: 0, Skipped: 0, Time elapsed: 0.078 sec - in org.apache.hadoop.io.compress.TestCompressorStream
Running org.apache.hadoop.io.compress.TestCompressorDecompressor
Tests run: 2, Failures: 0, Errors: 0, Skipped: 0, Time elapsed: 0.628 sec - in org.apache.hadoop.io.compress.TestCompressorDecompressor
Running org.apache.hadoop.io.compress.zlib.TestZlibCompressorDecompressor
Tests run: 8, Failures: 0, Errors: 0, Skipped: 0, Time elapsed: 1.127 sec - in org.apache.hadoop.io.compress.zlib.TestZlibCompressorDecompressor
Running org.apache.hadoop.io.compress.TestCodecFactory
Tests run: 1, Failures: 0, Errors: 0, Skipped: 0, Time elapsed: 0.534 sec - in org.apache.hadoop.io.compress.TestCodecFactory
Running org.apache.hadoop.io.compress.TestCompressionStreamReuse
Tests run: 3, Failures: 0, Errors: 0, Skipped: 0, Time elapsed: 4.058 sec - in org.apache.hadoop.io.compress.TestCompressionStreamReuse
Running org.apache.hadoop.io.compress.snappy.TestSnappyCompressorDecompressor
Tests run: 13, Failures: 0, Errors: 0, Skipped: 0, Time elapsed: 0.343 sec - in org.apache.hadoop.io.compress.snappy.TestSnappyCompressorDecompressor
Running org.apache.hadoop.io.serializer.TestSerializationFactory
Tests run: 5, Failures: 0, Errors: 0, Skipped: 0, Time elapsed: 0.513 sec - in org.apache.hadoop.io.serializer.TestSerializationFactory
Running org.apache.hadoop.io.serializer.avro.TestAvroSerialization
Tests run: 5, Failures: 0, Errors: 0, Skipped: 0, Time elapsed: 0.646 sec - in org.apache.hadoop.io.serializer.avro.TestAvroSerialization
Running org.apache.hadoop.io.serializer.TestWritableSerialization
Tests run: 3, Failures: 0, Errors: 0, Skipped: 0, Time elapsed: 0.375 sec - in org.apache.hadoop.io.serializer.TestWritableSerialization
Running org.apache.hadoop.io.TestGenericWritable
Tests run: 5, Failures: 0, Errors: 0, Skipped: 0, Time elapsed: 0.501 sec - in org.apache.hadoop.io.TestGenericWritable
Running org.apache.hadoop.io.TestText
Tests run: 18, Failures: 0, Errors: 0, Skipped: 0, Time elapsed: 0.718 sec - in org.apache.hadoop.io.TestText
Running org.apache.hadoop.io.file.tfile.TestTFileNoneCodecsStreams
Tests run: 19, Failures: 0, Errors: 0, Skipped: 0, Time elapsed: 1.733 sec - in org.apache.hadoop.io.file.tfile.TestTFileNoneCodecsStreams
Running org.apache.hadoop.io.file.tfile.TestTFileLzoCodecsByteArrays
Tests run: 25, Failures: 0, Errors: 0, Skipped: 0, Time elapsed: 0.905 sec - in org.apache.hadoop.io.file.tfile.TestTFileLzoCodecsByteArrays
Running org.apache.hadoop.io.file.tfile.TestTFileSeek
Tests run: 1, Failures: 0, Errors: 0, Skipped: 0, Time elapsed: 2.865 sec - in org.apache.hadoop.io.file.tfile.TestTFileSeek
Running org.apache.hadoop.io.file.tfile.TestTFileSplit
Tests run: 1, Failures: 0, Errors: 0, Skipped: 0, Time elapsed: 4.156 sec - in org.apache.hadoop.io.file.tfile.TestTFileSplit
Running org.apache.hadoop.io.file.tfile.TestTFileSeqFileComparison
Tests run: 1, Failures: 0, Errors: 0, Skipped: 0, Time elapsed: 3.704 sec - in org.apache.hadoop.io.file.tfile.TestTFileSeqFileComparison
Running org.apache.hadoop.io.file.tfile.TestTFileByteArrays
Tests run: 25, Failures: 0, Errors: 0, Skipped: 0, Time elapsed: 2.432 sec - in org.apache.hadoop.io.file.tfile.TestTFileByteArrays
Running org.apache.hadoop.io.file.tfile.TestTFileComparator2
Tests run: 1, Failures: 0, Errors: 0, Skipped: 0, Time elapsed: 1.553 sec - in org.apache.hadoop.io.file.tfile.TestTFileComparator2
Running org.apache.hadoop.io.file.tfile.TestTFileNoneCodecsByteArrays
Tests run: 25, Failures: 0, Errors: 0, Skipped: 0, Time elapsed: 1.351 sec - in org.apache.hadoop.io.file.tfile.TestTFileNoneCodecsByteArrays
Running org.apache.hadoop.io.file.tfile.TestTFileNoneCodecsJClassComparatorByteArrays
Tests run: 25, Failures: 0, Errors: 0, Skipped: 0, Time elapsed: 1.365 sec - in org.apache.hadoop.io.file.tfile.TestTFileNoneCodecsJClassComparatorByteArrays
Running org.apache.hadoop.io.file.tfile.TestTFileJClassComparatorByteArrays
Tests run: 25, Failures: 0, Errors: 0, Skipped: 0, Time elapsed: 2.712 sec - in org.apache.hadoop.io.file.tfile.TestTFileJClassComparatorByteArrays
Running org.apache.hadoop.io.file.tfile.TestTFileLzoCodecsStreams
Tests run: 19, Failures: 0, Errors: 0, Skipped: 0, Time elapsed: 0.347 sec - in org.apache.hadoop.io.file.tfile.TestTFileLzoCodecsStreams
Running org.apache.hadoop.io.file.tfile.TestTFileComparators
Tests run: 3, Failures: 0, Errors: 0, Skipped: 0, Time elapsed: 0.734 sec - in org.apache.hadoop.io.file.tfile.TestTFileComparators
Running org.apache.hadoop.io.file.tfile.TestTFileStreams
Tests run: 19, Failures: 0, Errors: 0, Skipped: 0, Time elapsed: 1.856 sec - in org.apache.hadoop.io.file.tfile.TestTFileStreams
Running org.apache.hadoop.io.file.tfile.TestTFileUnsortedByteArrays
Tests run: 4, Failures: 0, Errors: 0, Skipped: 0, Time elapsed: 0.867 sec - in org.apache.hadoop.io.file.tfile.TestTFileUnsortedByteArrays
Running org.apache.hadoop.io.file.tfile.TestVLong
Tests run: 9, Failures: 0, Errors: 0, Skipped: 0, Time elapsed: 1.641 sec - in org.apache.hadoop.io.file.tfile.TestVLong
Running org.apache.hadoop.io.file.tfile.TestTFile
Tests run: 3, Failures: 0, Errors: 0, Skipped: 0, Time elapsed: 1.267 sec - in org.apache.hadoop.io.file.tfile.TestTFile
Running org.apache.hadoop.io.TestObjectWritableProtos
Tests run: 3, Failures: 0, Errors: 0, Skipped: 0, Time elapsed: 0.312 sec - in org.apache.hadoop.io.TestObjectWritableProtos
Running org.apache.hadoop.io.TestArrayWritable
Tests run: 4, Failures: 0, Errors: 0, Skipped: 0, Time elapsed: 0.181 sec - in org.apache.hadoop.io.TestArrayWritable
Running org.apache.hadoop.io.TestSequenceFileSerialization
Tests run: 1, Failures: 0, Errors: 0, Skipped: 0, Time elapsed: 0.78 sec - in org.apache.hadoop.io.TestSequenceFileSerialization
Running org.apache.hadoop.io.TestArrayFile
Tests run: 3, Failures: 0, Errors: 0, Skipped: 0, Time elapsed: 2.921 sec - in org.apache.hadoop.io.TestArrayFile

Results :

Tests run: 2960, Failures: 0, Errors: 0, Skipped: 83

[INFO] ------------------------------------------------------------------------
[INFO] Reactor Summary:
[INFO] 
[INFO] Apache Hadoop Annotations ......................... SUCCESS [  9.484 s]
[INFO] Apache Hadoop MiniKDC ............................. SUCCESS [ 14.594 s]
[INFO] Apache Hadoop Auth ................................ SUCCESS [05:09 min]
[INFO] Apache Hadoop Auth Examples ....................... SUCCESS [  5.048 s]
[INFO] Apache Hadoop Common .............................. FAILURE [23:01 min]
[INFO] Apache Hadoop NFS ................................. SKIPPED
[INFO] Apache Hadoop KMS ................................. SKIPPED
[INFO] Apache Hadoop Common Project ...................... SKIPPED
[INFO] ------------------------------------------------------------------------
[INFO] BUILD FAILURE
[INFO] ------------------------------------------------------------------------
[INFO] Total time: 28:42 min
[INFO] Finished at: 2015-03-03T09:31:56+00:00
[INFO] Final Memory: 84M/896M
[INFO] ------------------------------------------------------------------------
[ERROR] Failed to execute goal org.apache.maven.plugins:maven-surefire-plugin:2.17:test (default-test)
on project hadoop-common: ExecutionException: java.lang.RuntimeException: The forked VM terminated
without properly saying goodbye. VM crash or System.exit called?
[ERROR] Command was /bin/sh -c cd <https://builds.apache.org/job/Hadoop-Common-trunk/ws/hadoop-common-project/hadoop-common>
&& /home/jenkins/tools/java/jdk1.7.0_55/jre/bin/java -Xmx4096m -XX:MaxPermSize=768m
-XX:+HeapDumpOnOutOfMemoryError -jar <https://builds.apache.org/job/Hadoop-Common-trunk/ws/hadoop-common-project/hadoop-common/target/surefire/surefirebooter5212887974710930376.jar>
<https://builds.apache.org/job/Hadoop-Common-trunk/ws/hadoop-common-project/hadoop-common/target/surefire/surefire6108487794533362903tmp>
<https://builds.apache.org/job/Hadoop-Common-trunk/ws/hadoop-common-project/hadoop-common/target/surefire/surefire_2265729369030466264722tmp>
[ERROR] -> [Help 1]
[ERROR] 
[ERROR] To see the full stack trace of the errors, re-run Maven with the -e switch.
[ERROR] Re-run Maven using the -X switch to enable full debug logging.
[ERROR] 
[ERROR] For more information about the errors and possible solutions, please read the following
articles:
[ERROR] [Help 1] http://cwiki.apache.org/confluence/display/MAVEN/MojoFailureException
[ERROR] 
[ERROR] After correcting the problems, you can resume the build with the command
[ERROR]   mvn <goals> -rf :hadoop-common
result: 1
Build step 'Execute shell' marked build as failure
Archiving artifacts
Recording test results

Mime
View raw message