hadoop-mapreduce-dev mailing list archives

Site index · List index
Message view « Date » · « Thread »
Top « Date » · « Thread »
From Apache Jenkins Server <jenk...@builds.apache.org>
Subject Hadoop-Mapreduce-trunk - Build # 1314 - Still Failing
Date Tue, 15 Jan 2013 13:20:58 GMT
See https://builds.apache.org/job/Hadoop-Mapreduce-trunk/1314/

###################################################################################
########################## LAST 60 LINES OF THE CONSOLE ###########################
[...truncated 27345 lines...]

Results :

Failed tests:   testUberDecision(org.apache.hadoop.mapreduce.v2.app.job.impl.TestJobImpl)

Tests run: 204, Failures: 1, Errors: 0, Skipped: 0

[INFO] ------------------------------------------------------------------------
[INFO] Reactor Summary:
[INFO] 
[INFO] hadoop-mapreduce-client ........................... SUCCESS [1.692s]
[INFO] hadoop-mapreduce-client-core ...................... SUCCESS [22.725s]
[INFO] hadoop-mapreduce-client-common .................... SUCCESS [23.106s]
[INFO] hadoop-mapreduce-client-shuffle ................... SUCCESS [1.638s]
[INFO] hadoop-mapreduce-client-app ....................... FAILURE [4:51.315s]
[INFO] hadoop-mapreduce-client-hs ........................ SKIPPED
[INFO] hadoop-mapreduce-client-jobclient ................. SKIPPED
[INFO] hadoop-mapreduce-client-hs-plugins ................ SKIPPED
[INFO] Apache Hadoop MapReduce Examples .................. SKIPPED
[INFO] hadoop-mapreduce .................................. SKIPPED
[INFO] ------------------------------------------------------------------------
[INFO] BUILD FAILURE
[INFO] ------------------------------------------------------------------------
[INFO] Total time: 5:41.049s
[INFO] Finished at: Tue Jan 15 13:20:47 UTC 2013
[INFO] Final Memory: 21M/253M
[INFO] ------------------------------------------------------------------------
[ERROR] Failed to execute goal org.apache.maven.plugins:maven-surefire-plugin:2.12.3:test
(default-test) on project hadoop-mapreduce-client-app: There are test failures.
[ERROR] 
[ERROR] Please refer to /home/jenkins/jenkins-slave/workspace/Hadoop-Mapreduce-trunk/trunk/hadoop-mapreduce-project/hadoop-mapreduce-client/hadoop-mapreduce-client-app/target/surefire-reports
for the individual test results.
[ERROR] -> [Help 1]
[ERROR] 
[ERROR] To see the full stack trace of the errors, re-run Maven with the -e switch.
[ERROR] Re-run Maven using the -X switch to enable full debug logging.
[ERROR] 
[ERROR] For more information about the errors and possible solutions, please read the following
articles:
[ERROR] [Help 1] http://cwiki.apache.org/confluence/display/MAVEN/MojoFailureException
[ERROR] 
[ERROR] After correcting the problems, you can resume the build with the command
[ERROR]   mvn <goals> -rf :hadoop-mapreduce-client-app
Build step 'Execute shell' marked build as failure
[FINDBUGS] Skipping publisher since build result is FAILURE
Archiving artifacts
Updating YARN-334
Updating HADOOP-9097
Updating HDFS-4364
Updating HADOOP-9203
Updating MAPREDUCE-4938
Updating HDFS-4375
Updating HDFS-3429
Updating HADOOP-9178
Updating HDFS-4385
Updating HADOOP-9202
Updating MAPREDUCE-4934
Updating YARN-330
Updating HDFS-4369
Updating YARN-328
Email was triggered for: Failure
Sending email for trigger: Failure



###################################################################################
############################## FAILED TESTS (if any) ##############################
No tests ran.
Mime
  • Unnamed multipart/mixed (inline, None, 0 bytes)
View raw message