hadoop-mapreduce-dev mailing list archives

Site index · List index
Message view « Date » · « Thread »
Top « Date » · « Thread »
From Apache Jenkins Server <jenk...@builds.apache.org>
Subject Hadoop-Mapreduce-trunk - Build # 1309 - Still Failing
Date Thu, 10 Jan 2013 13:21:03 GMT
See https://builds.apache.org/job/Hadoop-Mapreduce-trunk/1309/

###################################################################################
########################## LAST 60 LINES OF THE CONSOLE ###########################
[...truncated 28664 lines...]
Tests run: 3, Failures: 0, Errors: 0, Skipped: 0, Time elapsed: 12.9 sec
Running org.apache.hadoop.mapreduce.jobhistory.TestJobHistoryEventHandler
Tests run: 5, Failures: 0, Errors: 0, Skipped: 0, Time elapsed: 10.103 sec

Results :

Failed tests:   testUberDecision(org.apache.hadoop.mapreduce.v2.app.job.impl.TestJobImpl)

Tests run: 204, Failures: 1, Errors: 0, Skipped: 0

[INFO] ------------------------------------------------------------------------
[INFO] Reactor Summary:
[INFO] 
[INFO] hadoop-mapreduce-client ........................... SUCCESS [1.662s]
[INFO] hadoop-mapreduce-client-core ...................... SUCCESS [20.311s]
[INFO] hadoop-mapreduce-client-common .................... SUCCESS [23.996s]
[INFO] hadoop-mapreduce-client-shuffle ................... SUCCESS [1.631s]
[INFO] hadoop-mapreduce-client-app ....................... FAILURE [4:51.456s]
[INFO] hadoop-mapreduce-client-hs ........................ SKIPPED
[INFO] hadoop-mapreduce-client-jobclient ................. SKIPPED
[INFO] hadoop-mapreduce-client-hs-plugins ................ SKIPPED
[INFO] Apache Hadoop MapReduce Examples .................. SKIPPED
[INFO] hadoop-mapreduce .................................. SKIPPED
[INFO] ------------------------------------------------------------------------
[INFO] BUILD FAILURE
[INFO] ------------------------------------------------------------------------
[INFO] Total time: 5:39.634s
[INFO] Finished at: Thu Jan 10 13:20:53 UTC 2013
[INFO] Final Memory: 21M/211M
[INFO] ------------------------------------------------------------------------
[ERROR] Failed to execute goal org.apache.maven.plugins:maven-surefire-plugin:2.12.3:test
(default-test) on project hadoop-mapreduce-client-app: There are test failures.
[ERROR] 
[ERROR] Please refer to /home/jenkins/jenkins-slave/workspace/Hadoop-Mapreduce-trunk/trunk/hadoop-mapreduce-project/hadoop-mapreduce-client/hadoop-mapreduce-client-app/target/surefire-reports
for the individual test results.
[ERROR] -> [Help 1]
[ERROR] 
[ERROR] To see the full stack trace of the errors, re-run Maven with the -e switch.
[ERROR] Re-run Maven using the -X switch to enable full debug logging.
[ERROR] 
[ERROR] For more information about the errors and possible solutions, please read the following
articles:
[ERROR] [Help 1] http://cwiki.apache.org/confluence/display/MAVEN/MojoFailureException
[ERROR] 
[ERROR] After correcting the problems, you can resume the build with the command
[ERROR]   mvn <goals> -rf :hadoop-mapreduce-client-app
Build step 'Execute shell' marked build as failure
[FINDBUGS] Skipping publisher since build result is FAILURE
Archiving artifacts
Updating HADOOP-9183
Updating MAPREDUCE-1700
Updating HDFS-4306
Updating YARN-325
Updating YARN-320
Updating HADOOP-9155
Updating HDFS-4363
Updating HDFS-4032
Updating MAPREDUCE-4848
Updating MAPREDUCE-4907
Updating HDFS-4261
Email was triggered for: Failure
Sending email for trigger: Failure



###################################################################################
############################## FAILED TESTS (if any) ##############################
No tests ran.
Mime
  • Unnamed multipart/mixed (inline, None, 0 bytes)
View raw message