hadoop-mapreduce-dev mailing list archives

Site index · List index
Message view « Date » · « Thread »
Top « Date » · « Thread »
From Apache Jenkins Server <jenk...@builds.apache.org>
Subject Hadoop-Mapreduce-trunk - Build # 1546 - Still Failing
Date Thu, 12 Sep 2013 14:06:34 GMT
See https://builds.apache.org/job/Hadoop-Mapreduce-trunk/1546/

###################################################################################
########################## LAST 60 LINES OF THE CONSOLE ###########################
[...truncated 33671 lines...]
  TestChainErrors.testReducerFail:121 » Connect Call From asf007.sp2.ygridcore.n...
  TestChainErrors.testChainMapNoOuptut:146 » Connect Call From asf007.sp2.ygridc...
  TestChainErrors.testChainReduceNoOuptut:170 » Connect Call From asf007.sp2.ygr...
  TestMapReduceChain.testChain:73->cleanFlags:42 » Connect Call From asf007.sp2....
  TestSingleElementChain.testNoChain:53 » Connect Call From asf007.sp2.ygridcore...
  TestMRFieldSelection.testFieldSelection:38->launch:59 » Connect Call From asf0...
  TestMapReduceJobControl.testJobControlWithFailJob:122->cleanupData:59 » Connect
  TestMapReduceJobControl.testJobControlWithKillJob:143->cleanupData:59 » Connect
  TestMapReduceJobControl.testJobControl:180->cleanupData:59 » Connect Call From...
  TestMapReduceJobControl.testControlledJob:197->cleanupData:59 » Connect Call F...
  TestMapReduceAggregates.testAggregates:46->launch:57 » Connect Call >From asf00...
  TestMultithreadedMapper.testOKRun:37->run:61 » Connect Call From asf007.sp2.yg...
  TestMultithreadedMapper.testIOExRun:41->run:61 » Connect Call From asf007.sp2....
  TestMultithreadedMapper.testRuntimeExRun:44->run:61 » Connect Call From asf007...
  TestMRKeyFieldBasedComparator.testBasicUnixComparator:98->testComparator:59 » Connect
  TestChild.testChild:151->submitAndValidateJob:133 » Connect Call From asf007.s...
  TestMapReduce.testMapred:219->launch:265->printFiles:468 » Connect Call From a...

Tests run: 447, Failures: 6, Errors: 82, Skipped: 11

[INFO] ------------------------------------------------------------------------
[INFO] Reactor Summary:
[INFO] 
[INFO] hadoop-mapreduce-client ........................... SUCCESS [1.731s]
[INFO] hadoop-mapreduce-client-core ...................... SUCCESS [39.313s]
[INFO] hadoop-mapreduce-client-common .................... SUCCESS [25.653s]
[INFO] hadoop-mapreduce-client-shuffle ................... SUCCESS [2.320s]
[INFO] hadoop-mapreduce-client-app ....................... SUCCESS [6:23.507s]
[INFO] hadoop-mapreduce-client-hs ........................ SUCCESS [1:43.565s]
[INFO] hadoop-mapreduce-client-jobclient ................. FAILURE [39:19.653s]
[INFO] hadoop-mapreduce-client-hs-plugins ................ SKIPPED
[INFO] Apache Hadoop MapReduce Examples .................. SKIPPED
[INFO] hadoop-mapreduce .................................. SKIPPED
[INFO] ------------------------------------------------------------------------
[INFO] BUILD FAILURE
[INFO] ------------------------------------------------------------------------
[INFO] Total time: 48:36.404s
[INFO] Finished at: Thu Sep 12 14:06:30 UTC 2013
[INFO] Final Memory: 20M/125M
[INFO] ------------------------------------------------------------------------
[ERROR] Failed to execute goal org.apache.maven.plugins:maven-surefire-plugin:2.16:test (default-test)
on project hadoop-mapreduce-client-jobclient: ExecutionException; nested exception is java.util.concurrent.ExecutionException:
java.lang.RuntimeException: The forked VM terminated without saying properly goodbye. VM crash
or System.exit called ?
[ERROR] Command was/bin/sh -c cd /home/jenkins/jenkins-slave/workspace/Hadoop-Mapreduce-trunk/trunk/hadoop-mapreduce-project/hadoop-mapreduce-client/hadoop-mapreduce-client-jobclient
&& /home/jenkins/tools/java/jdk1.6.0_26/jre/bin/java -Xmx1024m -XX:+HeapDumpOnOutOfMemoryError
-jar /home/jenkins/jenkins-slave/workspace/Hadoop-Mapreduce-trunk/trunk/hadoop-mapreduce-project/hadoop-mapreduce-client/hadoop-mapreduce-client-jobclient/target/surefire/surefirebooter802443663360678935.jar
/home/jenkins/jenkins-slave/workspace/Hadoop-Mapreduce-trunk/trunk/hadoop-mapreduce-project/hadoop-mapreduce-client/hadoop-mapreduce-client-jobclient/target/surefire/surefire1056591057948067772tmp
/home/jenkins/jenkins-slave/workspace/Hadoop-Mapreduce-trunk/trunk/hadoop-mapreduce-project/hadoop-mapreduce-client/hadoop-mapreduce-client-jobclient/target/surefire/surefire_1066970380171899207084tmp
[ERROR] -> [Help 1]
[ERROR] 
[ERROR] To see the full stack trace of the errors, re-run Maven with the -e switch.
[ERROR] Re-run Maven using the -X switch to enable full debug logging.
[ERROR] 
[ERROR] For more information about the errors and possible solutions, please read the following
articles:
[ERROR] [Help 1] http://cwiki.apache.org/confluence/display/MAVEN/MojoFailureException
[ERROR] 
[ERROR] After correcting the problems, you can resume the build with the command
[ERROR]   mvn <goals> -rf :hadoop-mapreduce-client-jobclient
Build step 'Execute shell' marked build as failure
[FINDBUGS] Skipping publisher since build result is FAILURE
Archiving artifacts
Updating HDFS-4680
Updating YARN-1176
Email was triggered for: Failure
Sending email for trigger: Failure



###################################################################################
############################## FAILED TESTS (if any) ##############################
No tests ran.
Mime
  • Unnamed multipart/mixed (inline, None, 0 bytes)
View raw message